{
  "host": "127.0.0.1",
  "port": 8080,
  "coinapi_key": "E810CA7F-24D9-475D-950D-34FC39F67C8E",
  "heartbeat_timeout": 2000,
  "db_name": "koin",
  "metadata": {
    "update_period_h": 24,
    "exchanges_col": "exchanges",
    "assets_col": "assets",
    "symbols_col": "symbols",
    "exchanges": [
      "BITSTAMP",
      "COINBASE",
      "COINCHECK",
      "COINMATE",
      "COINNEST",
      "COINONE",
      "CRYPTOPIA",
      "EXMO",
      "GATECOIN",
      "COINMATE",
      "BTCCHINA",
      "INDEPENDENTRESERVE",
      "COINFLOOR",
      "DSX",
      "ABUCOINS",
      "SOUTHXCHANGE",
      "BTCTRADEUA"
    ],
    "bases": ["BTC", "ETH", "USD", "EUR", "LTC", "USDT", "BCH", "XMR", "ETC", "DOGE", "RUB", "JPY", "GBP"],
    "quotes": ["USD", "EUR", "BTC", "ETH", "LTC", "USDT", "BCH", "XMR", "ETC", "DOGE", "RUB", "JPY", "GBP"]
  },
  "rt_stats": {
    "collection": "rt_stats",
    "period": "1DAY"
  },
  "ohlcv_history": {
    "collection": "ohclv_h"
  },
  "trades": {
    "expire_time_ms": 3600000,
    "min_trades_count": 100,
    "24h_ago_update_interval": 1000
  },
  "books": {
    "rest_api_preload": true
  },
  "expire_check_period_ms": 1000
}
