{
	"endpoints": {
		"local": {
			"HTTP_ENDPOINT": "http://localhost:9090",
			"WS_ENDPOINT": "ws://localhost:8080"
		},
		"remote": {
			"HTTP_ENDPOINT": "http://142.93.241.242:9090",
			"WS_ENDPOINT": "ws://142.93.241.242:8080"
		}
	},
	"ENDPOINT": "remote",
	"TRADES_LIMIT": 1000,
	"GRID_UPDATE": 100,
	"GRID_REFRESH": 1000,
	"RESOLUTIONS": ["60"]
}