EESchema Schematic File Version 4
LIBS:Matching_PCB-cache
EELAYER 30 0
EELAYER END
$Descr A4 11693 8268
encoding utf-8
Sheet 1 1
Title "UHF Antenna Matching Circuit"
Date ""
Rev "1.0"
Comp "A.S.A.T."
Comment1 ""
Comment2 ""
Comment3 ""
Comment4 ""
$EndDescr
$Comp
L Schematic_Symbol:CablePad P1
U 1 1 5DD8A179
P 2500 2450
F 0 "P1" H 2558 2568 50  0000 L CNN
F 1 "CablePad" H 2558 2477 50  0000 L CNN
F 2 "Matching_PCB:TestPoint_Pad_D1.0mm" H 2700 2450 50  0001 C CNN
F 3 "~" H 2700 2450 50  0001 C CNN
	1    2500 2450
	0    -1   -1   0   
$EndComp
$Comp
L Schematic_Symbol:CablePad P3
U 1 1 5DD8AFC7
P 2600 3300
F 0 "P3" H 2542 3326 50  0000 R CNN
F 1 "CablePad" H 2542 3417 50  0000 R CNN
F 2 "Matching_PCB:TestPoint_Pad_D1.0mm" H 2800 3300 50  0001 C CNN
F 3 "~" H 2800 3300 50  0001 C CNN
	1    2600 3300
	-1   0    0    1   
$EndComp
$Comp
L Schematic_Symbol:L L1
U 1 1 5DD8BC60
P 3300 2100
F 0 "L1" V 3119 2100 50  0000 C CNN
F 1 "17n" V 3210 2100 50  0000 C CNN
F 2 "Matching_PCB:L_0402_1005Metric" H 3300 2100 50  0001 C CNN
F 3 "~" H 3300 2100 50  0001 C CNN
	1    3300 2100
	0    1    1    0   
$EndComp
$Comp
L Schematic_Symbol:L L3
U 1 1 5DD8C515
P 3850 3000
F 0 "L3" H 3806 2954 50  0000 R CNN
F 1 "17n" H 3806 3045 50  0000 R CNN
F 2 "Matching_PCB:L_0402_1005Metric" H 3850 3000 50  0001 C CNN
F 3 "~" H 3850 3000 50  0001 C CNN
	1    3850 3000
	-1   0    0    1   
$EndComp
$Comp
L Schematic_Symbol:L L6
U 1 1 5DD8DD7F
P 5400 2250
F 0 "L6" H 5357 2204 50  0000 R CNN
F 1 "250n" H 5357 2295 50  0000 R CNN
F 2 "Matching_PCB:L_0402_1005Metric" H 5400 2250 50  0001 C CNN
F 3 "~" H 5400 2250 50  0001 C CNN
	1    5400 2250
	-1   0    0    1   
$EndComp
$Comp
L Schematic_Symbol:CP1 C1
U 1 1 5DD93D54
P 3300 2850
F 0 "C1" V 3048 2850 50  0000 C CNN
F 1 "7.8p" V 3139 2850 50  0000 C CNN
F 2 "Matching_PCB:C_0402_1005Metric" H 3300 2850 50  0001 C CNN
F 3 "~" H 3300 2850 50  0001 C CNN
	1    3300 2850
	0    -1   -1   0   
$EndComp
$Comp
L Schematic_Symbol:CP1 C3
U 1 1 5DD948C9
P 3850 2250
F 0 "C3" H 3965 2296 50  0000 L CNN
F 1 "7.8p" H 3965 2205 50  0000 L CNN
F 2 "Matching_PCB:C_0402_1005Metric" H 3850 2250 50  0001 C CNN
F 3 "~" H 3850 2250 50  0001 C CNN
	1    3850 2250
	1    0    0    -1  
$EndComp
$Comp
L Schematic_Symbol:R R1
U 1 1 5DD966FA
P 5850 2450
F 0 "R1" H 5920 2496 50  0000 L CNN
F 1 "43.7" H 5920 2405 50  0000 L CNN
F 2 "Matching_PCB:R_0402_1005Metric" V 5780 2450 50  0001 C CNN
F 3 "~" H 5850 2450 50  0001 C CNN
	1    5850 2450
	1    0    0    -1  
$EndComp
$Comp
L Schematic_Symbol:AntennaPad P5
U 1 1 5DD96E60
P 6550 2100
F 0 "P5" V 6499 2078 50  0000 L CNN
F 1 "AntennaPad" V 6590 2078 50  0000 L CNN
F 2 "Matching_PCB:SolderWirePad_1x01_SMD_5x10mm" H 6550 2100 50  0001 C CNN
F 3 "" H 6550 2100 50  0001 C CNN
	1    6550 2100
	0    1    1    0   
$EndComp
$Comp
L Schematic_Symbol:AntennaPad P6
U 1 1 5DD975CD
P 6550 2850
F 0 "P6" V 6499 2828 50  0000 L CNN
F 1 "AntennaPad" V 6590 2828 50  0000 L CNN
F 2 "Matching_PCB:SolderWirePad_1x01_SMD_5x10mm" H 6550 2850 50  0001 C CNN
F 3 "" H 6550 2850 50  0001 C CNN
	1    6550 2850
	0    1    1    0   
$EndComp
Wire Wire Line
	2500 2100 3150 2100
Wire Wire Line
	3450 2100 3850 2100
Wire Wire Line
	3850 3250 3850 3150
$Comp
L power:GND #PWR03
U 1 1 5DDADE85
P 3850 2400
F 0 "#PWR03" H 3850 2150 50  0001 C CNN
F 1 "GND" H 3855 2227 50  0000 C CNN
F 2 "" H 3850 2400 50  0001 C CNN
F 3 "" H 3850 2400 50  0001 C CNN
	1    3850 2400
	1    0    0    -1  
$EndComp
Wire Wire Line
	3150 2850 2500 2850
Wire Wire Line
	2500 2850 2500 2450
Wire Wire Line
	3450 2850 3850 2850
Connection ~ 2500 2450
Wire Wire Line
	2500 2450 2500 2100
Wire Wire Line
	5850 2300 5850 2100
Connection ~ 5850 2100
Wire Wire Line
	5850 2100 6250 2100
Wire Wire Line
	5850 2600 5850 2850
Connection ~ 5850 2850
Wire Wire Line
	5850 2850 6250 2850
$Comp
L power:GND #PWR01
U 1 1 5DDB6B90
P 2600 3300
F 0 "#PWR01" H 2600 3050 50  0001 C CNN
F 1 "GND" V 2605 3172 50  0000 R CNN
F 2 "" H 2600 3300 50  0001 C CNN
F 3 "" H 2600 3300 50  0001 C CNN
	1    2600 3300
	0    1    1    0   
$EndComp
$Comp
L Schematic_Symbol:CablePad P2
U 1 1 5DDC10B4
P 2500 4500
F 0 "P2" H 2558 4618 50  0000 L CNN
F 1 "CablePad" H 2558 4527 50  0000 L CNN
F 2 "Matching_PCB:TestPoint_Pad_D1.0mm" H 2700 4500 50  0001 C CNN
F 3 "~" H 2700 4500 50  0001 C CNN
	1    2500 4500
	0    -1   -1   0   
$EndComp
$Comp
L Schematic_Symbol:CablePad P4
U 1 1 5DDC10BA
P 2600 5350
F 0 "P4" H 2542 5376 50  0000 R CNN
F 1 "CablePad" H 2542 5467 50  0000 R CNN
F 2 "Matching_PCB:TestPoint_Pad_D1.0mm" H 2800 5350 50  0001 C CNN
F 3 "~" H 2800 5350 50  0001 C CNN
	1    2600 5350
	-1   0    0    1   
$EndComp
$Comp
L Schematic_Symbol:L L2
U 1 1 5DDC10C0
P 3300 4150
F 0 "L2" V 3119 4150 50  0000 C CNN
F 1 "0.3n" V 3210 4150 50  0000 C CNN
F 2 "Matching_PCB:L_0402_1005Metric" H 3300 4150 50  0001 C CNN
F 3 "~" H 3300 4150 50  0001 C CNN
	1    3300 4150
	0    1    1    0   
$EndComp
$Comp
L Schematic_Symbol:CP1 C2
U 1 1 5DDC10D2
P 3300 4900
F 0 "C2" V 3048 4900 50  0000 C CNN
F 1 "5.2p" V 3139 4900 50  0000 C CNN
F 2 "Matching_PCB:C_0402_1005Metric" H 3300 4900 50  0001 C CNN
F 3 "~" H 3300 4900 50  0001 C CNN
	1    3300 4900
	0    -1   -1   0   
$EndComp
$Comp
L Schematic_Symbol:CP1 C4
U 1 1 5DDC10D8
P 3850 4300
F 0 "C4" H 3965 4346 50  0000 L CNN
F 1 "5.2p" H 3965 4255 50  0000 L CNN
F 2 "Matching_PCB:C_0402_1005Metric" H 3850 4300 50  0001 C CNN
F 3 "~" H 3850 4300 50  0001 C CNN
	1    3850 4300
	1    0    0    -1  
$EndComp
$Comp
L Schematic_Symbol:CP1 C6
U 1 1 5DDC10DE
P 4850 4500
F 0 "C6" H 4965 4546 50  0000 L CNN
F 1 "0.33p" H 4965 4455 50  0000 L CNN
F 2 "Matching_PCB:C_0402_1005Metric" H 4850 4500 50  0001 C CNN
F 3 "~" H 4850 4500 50  0001 C CNN
	1    4850 4500
	1    0    0    -1  
$EndComp
$Comp
L Schematic_Symbol:R R2
U 1 1 5DDC10E4
P 5300 4500
F 0 "R2" H 5370 4546 50  0000 L CNN
F 1 "97" H 5370 4455 50  0000 L CNN
F 2 "Matching_PCB:R_0402_1005Metric" V 5230 4500 50  0001 C CNN
F 3 "~" H 5300 4500 50  0001 C CNN
	1    5300 4500
	1    0    0    -1  
$EndComp
$Comp
L Schematic_Symbol:AntennaPad P7
U 1 1 5DDC10EA
P 5950 4150
F 0 "P7" V 5899 4128 50  0000 L CNN
F 1 "AntennaPad" V 5990 4128 50  0000 L CNN
F 2 "Matching_PCB:SolderWirePad_1x01_SMD_5x10mm" H 5950 4150 50  0001 C CNN
F 3 "" H 5950 4150 50  0001 C CNN
	1    5950 4150
	0    1    1    0   
$EndComp
$Comp
L Schematic_Symbol:AntennaPad P8
U 1 1 5DDC10F0
P 5950 4900
F 0 "P8" V 5899 4878 50  0000 L CNN
F 1 "AntennaPad" V 5990 4878 50  0000 L CNN
F 2 "Matching_PCB:SolderWirePad_1x01_SMD_5x10mm" H 5950 4900 50  0001 C CNN
F 3 "" H 5950 4900 50  0001 C CNN
	1    5950 4900
	0    1    1    0   
$EndComp
Wire Wire Line
	3450 4150 3850 4150
Connection ~ 3850 4150
$Comp
L power:GND #PWR05
U 1 1 5DDC10FB
P 3850 4450
F 0 "#PWR05" H 3850 4200 50  0001 C CNN
F 1 "GND" H 3855 4277 50  0000 C CNN
F 2 "" H 3850 4450 50  0001 C CNN
F 3 "" H 3850 4450 50  0001 C CNN
	1    3850 4450
	1    0    0    -1  
$EndComp
Wire Wire Line
	3150 4900 2500 4900
Wire Wire Line
	2500 4900 2500 4500
Wire Wire Line
	4850 4650 4850 4900
Wire Wire Line
	4850 4350 4850 4150
Connection ~ 2500 4500
Wire Wire Line
	2500 4500 2500 4150
Wire Wire Line
	5300 4350 5300 4150
Wire Wire Line
	5300 4650 5300 4900
$Comp
L power:GND #PWR06
U 1 1 5DDC111A
P 3750 5500
F 0 "#PWR06" H 3750 5250 50  0001 C CNN
F 1 "GND" H 3755 5327 50  0000 C CNN
F 2 "" H 3750 5500 50  0001 C CNN
F 3 "" H 3750 5500 50  0001 C CNN
	1    3750 5500
	1    0    0    -1  
$EndComp
$Comp
L power:GND #PWR02
U 1 1 5DDC1120
P 2600 5350
F 0 "#PWR02" H 2600 5100 50  0001 C CNN
F 1 "GND" V 2605 5222 50  0000 R CNN
F 2 "" H 2600 5350 50  0001 C CNN
F 3 "" H 2600 5350 50  0001 C CNN
	1    2600 5350
	0    1    1    0   
$EndComp
Connection ~ 4850 4150
Connection ~ 4850 4900
$Comp
L power:PWR_FLAG #FLG0101
U 1 1 5DDC47EB
P 2600 3300
F 0 "#FLG0101" H 2600 3375 50  0001 C CNN
F 1 "PWR_FLAG" H 2600 3473 50  0000 C CNN
F 2 "" H 2600 3300 50  0001 C CNN
F 3 "~" H 2600 3300 50  0001 C CNN
	1    2600 3300
	1    0    0    -1  
$EndComp
Connection ~ 2600 3300
$Comp
L power:GND #PWR0101
U 1 1 5DDD9BB7
P 3850 3250
F 0 "#PWR0101" H 3850 3000 50  0001 C CNN
F 1 "GND" H 3855 3077 50  0000 C CNN
F 2 "" H 3850 3250 50  0001 C CNN
F 3 "" H 3850 3250 50  0001 C CNN
	1    3850 3250
	1    0    0    -1  
$EndComp
$Comp
L Schematic_Symbol:CP1 C5
U 1 1 5DD95F11
P 4300 2450
F 0 "C5" H 4415 2496 50  0000 L CNN
F 1 "0.51p" H 4415 2405 50  0000 L CNN
F 2 "Matching_PCB:C_0402_1005Metric" H 4300 2450 50  0001 C CNN
F 3 "~" H 4300 2450 50  0001 C CNN
	1    4300 2450
	1    0    0    -1  
$EndComp
$Comp
L Schematic_Symbol:CP1 C7
U 1 1 5DDDE933
P 4900 2450
F 0 "C7" H 5015 2496 50  0000 L CNN
F 1 "0.01p" H 5015 2405 50  0000 L CNN
F 2 "Matching_PCB:C_0402_1005Metric" H 4900 2450 50  0001 C CNN
F 3 "~" H 4900 2450 50  0001 C CNN
	1    4900 2450
	1    0    0    -1  
$EndComp
Wire Wire Line
	3850 2100 4600 2100
Connection ~ 3850 2100
Wire Wire Line
	3850 2850 4600 2850
Connection ~ 3850 2850
Wire Wire Line
	4300 2300 4600 2300
Wire Wire Line
	4300 2600 4600 2600
Wire Wire Line
	4600 2300 4600 2100
Connection ~ 4600 2300
Wire Wire Line
	4600 2300 4900 2300
Wire Wire Line
	4600 2600 4600 2850
Connection ~ 4600 2600
Wire Wire Line
	4600 2600 4900 2600
Wire Wire Line
	5400 2100 5850 2100
$Comp
L Schematic_Symbol:L L10
U 1 1 5DDF1F9E
P 5400 2700
F 0 "L10" H 5357 2654 50  0000 R CNN
F 1 "3.7n" H 5357 2745 50  0000 R CNN
F 2 "Matching_PCB:L_0402_1005Metric" H 5400 2700 50  0001 C CNN
F 3 "~" H 5400 2700 50  0001 C CNN
	1    5400 2700
	-1   0    0    1   
$EndComp
Wire Wire Line
	5400 2850 5850 2850
Wire Wire Line
	5400 2400 5400 2550
Wire Wire Line
	4600 2100 5400 2100
Connection ~ 4600 2100
Connection ~ 5400 2100
Wire Wire Line
	4600 2850 5400 2850
Connection ~ 4600 2850
Connection ~ 5400 2850
Wire Wire Line
	3450 4900 3750 4900
$Comp
L Schematic_Symbol:L L4
U 1 1 5DDF6C19
P 3000 4150
F 0 "L4" V 2819 4150 50  0000 C CNN
F 1 "25n" V 2910 4150 50  0000 C CNN
F 2 "Matching_PCB:L_0402_1005Metric" H 3000 4150 50  0001 C CNN
F 3 "~" H 3000 4150 50  0001 C CNN
	1    3000 4150
	0    1    1    0   
$EndComp
$Comp
L Schematic_Symbol:L L7
U 1 1 5DDF7004
P 3750 5350
F 0 "L7" V 3569 5350 50  0000 C CNN
F 1 "25n" V 3660 5350 50  0000 C CNN
F 2 "Matching_PCB:L_0402_1005Metric" H 3750 5350 50  0001 C CNN
F 3 "~" H 3750 5350 50  0001 C CNN
	1    3750 5350
	-1   0    0    1   
$EndComp
$Comp
L Schematic_Symbol:L L5
U 1 1 5DDF7908
P 3750 5050
F 0 "L5" V 3569 5050 50  0000 C CNN
F 1 "0.3n" V 3660 5050 50  0000 C CNN
F 2 "Matching_PCB:L_0402_1005Metric" H 3750 5050 50  0001 C CNN
F 3 "~" H 3750 5050 50  0001 C CNN
	1    3750 5050
	-1   0    0    1   
$EndComp
Connection ~ 3750 4900
Wire Wire Line
	2500 4150 2850 4150
Wire Wire Line
	3850 4150 4500 4150
Wire Wire Line
	3750 4900 4500 4900
$Comp
L Schematic_Symbol:L L8
U 1 1 5DDFAA02
P 4500 4300
F 0 "L8" H 4457 4254 50  0000 R CNN
F 1 "250n" H 4457 4345 50  0000 R CNN
F 2 "Matching_PCB:L_0402_1005Metric" H 4500 4300 50  0001 C CNN
F 3 "~" H 4500 4300 50  0001 C CNN
	1    4500 4300
	-1   0    0    1   
$EndComp
$Comp
L Schematic_Symbol:L L9
U 1 1 5DDFAFB7
P 4500 4750
F 0 "L9" H 4457 4704 50  0000 R CNN
F 1 "3.7n" H 4457 4795 50  0000 R CNN
F 2 "Matching_PCB:L_0402_1005Metric" H 4500 4750 50  0001 C CNN
F 3 "~" H 4500 4750 50  0001 C CNN
	1    4500 4750
	-1   0    0    1   
$EndComp
Connection ~ 4500 4900
Wire Wire Line
	4500 4900 4850 4900
Connection ~ 4500 4150
Wire Wire Line
	4500 4150 4850 4150
Wire Wire Line
	4500 4450 4500 4600
Connection ~ 5300 4150
Wire Wire Line
	5300 4150 5650 4150
Connection ~ 5300 4900
Wire Wire Line
	5300 4900 5650 4900
Wire Wire Line
	4850 4150 5300 4150
Wire Wire Line
	4850 4900 5300 4900
$EndSCHEMATC
