{
    "current_page": 1,
    "data": [
        {
            "id": 2,
            "name": "Another User",
            "email": "user@example.com",
            "created_at": "2016-10-20T11:05:00.000000Z",
            "updated_at": "2016-10-20T11:05:00.000000Z",
            "role_id": 2
        },
        {
            "id": 1,
            "name": "Mr Admin",
            "email": "admin@example.com",
            "created_at": "2016-10-20T11:05:00.000000Z",
            "updated_at": "2016-10-20T11:05:00.000000Z",
            "role_id": 1
        }
    ],
    "first_page_url": "http:\/\/localhost\/users?page=1",
    "from": 1,
    "last_page": 1,
    "last_page_url": "http:\/\/localhost\/users?page=1",
    "next_page_url": null,
    "path": "http:\/\/localhost\/users",
    "per_page": 10,
    "prev_page_url": null,
    "to": 2,
    "total": 2
}