
{
  "products": [
    {
      "name": " Мобільний телефон Apple iPhone 11 128GB Black",
      "decription":"Екран (6.1', IPS (Liquid Retina HD), 1792x828) / Apple A13 Bionic / основна подвійна камера: 12 Мп + 12 Мп, фронтальна камера: 12 Мп / RAM 4 ГБ / 128 ГБ вбудованої пам'яті / 3G / LTE / GPS / ГЛОНАСС / Nano-SIM / iOS 13 / 3046 мА·год",
      "price": 700,
      "img_url": "https://content.rozetka.com.ua/goods/images/big/37399220.jpg",
      "id": "030110010",
      "category": "phones",
      "color": ["black", "blue"],
      "discount": 10
    },
    {
      "name": " Мобільний телефон Apple iPhone 14 128GB Midnight ",
      "decription":"Екран (6.1', OLED (Super Retina XDR), 2532x1170) / Apple A15 Bionic / подвійна основна камера: 12 Мп + 12 Мп, фронтальна камера: 12 Мп / 128 ГБ вбудованої пам'яті / 3G / LTE / 5G / GPS / підтримка 2 SIM-карток (eSIM) / iOS 16",
      "price": 1200,
      "img_url": "https://content1.rozetka.com.ua/goods/images/big/284913535.jpg",
      "id": "112001441",
      "category": "phones",
      "color": ["black", "red", "violet"],
      "discount": 5
    },
    {
      "name": "Мобільний телефон Apple iPhone 14 Pro 256GB Space Black",
      "decription": "Екран (6.1', OLED (Super Retina XDR), 2556x1179) / Apple A16 Bionic / основна квадро-камера: 48 Мп + 12 Мп + 12 Мп + 12 Мп, фронтальна камера: 12 Мп / 256 ГБ вбудованої пам'яті / 3G / LTE / 5G / GPS / Nano-SIM / iOS 16",
      "price": 1800,
      "img_url": "https://content2.rozetka.com.ua/goods/images/big/284920762.jpg",
      "id": "1610011",
      "category": "phones",
      "color": ["grey", "gold", "red", "orange"],
      "discount": 5
    },
    {
      "name": "Мобільний телефон Apple iPhone 13 256GB",
      "decription":"Екран (6.1', OLED (Super Retina XDR), 2532x1170) / Apple A15 Bionic / подвійна основна камера: 12 Мп + 12 Мп, фронтальна камера: 12 Мп / 256 ГБ вбудованої пам'яті / 3G / LTE / 5G / GPS / Nano-SIM, eSIM / iOS 15",
      "price": 1100,
      "img_url": "https://content.rozetka.com.ua/goods/images/big/221212817.jpg",
      "id": "00017111",
      "category": "phones",
      "color": ["red"]
    },
    {
      "name": "Мобільний телефон Apple iPhone 12 128GB Purple",
      "decription":"Екран (6.1', OLED (Super Retina XDR), 2532x1170) / Apple A14 Bionic / подвійна основна камера: 12 Мп + 12 Мп, фронтальна камера: 12 Мп / 128 ГБ вбудованої пам'яті / 3G / LTE / 5G / GPS / Nano-SIM, eSIM / iOS 14",
      "price": 700,
      "img_url": "https://content1.rozetka.com.ua/goods/images/big/175435404.jpg",
      "id": "00006709000",
      "category": "phones",
      "color": ["violet", "orange", "red", "brown"]
    },
    {
      "name": "Мобільний телефон Apple iPhone SE 64GB 2022",
      "decription":"Екран (4.7', IPS, 1334x750) / Apple A15 Bionic / основна камера: 12 Мп, фронтальна камера: 7 Мп / 64 ГБ вбудованої пам'яті / 3G / LTE / 5G / GPS / Nano-SIM, eSIM / iOS 15",
      "price": 500,
      "img_url": "https://content1.rozetka.com.ua/goods/images/big/259453183.jpg",
      "id": "0006966020",
      "category": "phones",
      "color": ["red", "white", "yellow", "blue"]
    }
  ,
    {
      "name": "XBOX",
      "decription":"\"XBOX\" - суперэкстремальная гра для дітей, яка буде тримати всіх у напрузі кожну секунду!",
      "price": 1300,
      "img_url": "https://content.rozetka.com.ua/goods/images/big/6726157.jpg",
      "id": "05640000ss000",
      "category": "XBOX",
      "color": ["white", "black"],
      "discount": 20
    },
    {
      "name": "Apple iPhone 14 128GB PRODUCT Red",
      "decription":"Екран (6.1\", OLED (Super Retina XDR), 2532x1170) / Apple A15 Bionic / подвійна основна камера: 12 Мп + 12 Мп, фронтальна камера: 12 Мп / 128 ГБ вбудованої пам'яті / 3G / LTE / 5G / GPS / Nano-SIM / iOS 16",
      "price": 1100,
      "img_url": "https://content2.rozetka.com.ua/goods/images/big/284913542.jpg",
      "id": "M4674PVA3RXA",
      "category": "phones",
      "color": ["red", "yellow", "pink", "orange"],
      "discount": 15
    },
    {
      "name": "Apple iPhone 14 512GB Purple",
      "decription":"Екран (6.1\", OLED (Super Retina XDR), 2532x1170) / Apple A15 Bionic / подвійна основна камера: 12 Мп + 12 Мп, фронтальна камера: 12 Мп / 512 ГБ вбудованої пам'яті / 3G / LTE / 5G / GPS / Nano-SIM / iOS 16",
      "price": 1700,
      "img_url": "https://content2.rozetka.com.ua/goods/images/big/284913540.jpg",
      "id": "MPX47493RX",
      "category": "phones",
      "color": ["purple", "blue", "red", "orange"]
    },
    {
      "name": "ASICS Gel-Sonoma 6 G-Tx",
      "decription":"Бігові кросівки Gel-Sonoma 6 G-TX створені для комфортного бігу на природі.",
      "price": 3399,
      "img_url": "https://content2.rozetka.com.ua/goods/images/big/264386471.png",
      "id": "1011B04474400",
      "category": "ASICS",
      "color": ["white", "red"]
    },
    {
      "name": "Мобільний телефон Samsung Galaxy S23 Plus 8/512G",
      "decription":"Экран (6.4', Dynamic AMOLED 2X, 2340x1080) / Qualcomm Snapdragon 8 Gen 2 for Galaxy (3.36 ГГц + 2.8 ГГц + 2.8 ГГц + 2.0 ГГц) / тройная основная камера: 50 Мп + 12 Мп + 10 Мп, фронтальная 12 Мп / RAM 8 ГБ / 512 ГБ встроенной памяти / 3G / LTE / 5G / GPS / поддержка 2х SIM-карт (Nano-SIM) / Android 13 / 4700 мА*ч",
      "price": 3457,
      "img_url": "https://content.rozetka.com.ua/goods/images/big/310635379.jpg",
      "id": "Rn421470",
      "category": "phones",
      "color": ["black", "blue", "red", "orange"]
    },
    {
      "name": "Мобільний телефон Samsung Galaxy M33 5G 6/128GB",
      "decription":"Экран (6.6', TFT, 2408x1080) / Samsung Exynos 1280 (2.0 ГГц + 2.4 ГГц) / основная квадро-камера: 50 Мп + 5 Мп + 2 Мп + 2 Мп, фронтальная камера: 8 Мп / RAM 6 ГБ / 128 ГБ встроенной памяти + microSD (до 1 ТБ) / 3G / LTE / 5G / GPS / поддержка 2х SIM-карт (Nano-SIM) / Android 12 / 5000 мА*ч",
      "price": 9963,
      "img_url": "https://content2.rozetka.com.ua/goods/images/big/263857437.jpg",
      "id": "482308144503361",
      "category": "hiking",
      "color": ["black", "blue"]
    }
  ]
}