<?xml version="1.0" encoding="UTF-8"?>
<svg width="320px" height="279px" viewBox="0 0 320 279" version="1.1" xmlns="http://www.w3.org/2000/svg" xmlns:xlink="http://www.w3.org/1999/xlink">
    <!-- Generator: Sketch 60.1 (88133) - https://sketch.com -->
    <title>gitlab-commit-san-francisco-stacked-logo-white</title>
    <desc>Created with Sketch.</desc>
    <g id="homepage---hero" stroke="none" stroke-width="1" fill="none" fill-rule="evenodd">
        <g id="homepage-hero-commit-sf" transform="translate(-1025.000000, -181.000000)" fill-rule="nonzero">
            <g id="gitlab-commit-san-francisco-stacked-logo-white" transform="translate(1025.000000, 181.000000)">
                <g id="g48" transform="translate(131.000000, 58.000000)" fill="#DA3B21">
                    <polygon id="path50" points="28.5 86.42 28.5 86.42 56.6802439 0.29 0.340609756 0.29"></polygon>
                </g>
                <g id="g56" transform="translate(92.000000, 58.000000)" fill="#FB6D26">
                    <polygon id="path58" points="68 86.42 39.8702041 0.29 0.47877551 0.29"></polygon>
                </g>
                <g id="g64" transform="translate(83.000000, 58.000000)" fill="#FBA021">
                    <path d="M9.48972973,0.32452381 L9.48972973,0.32452381 L0.92954955,26.4935714 C0.14345686,28.8732516 0.98307216,31.4862725 3.01063063,32.9702381 L77,86.4545238 L9.48972973,0.32452381 Z" id="path66"></path>
                </g>
                <g id="g72" transform="translate(92.000000, 3.000000)" fill="#DA3B21">
                    <path d="M0.475862069,54.6310127 L39.6551724,54.6310127 L22.7931034,2.32531646 C22.4018025,1.12196276 21.2891016,0.308452451 20.0344828,0.308452451 C18.7798639,0.308452451 17.667163,1.12196276 17.2758621,2.32531646 L0.475862069,54.6310127 Z" id="path74"></path>
                </g>
                <g id="g76" transform="translate(160.000000, 58.000000)" fill="#FB6D26">
                    <polygon id="path78" points="0 86.42 28.1297959 0.29 67.5489796 0.29"></polygon>
                </g>
                <g id="g80" transform="translate(160.000000, 58.000000)" fill="#FBA021">
                    <path d="M67.5172072,0.32452381 L67.5172072,0.32452381 L76.0704505,26.4935714 C76.8565431,28.8732516 76.0169278,31.4862725 73.9893694,32.9702381 L0,86.42 L67.4963964,0.32452381 L67.5172072,0.32452381 Z" id="path82"></path>
                </g>
                <g id="g84" transform="translate(188.000000, 3.000000)" fill="#DA3B21">
                    <path d="M39.5586207,54.6310127 L0.379310345,54.6310127 L17.2413793,2.32531646 C17.6326803,1.12196276 18.7453812,0.308452451 20,0.308452451 C21.2546188,0.308452451 22.3673197,1.12196276 22.7586207,2.32531646 L39.5931034,54.6310127 L39.5586207,54.6310127 Z" id="path86"></path>
                </g>
                <path d="M240.539379,83.1908704 L232.068469,57.1484949 C232.032459,56.9085107 231.966833,56.6739266 231.873093,56.4501207 L214.917318,4.19077621 C214.10308,1.67270784 211.749153,-0.0242692444 209.104906,0.000262512495 L209.070017,0.000262512495 C206.437581,-0.0171217271 204.099545,1.68062837 203.299472,4.19077621 L186.999599,54.4318191 L135.029798,54.4318191 L118.695036,4.22569492 C117.894963,1.71554708 115.556927,0.017796985 112.92449,0.0354494713 L112.889602,0.0354494713 C110.243503,0.00983046593 107.887125,1.70653762 107.070212,4.22569492 L90.1144367,56.5548768 C90.1144367,56.603763 90.1144367,56.6456655 90.0655929,56.6945517 L81.4481514,83.1908704 C80.2299598,86.9132226 81.5524278,90.9969588 84.7206859,93.2963457 L159.102812,147.392414 C159.644287,147.78648 160.296368,148 160.965854,148 C161.450775,148 161.92866,147.883815 162.361391,147.66478 L162.417213,147.66478 L162.417213,147.66478 L162.480012,147.622878 L162.598633,147.560024 C162.661432,147.518122 162.731209,147.483203 162.794008,147.434317 L162.842852,147.434317 L237.224978,93.3731668 C240.442226,91.0745168 241.786352,86.9451757 240.539379,83.1908704 Z M130.403592,60.8428947 L152.383301,128.585196 L99.6250219,60.8428947 L130.403592,60.8428947 Z M169.611207,128.585196 L191.590916,60.8428947 L222.397397,60.8428947 L180.866213,114.128849 L169.611207,128.585196 Z M209.139794,6.90046826 L224.581412,54.4667378 L193.670266,54.4667378 L209.139794,6.90046826 Z M184.920248,60.8428947 L160.993765,134.472491 L137.095193,60.8428947 L184.920248,60.8428947 Z M112.882624,6.90046826 L128.345175,54.4667378 L97.4968278,54.4667378 L112.882624,6.90046826 Z M88.4607252,88.1283763 C87.5189691,87.4452588 87.1267802,86.2309593 87.490827,85.125367 L94.2522041,64.3347659 L144.61016,128.941367 L88.4607252,88.1283763 Z M233.519827,88.1283763 L177.37737,128.934383 L181.563982,123.549918 L227.735326,64.3347659 L234.489725,85.1113996 C234.867152,86.2120684 234.49228,87.4307558 233.561693,88.1283763 L233.519827,88.1283763 Z" id="Shape" fill="#14125B"></path>
                <path d="M167.413098,178 C161.943643,178 156.921815,179.939628 154.068186,184.844515 C151.011726,179.960559 146.283654,178 140.63235,178 C130.805515,178 123,185.018942 123,196.579964 L123,221.697452 C123,224.506533 125.282794,226.783743 128.098764,226.783743 C130.914733,226.783743 133.197527,224.506533 133.197527,221.697452 L133.197527,196.489262 C133.197527,190.391294 136.694622,187.419058 141.072984,187.419058 C145.451346,187.419058 148.94844,190.37734 148.94844,196.489262 L148.94844,221.72536 C148.925958,223.089417 149.452981,224.405454 150.411428,225.378606 C151.369875,226.351758 152.679618,226.900669 154.047204,226.902353 C156.884259,226.86788 159.161556,224.555643 159.145967,221.72536 L159.145967,196.489262 C159.145967,190.391294 162.57312,187.419058 166.923505,187.419058 C171.273891,187.419058 174.805956,190.37734 174.805956,196.489262 L174.805956,221.72536 C174.736832,223.586185 175.692583,225.335943 177.297519,226.286833 C178.902455,227.237722 180.89999,227.237722 182.504926,226.286833 C184.109862,225.335943 185.065613,223.586185 184.996489,221.72536 L184.996489,196.607872 C185.017471,185.018942 177.232939,178 167.413098,178 Z" id="Path" fill="#FFFFFF"></path>
                <path d="M241.391127,178 C235.921364,178 230.899254,179.939628 228.045465,184.844515 C224.988833,179.960559 220.260495,178 214.608873,178 C204.781486,178 197.003511,185.025919 197.003511,196.579964 L197.003511,221.697452 C196.934383,223.558277 197.890188,225.308034 199.495214,226.258924 C201.100241,227.209814 203.097888,227.209814 204.702914,226.258924 C206.30794,225.308034 207.263745,223.558277 207.194617,221.697452 L207.194617,196.489262 C207.194617,190.391294 210.691908,187.419058 215.070516,187.419058 C219.449124,187.419058 222.953409,190.37734 222.953409,196.489262 L222.953409,221.72536 C222.92903,223.088765 223.454506,224.404837 224.411902,225.378202 C225.369298,226.351568 226.678423,226.9007 228.045465,226.902353 C230.88268,226.86788 233.160104,224.555643 233.144515,221.72536 L233.144515,196.489262 C233.144515,190.391294 236.57186,187.419058 240.929484,187.419058 C245.287109,187.419058 248.805383,190.37734 248.805383,196.489262 L248.805383,221.72536 C248.736255,223.586185 249.69206,225.335943 251.297086,226.286833 C252.902112,227.237722 254.899759,227.237722 256.504786,226.286833 C258.109812,225.335943 259.065617,223.586185 258.996489,221.72536 L258.996489,196.607872 C258.996489,185.018942 251.211519,178 241.391127,178 Z" id="Path" fill="#FFFFFF"></path>
                <path d="M275,160 C273.40757,159.996304 271.879293,160.627252 270.753272,161.753275 C269.627252,162.879297 268.996304,164.407576 269,166 C269,169.313712 271.6863,172 275,172 C278.3137,172 281,169.313712 281,166 C281.003696,164.407576 280.372748,162.879297 279.246728,161.753275 C278.120707,160.627252 276.59243,159.996304 275,160 Z" id="Path" fill="#FFFFFF"></path>
                <path d="M275,178.000485 C273.668416,177.98179 272.385903,178.503725 271.444238,179.447549 C270.502573,180.391372 269.981832,181.676825 270.000484,183.011462 L270.000484,220.989024 C270.000484,223.75651 272.238844,226 275,226 C277.761156,226 279.999516,223.75651 279.999516,220.989024 L279.999516,183.011462 C280.018168,181.676825 279.497427,180.391372 278.555762,179.447549 C277.614097,178.503725 276.331584,177.98179 275,178.000485 Z" id="Path" fill="#FFFFFF"></path>
                <path d="M315.240168,216.650273 C308.921806,216.650273 304.358545,212.534473 304.358545,204.556679 L304.358545,188.093478 L315.240168,188.093478 C317.855254,188.082182 319.971251,186.011569 319.978939,183.456342 C319.99219,182.223766 319.497413,181.037801 318.606039,180.165544 C317.714665,179.293288 316.501644,178.808084 315.240168,178.819207 L304.358545,178.819207 L304.358545,172.000698 C304.358545,169.238889 302.067195,167 299.240672,167 C296.414149,167 294.122799,169.238889 294.122799,172.000698 L294.122799,178.819207 L290.774067,178.819207 C289.507119,178.800677 288.286105,179.282383 287.387499,180.15525 C286.488892,181.028118 285.988705,182.218314 286,183.456342 C286.015565,186.009999 288.132472,188.075379 290.745985,188.086618 L294.094717,188.086618 L294.094717,204.54982 C294.094717,217.727241 303.22124,226 315.212086,226 C317.856378,226 320,223.905457 320,221.321707 C320,218.737957 317.856378,216.643414 315.212086,216.643414 L315.240168,216.650273 Z" id="Path" fill="#FFFFFF"></path>
                <path d="M99.7808424,180.679926 C91.264009,176.632275 81.5324682,177.488775 73.0919878,183.0353 C67.1642162,186.924084 62.5760933,192.871231 58.5155003,198.113837 L58.1753823,198.562808 C49.4156074,209.890706 42.2731285,217.799512 30.2857028,216.266102 C25.0312261,215.575376 19.4921608,212.943712 16.4935691,209.635137 C11.0586216,203.63964 9.05956048,195.944959 11.0169745,188.51966 C13.3145066,179.781983 20.0405144,173.033596 27.7591116,171.721217 C36.6299455,170.222343 43.8696009,172.529366 49.2767837,178.573214 C51.1782049,180.694226 54.447478,180.879775 56.5789096,178.987649 C58.7103413,177.095522 58.8968018,173.84223 56.9953809,171.721217 C49.2698425,163.100964 38.2541826,159.495377 26.0099331,161.57446 C14.3626255,163.549935 4.31179026,173.316793 1.02166879,185.915625 C-1.74495541,196.778419 1.18991454,208.296819 8.82356021,216.535485 C13.5019186,221.688296 21.227457,225.514915 28.9877013,226.481931 C47.7913702,228.858027 58.5502062,214.946816 66.3798624,204.841503 L66.7269216,204.385624 C70.2808081,199.785392 74.3066951,194.570415 78.7907003,191.621017 C82.6222342,189.106777 88.5985941,186.785939 95.3246019,189.970184 C98.6980176,191.579574 101.294021,194.052371 102.432375,196.760015 C104.51473,201.760867 103.876141,206.775534 100.516608,211.265249 C97.1275718,215.563373 91.5700012,217.558825 86.2038854,216.404247 C82.7818815,215.596098 79.5958777,213.544643 78.0826995,211.18927 C76.48456,208.955906 73.408827,208.358969 71.0844532,209.831053 C68.7600794,211.303137 68.00114,214.328667 69.3576306,216.715073 C72.3353987,221.336026 77.7286991,224.962335 83.8022356,226.38523 C85.5490123,226.796287 87.3381128,227.002605 89.1330653,227 C96.8439143,227.002391 104.119003,223.442595 108.825206,217.364355 C114.378153,209.897613 115.516508,201.146121 111.976504,192.733085 C109.831678,187.704604 105.50732,183.401385 99.7808424,180.679926 Z" id="Path" fill="#FFFFFF"></path>
                <path d="M85,267.160389 L86.6389892,265.341181 C87.6710658,266.22234 89.0121639,266.728283 90.4151625,266.765781 C91.5487365,266.765781 92.234657,266.34442 92.234657,265.662217 L92.234657,265.628776 C92.234657,264.959949 91.801444,264.638913 89.6931408,264.137293 C87.1444043,263.535349 85.5054152,262.886587 85.5054152,260.559071 L85.5054152,260.525629 C85.5054152,258.405449 87.3465704,257.000914 89.9241877,257.000914 C91.6274027,256.975023 93.287057,257.500097 94.6173285,258.485709 L93.1732852,260.425306 C92.2283594,259.743986 91.0832668,259.343007 89.8880866,259.274924 C88.8267148,259.274924 88.2635379,259.723038 88.2635379,260.29154 L88.2635379,260.29154 C88.2635379,261.060691 88.8050542,261.314845 90.9927798,261.829841 C93.5559567,262.45185 95,263.30126 95,265.341181 L95,265.374622 C95,267.702138 93.0866426,268.999662 90.3574007,268.999662 C88.3883136,269.017066 86.481228,268.362336 85,267.160389 Z" id="Path" fill="#FFFFFF"></path>
                <path d="M100.25054,257 L102.742441,257 L108,269 L105.192225,269 L104.069114,266.330306 L98.87473,266.330306 L97.7516199,269 L95,269 L100.25054,257 Z M103.093413,264.014756 L101.457883,260.153235 L99.8293737,264.014756 L103.093413,264.014756 Z" id="Shape" fill="#FFFFFF"></path>
                <polygon id="Path" fill="#FFFFFF" points="110 257 112.511254 257 118.311897 264.389365 118.311897 257 121 257 121 269 118.679743 269 112.688103 261.370497 112.688103 269 110 269"></polygon>
                <polygon id="Path" fill="#FFFFFF" points="129 257 138 257 138 259.401372 131.601351 259.401372 131.601351 261.953688 137.243243 261.953688 137.243243 264.35506 131.601351 264.35506 131.601351 269 129 269"></polygon>
                <path d="M141,257.009172 L146.291005,257.009172 C147.526638,256.929905 148.741424,257.366938 149.664021,258.222652 C150.336368,258.961691 150.693861,259.949898 150.656085,260.96498 L150.656085,260.999259 C150.730415,262.676932 149.715795,264.199875 148.175926,264.721969 L151,269 L148.02381,269 L145.550265,265.167597 L143.566138,265.167597 L143.566138,269 L141.019841,269 L141,257.009172 Z M146.125661,262.836618 C147.362434,262.836618 148.109788,262.151036 148.109788,261.136375 L148.109788,261.102096 C148.109788,259.970886 147.349206,259.388141 146.125661,259.388141 L143.546296,259.388141 L143.546296,262.816051 L146.125661,262.836618 Z" id="Shape" fill="#FFFFFF"></path>
                <path d="M157.219644,257 L159.738262,257 L165,269 L162.19374,269 L161.071236,266.330306 L155.879655,266.330306 L154.757151,269 L152,269 L157.219644,257 Z M160.025904,264.014756 L158.398273,260.153235 L156.763627,264.014756 L160.025904,264.014756 Z" id="Shape" fill="#FFFFFF"></path>
                <polygon id="Path" fill="#FFFFFF" points="167 257 169.51287 257 175.310167 264.389365 175.310167 257 178 257 178 269 175.706564 269 169.711068 261.370497 169.711068 269 167 269"></polygon>
                <path d="M180.001019,263.047611 L180.001019,263.014425 C179.97072,261.404398 180.616965,259.852251 181.789862,258.717994 C182.96276,257.583736 184.560395,256.965925 186.212208,257.007857 C187.969987,256.919969 189.681712,257.572718 190.911463,258.799872 L189.242887,260.671532 C188.446206,259.85685 187.352789,259.380083 186.198587,259.344113 C185.243265,259.362612 184.336502,259.757963 183.685684,260.439746 C183.034866,261.121529 182.695663,262.031424 182.745657,262.961328 L182.745657,262.994514 C182.688028,263.929508 183.023595,264.847056 183.675047,265.535763 C184.326498,266.22447 185.237652,266.624942 186.198587,266.644914 C187.391018,266.633157 188.525187,266.140583 189.331424,265.284311 L191,266.923672 C189.786009,268.30947 187.984837,269.073286 186.116861,268.994445 C184.488836,269.021576 182.919104,268.40419 181.766465,267.283403 C180.613826,266.162616 179.976809,264.634237 180.001019,263.047611 Z" id="Path" fill="#FFFFFF"></path>
                <polygon id="Path" fill="#FFFFFF" points="194 257 196 257 196 269 194.005181 269"></polygon>
                <path d="M198,267.160377 L199.640173,265.341158 C200.672996,266.222322 202.015063,266.728268 203.419075,266.765767 C204.553468,266.765767 205.239884,266.344404 205.239884,265.662196 L205.239884,265.628755 C205.239884,264.959924 204.806358,264.638885 202.696532,264.137262 C200.145954,263.535315 198.50578,262.886549 198.50578,260.559018 L198.50578,260.525576 C198.50578,258.405383 200.348266,257.000838 202.927746,257.000838 C204.632,256.976068 206.292455,257.50102 207.624277,258.485642 L206.179191,260.425252 C205.233138,259.744661 204.087471,259.343769 202.891618,259.274863 C201.82948,259.274863 201.265896,259.722979 201.265896,260.291485 L201.265896,260.291485 C201.265896,261.060641 201.807803,261.314796 203.989884,261.829796 C206.554913,262.451809 208,263.301224 208,265.341158 L208,265.374599 C208,267.70213 206.08526,268.999662 203.361272,268.999662 C201.390762,269.017066 199.482298,268.362332 198,267.160377 Z" id="Path" fill="#FFFFFF"></path>
                <path d="M209.001023,263.047611 L209.001023,263.014425 C208.970652,261.403215 209.61782,259.850005 210.792217,258.71554 C211.966615,257.581076 213.566042,256.964081 215.21902,257.007857 C216.976798,256.919969 218.688523,257.572718 219.918274,258.799872 L218.249698,260.671532 C217.450066,259.857043 216.354673,259.380481 215.198589,259.344113 C214.243267,259.362612 213.336504,259.757963 212.685686,260.439746 C212.034868,261.121529 211.695666,262.031424 211.745659,262.961328 L211.745659,262.994514 C211.688031,263.929508 212.023598,264.847056 212.675049,265.535763 C213.3265,266.22447 214.237653,266.624942 215.198589,266.644914 C216.391375,266.634752 217.526167,266.141907 218.331425,265.284311 L220,266.923672 C218.78601,268.30947 216.984838,269.073286 215.116863,268.994445 C213.488838,269.021576 211.919107,268.40419 210.766468,267.283403 C209.613829,266.162616 208.976813,264.634237 209.001023,263.047611 Z" id="Path" fill="#FFFFFF"></path>
                <path d="M222.000001,262.944265 L222.000001,262.911619 C221.999182,261.312317 222.692386,259.781011 223.921269,258.66749 C225.150151,257.553969 226.809741,256.953351 228.520944,257.002832 C230.221686,256.955148 231.870561,257.553124 233.091356,258.660325 C234.312151,259.767526 235.000718,261.289495 234.999976,262.878974 L234.999976,262.911619 C235.009602,266.2651 232.107287,268.990941 228.51745,268.999978 C224.927613,269.00897 222.009652,266.297745 222.000001,262.944265 L222.000001,262.944265 Z M232.190285,262.944265 L232.190285,262.911619 C232.224325,261.972475 231.849586,261.060518 231.15159,260.383874 C230.453595,259.707229 229.491905,259.323638 228.485998,259.320606 C227.486873,259.316248 226.529368,259.694093 225.836198,260.366291 C225.143029,261.03849 224.774618,261.946448 224.816657,262.878974 L224.816657,262.911619 C224.782618,263.850764 225.157357,264.762721 225.855353,265.439365 C226.553348,266.11601 227.515037,266.499601 228.520944,266.502595 C229.524904,266.514188 230.489768,266.139503 231.189074,265.466481 C231.88838,264.793459 232.260554,263.881361 232.218242,262.944265 L232.190285,262.944265 Z" id="Shape" fill="#FFFFFF"></path>
                <path d="M267,267.971815 L271.672372,264.170237 C273.630807,262.546787 274.349633,261.633596 274.349633,260.449831 C274.350609,259.82713 274.07368,259.231498 273.583898,258.802848 C273.094116,258.374197 272.434644,258.150306 271.760391,258.183766 C270.293399,258.183766 269.339853,258.894025 268.312958,260.213078 L267.271394,259.516347 C268.430318,257.926719 269.640587,257 271.892421,257 C274.144254,257 275.875306,258.420519 275.875306,260.382187 L275.875306,260.382187 C275.875306,262.107103 274.885086,263.169109 272.625917,264.981962 L269.200489,267.782413 L276,267.782413 L276,269 L267,269 L267,267.971815 Z" id="Path" fill="#FFFFFF"></path>
                <path d="M279,263.033333 L279,263 C279,259.733333 280.97698,257 284.023697,257 C287.070413,257 289,259.733333 289,263 L289,263 C289,266.266667 287.036561,269 283.989844,269 C280.943128,269 279,266.3 279,263.033333 Z M287.612051,263.033333 L287.612051,263 C287.612051,260.446667 286.190251,258.166667 283.989844,258.166667 C281.789438,258.166667 280.387949,260.4 280.387949,262.966667 L280.387949,262.966667 C280.387949,265.513333 281.809749,267.793333 284.023697,267.793333 C286.237644,267.793333 287.612051,265.58 287.612051,263.033333 Z" id="Shape" fill="#FFFFFF"></path>
                <path d="M31,267.971815 L35.6729354,264.183766 C37.6451349,262.560316 38.3589534,261.647125 38.3589534,260.46336 C38.3619635,259.841277 38.0857925,259.245579 37.5955525,258.816712 C37.1053125,258.387846 36.4443874,258.163762 35.7686018,258.197294 C34.2968111,258.197294 33.3401472,258.907554 32.3098937,260.226607 L31.2428455,259.516347 C32.3982011,257.926719 33.6124285,257 35.8789861,257 C38.1455437,257 39.8675388,258.420519 39.8675388,260.382187 L39.8675388,260.382187 C39.8675388,262.107103 38.8740801,263.169109 36.6148814,264.981962 L33.1708913,267.782413 L40,267.782413 L40,269 L31,269 L31,267.971815 Z" id="Path" fill="#FFFFFF"></path>
                <path d="M43,263.033333 L43,263 C43,259.733333 44.9837508,257 48.0236967,257 C51.0636425,257 53,259.733333 53,263 L53,263 C53,266.266667 51.0365606,269 47.9966148,269 C44.9566689,269 43,266.3 43,263.033333 Z M51.6120515,263.033333 L51.6120515,263 C51.6120515,260.446667 50.1902505,258.166667 47.9966148,258.166667 C45.802979,258.166667 44.3879485,260.4 44.3879485,262.966667 L44.3879485,262.966667 C44.3879485,265.513333 45.8097495,267.793333 48.0236967,267.793333 C50.2376439,267.793333 51.6120515,265.58 51.6120515,263.033333 Z" id="Shape" fill="#FFFFFF"></path>
                <rect id="Rectangle" fill="#FFFFFF" x="68" y="247" width="1" height="32"></rect>
                <rect id="Rectangle" fill="#FFFFFF" x="251" y="247" width="1" height="32"></rect>
            </g>
        </g>
    </g>
</svg>