^C:\USERS\XENIUM\SOURCE\REPOS\ABC_9\DEBUG\ABC_9.OBJ
C:\USERS\XENIUM\SOURCE\REPOS\ABC_9\DEBUG\ABC_9.EXE
C:\USERS\XENIUM\SOURCE\REPOS\ABC_9\DEBUG\ABC_9.ILK
C:\USERS\XENIUM\SOURCE\REPOS\ABC_9\DEBUG\ABC_9.PDB
