<svg viewBox="0 0 512 512" version="1.1" xmlns="http://www.w3.org/2000/svg" xmlns:xlink="http://www.w3.org/1999/xlink">
    <g transform="translate(91.581722, 91.581722)">
        <path d="M298.666667,4.26325641e-14 L328.836556,30.1698893 L194.587,164.418 L328.836556,298.666667 L298.666667,328.836556 L164.418,194.587 L30.1698893,328.836556 L9.9475983e-14,298.666667 L134.248,164.418 L7.10542736e-14,30.1698893 L30.1698893,4.26325641e-14 L164.418,134.248 L298.666667,4.26325641e-14 Z" transform="translate(164.418278, 164.418278) rotate(-360.000000) translate(-164.418278, -164.418278) " />
    </g>
</svg>