module gitlab.com/art.frela/pgdemo

go 1.19

require (
	github.com/golang-migrate/migrate/v4 v4.15.2
	github.com/jackc/pgx/v4 v4.10.1
	golang.org/x/crypto v0.0.0-20210921155107-089bfa567519
)

require (
	github.com/hashicorp/errwrap v1.1.0 // indirect
	github.com/hashicorp/go-multierror v1.1.1 // indirect
	github.com/jackc/chunkreader/v2 v2.0.1 // indirect
	github.com/jackc/pgconn v1.8.0 // indirect
	github.com/jackc/pgio v1.0.0 // indirect
	github.com/jackc/pgpassfile v1.0.0 // indirect
	github.com/jackc/pgproto3/v2 v2.0.7 // indirect
	github.com/jackc/pgservicefile v0.0.0-20200714003250-2b9c44734f2b // indirect
	github.com/jackc/pgtype v1.6.2 // indirect
	github.com/jackc/puddle v1.1.3 // indirect
	github.com/lib/pq v1.10.0 // indirect
	go.uber.org/atomic v1.7.0 // indirect
	golang.org/x/sys v0.0.0-20220317061510-51cd9980dadf // indirect
	golang.org/x/text v0.3.7 // indirect
	golang.org/x/xerrors v0.0.0-20200804184101-5ec99f83aff1 // indirect
)
