{
	"info": {
		"_postman_id": "c31c5060-1853-4c1f-987f-ca3f967bcc82",
		"name": "otushw2",
		"schema": "https://schema.getpostman.com/json/collection/v2.1.0/collection.json"
	},
	"item": [
		{
			"name": "user.create",
			"event": [
				{
					"listen": "test",
					"script": {
						"exec": [
							"var responseJSON = JSON.parse(responseBody)",
							"pm.collectionVariables.set(\"userId\", responseJSON[\"id\"])",
							""
						],
						"type": "text/javascript"
					}
				}
			],
			"request": {
				"method": "POST",
				"header": [],
				"body": {
					"mode": "raw",
					"raw": "{\"login\":\"newuser\",\"email\":\"newuser.email@domain.com\",\"password\":\"secretPassword\"}",
					"options": {
						"raw": {
							"language": "json"
						}
					}
				},
				"url": {
					"raw": "http://{{baseUrl}}/users",
					"protocol": "http",
					"host": [
						"{{baseUrl}}"
					],
					"path": [
						"users"
					]
				}
			},
			"response": []
		},
		{
			"name": "user.get",
			"request": {
				"method": "GET",
				"header": [],
				"url": {
					"raw": "http://{{baseUrl}}/users/{{userId}}",
					"protocol": "http",
					"host": [
						"{{baseUrl}}"
					],
					"path": [
						"users",
						"{{userId}}"
					]
				}
			},
			"response": []
		},
		{
			"name": "user.update",
			"request": {
				"method": "PUT",
				"header": [],
				"body": {
					"mode": "raw",
					"raw": "{\"login\":\"newuser2\",\"email\":\"newuser.email@domain.com\"}",
					"options": {
						"raw": {
							"language": "json"
						}
					}
				},
				"url": {
					"raw": "http://{{baseUrl}}/users/{{userId}}",
					"protocol": "http",
					"host": [
						"{{baseUrl}}"
					],
					"path": [
						"users",
						"{{userId}}"
					]
				}
			},
			"response": []
		},
		{
			"name": "user.delete",
			"request": {
				"method": "DELETE",
				"header": [],
				"url": {
					"raw": "http://{{baseUrl}}/users/{{userId}}",
					"protocol": "http",
					"host": [
						"{{baseUrl}}"
					],
					"path": [
						"users",
						"{{userId}}"
					]
				}
			},
			"response": []
		}
	],
	"event": [
		{
			"listen": "prerequest",
			"script": {
				"type": "text/javascript",
				"exec": [
					""
				]
			}
		},
		{
			"listen": "test",
			"script": {
				"type": "text/javascript",
				"exec": [
					""
				]
			}
		}
	],
	"variable": [
		{
			"key": "userId",
			"value": ""
		},
		{
			"key": "baseUrl",
			"value": "arch.homework"
		}
	]
}