module gitlab.com/art.frela/chat

go 1.14

require (
	github.com/gorilla/websocket v1.4.2
	github.com/labstack/echo/v4 v4.1.15
	github.com/prometheus/client_golang v1.5.1
	github.com/satori/go.uuid v1.2.0
	github.com/spf13/viper v1.6.2
	go.uber.org/zap v1.14.1
)
