nom, lat_coor1, long_coor1, adr_num, adr_voie, com_cp, com_insee, com_nom, acc, acc_lib, acc_pcsec, acc_acc, dae_mobile, acc_etg, acc_complt, photo1, photo2, disp_j, disp_h, disp_complt, tel1, tel2, site_email, date_instal, etat, etat_fonct, fab_siren,  fab_rais, mnt_siren, mnt_rais, modele, num_serie, id_euro, lc_ped, dtpr_lcped, dtpr_lcad, dtpr_bat, freq_mnt, dispsurv, dermnt, expt_siren, expt_siret, expt_rais, expt_tel1, expt_tel2, expt_email
DAE-MinSanté-Duquesne, 48.8521329, 2.3068453, 14, Avenue Duquesne, 75350, 75056, Paris, Intérieur, oui, oui, oui, non, oui, acc_complt, "http://www.monsite.com/monimage1.jpg", "http://www.monsite.com/monimage2.jpg", "lundi|mardi", "24h/24|heures de nuit", complément d'information sur  la disponibilité du DAE, +33102030405, +33102030405, p.nom@domaine.fr, 2019-09-30, Actif, En fonctionnement, 444613665, Société SAS, 444613665, Société SAS, HeatSine Samaritan PAD, X09E409930, 123456789, oui, 2019-09-30, 2019-09-30, 2019-09-30, Tous les 6 mois, oui, 2019-09-30, 444613665, 44461366500058, Société SAS, +33102030405, +33102030405, p.nom@exemple.com
DAE-SalleSport-Rennes, 48.8521329, 2.3068453, 54, Rue de Rennes, 75350, 75056, Paris, Intérieur, oui, oui, oui, non, oui, acc_complt, "http://www.monsite.com/monimage1.jpg", "http://www.monsite.com/monimage2.jpg", "mardi|mercredi|jeudi|vendredi", "heures de nuit|24h/24", complément d'information sur  la disponibilité du DAE, +33102030405, +33102030405, p.nom@domaine.fr, 2019-09-30, Actif, En fonctionnement, 444613665, Société SAS, 444613665, Société SAS, HeatSine Samaritan PAD, X09E409930, 123456789, oui, 2019-09-30, 2019-09-30, 2019-09-30, Tous les 6 mois, oui, 2019-09-30, 444613665, 44461366500058, Société SAS, +33102030405, +33102030405, p.nom@exemple.com
DAE-SalleSport-Dausmenil, 48.8521329, 2.3068453, 78, Avenue Dausmenil, 75350, 75056, Paris, Intérieur, oui, oui, non, non, oui, acc_complt, "http://www.monsite.com/monimage1.jpg", "http://www.monsite.com/monimage2.jpg", "mercredi|jeudi|vendredi", "24h/24|heures de nuit", complément d'information sur  la disponibilité du DAE, +33102030405, +33102030405, p.nom@domaine.fr, 2019-09-30, Actif, En fonctionnement, 444613665, Société SAS, 444613665, Société SAS, HeatSine Samaritan PAD, X09E409931, 123456789, oui, 2019-09-30, 2019-09-30, 2019-09-30, Tous les 6 mois, oui, 2019-09-30, 444613665, 44461366500058, Société SAS, +33102030405, +33102030405, p.nom@exemple.com
