<mxfile host="app.diagrams.net" modified="2021-12-10T14:16:41.602Z" agent="5.0 (Windows NT 10.0; Win64; x64) AppleWebKit/537.36 (KHTML, like Gecko) Chrome/96.0.4664.93 Safari/537.36" etag="AZcELzJ1NYg7-ldb2NXy" version="15.9.4" type="gitlab" pages="2">
  <diagram id="n2cHHrvd9RcV4p3473Gc" name="Page-1">
    <mxGraphModel dx="1019" dy="553" grid="1" gridSize="10" guides="1" tooltips="1" connect="1" arrows="1" fold="1" page="1" pageScale="1" pageWidth="2000" pageHeight="2000" math="0" shadow="0">
      <root>
        <mxCell id="0" />
        <mxCell id="1" parent="0" />
        <mxCell id="HOcB04jdrLRsM1EVW5iR-1" value="3" style="ellipse;whiteSpace=wrap;html=1;aspect=fixed;" vertex="1" parent="1">
          <mxGeometry x="360" y="160" width="70" height="70" as="geometry" />
        </mxCell>
        <mxCell id="HOcB04jdrLRsM1EVW5iR-2" value="2" style="ellipse;whiteSpace=wrap;html=1;aspect=fixed;" vertex="1" parent="1">
          <mxGeometry x="620" y="160" width="70" height="70" as="geometry" />
        </mxCell>
        <mxCell id="HOcB04jdrLRsM1EVW5iR-3" value="5" style="ellipse;whiteSpace=wrap;html=1;aspect=fixed;" vertex="1" parent="1">
          <mxGeometry x="360" y="370" width="70" height="70" as="geometry" />
        </mxCell>
        <mxCell id="HOcB04jdrLRsM1EVW5iR-4" value="4" style="ellipse;whiteSpace=wrap;html=1;aspect=fixed;" vertex="1" parent="1">
          <mxGeometry x="630" y="370" width="70" height="70" as="geometry" />
        </mxCell>
        <mxCell id="HOcB04jdrLRsM1EVW5iR-5" value="6" style="ellipse;whiteSpace=wrap;html=1;aspect=fixed;" vertex="1" parent="1">
          <mxGeometry x="800" y="250" width="70" height="70" as="geometry" />
        </mxCell>
        <mxCell id="HOcB04jdrLRsM1EVW5iR-6" value="1" style="ellipse;whiteSpace=wrap;html=1;aspect=fixed;" vertex="1" parent="1">
          <mxGeometry x="490" y="270" width="70" height="70" as="geometry" />
        </mxCell>
        <mxCell id="HOcB04jdrLRsM1EVW5iR-7" value="7" style="ellipse;whiteSpace=wrap;html=1;aspect=fixed;" vertex="1" parent="1">
          <mxGeometry x="200" y="260" width="70" height="70" as="geometry" />
        </mxCell>
        <mxCell id="HOcB04jdrLRsM1EVW5iR-8" value="" style="endArrow=none;html=1;rounded=0;entryX=0;entryY=1;entryDx=0;entryDy=0;" edge="1" parent="1" source="HOcB04jdrLRsM1EVW5iR-6" target="HOcB04jdrLRsM1EVW5iR-2">
          <mxGeometry width="50" height="50" relative="1" as="geometry">
            <mxPoint x="610" y="310" as="sourcePoint" />
            <mxPoint x="660" y="260" as="targetPoint" />
          </mxGeometry>
        </mxCell>
        <mxCell id="HOcB04jdrLRsM1EVW5iR-9" value="" style="endArrow=none;html=1;rounded=0;exitX=0.941;exitY=0.3;exitDx=0;exitDy=0;exitPerimeter=0;" edge="1" parent="1" source="HOcB04jdrLRsM1EVW5iR-3" target="HOcB04jdrLRsM1EVW5iR-6">
          <mxGeometry width="50" height="50" relative="1" as="geometry">
            <mxPoint x="430.0001911355753" y="416.17188507978216" as="sourcePoint" />
            <mxPoint x="511.05999999999995" y="359.99999999999994" as="targetPoint" />
          </mxGeometry>
        </mxCell>
        <mxCell id="HOcB04jdrLRsM1EVW5iR-10" value="" style="endArrow=none;html=1;rounded=0;exitX=0.925;exitY=0.745;exitDx=0;exitDy=0;entryX=0;entryY=0;entryDx=0;entryDy=0;exitPerimeter=0;" edge="1" parent="1" source="HOcB04jdrLRsM1EVW5iR-6" target="HOcB04jdrLRsM1EVW5iR-4">
          <mxGeometry width="50" height="50" relative="1" as="geometry">
            <mxPoint x="519.9999999999999" y="413.05" as="sourcePoint" />
            <mxPoint x="592.7073182857454" y="350.0030366406659" as="targetPoint" />
          </mxGeometry>
        </mxCell>
        <mxCell id="HOcB04jdrLRsM1EVW5iR-11" value="" style="endArrow=none;html=1;rounded=0;exitX=1;exitY=1;exitDx=0;exitDy=0;" edge="1" parent="1" source="HOcB04jdrLRsM1EVW5iR-1" target="HOcB04jdrLRsM1EVW5iR-6">
          <mxGeometry width="50" height="50" relative="1" as="geometry">
            <mxPoint x="449.99873734152925" y="199.49873734152925" as="sourcePoint" />
            <mxPoint x="540.5012626584708" y="250.00126265847075" as="targetPoint" />
          </mxGeometry>
        </mxCell>
        <mxCell id="HOcB04jdrLRsM1EVW5iR-12" value="" style="endArrow=none;html=1;rounded=0;exitX=1;exitY=0.5;exitDx=0;exitDy=0;entryX=0;entryY=0.5;entryDx=0;entryDy=0;" edge="1" parent="1" source="HOcB04jdrLRsM1EVW5iR-1" target="HOcB04jdrLRsM1EVW5iR-2">
          <mxGeometry width="50" height="50" relative="1" as="geometry">
            <mxPoint x="469.99873734152925" y="166.76873734152926" as="sourcePoint" />
            <mxPoint x="548.04642952524" y="229.99806199662297" as="targetPoint" />
          </mxGeometry>
        </mxCell>
        <mxCell id="HOcB04jdrLRsM1EVW5iR-13" value="" style="endArrow=none;html=1;rounded=0;" edge="1" parent="1" source="HOcB04jdrLRsM1EVW5iR-7" target="HOcB04jdrLRsM1EVW5iR-1">
          <mxGeometry width="50" height="50" relative="1" as="geometry">
            <mxPoint x="260" y="284.5" as="sourcePoint" />
            <mxPoint x="450" y="284.5" as="targetPoint" />
          </mxGeometry>
        </mxCell>
        <mxCell id="HOcB04jdrLRsM1EVW5iR-14" value="" style="endArrow=none;html=1;rounded=0;entryX=0.021;entryY=0.348;entryDx=0;entryDy=0;entryPerimeter=0;exitX=0.735;exitY=0.983;exitDx=0;exitDy=0;exitPerimeter=0;" edge="1" parent="1" source="HOcB04jdrLRsM1EVW5iR-7" target="HOcB04jdrLRsM1EVW5iR-3">
          <mxGeometry width="50" height="50" relative="1" as="geometry">
            <mxPoint x="230" y="320" as="sourcePoint" />
            <mxPoint x="368.82449533574226" y="304.02750259125435" as="targetPoint" />
          </mxGeometry>
        </mxCell>
        <mxCell id="HOcB04jdrLRsM1EVW5iR-17" value="" style="endArrow=none;html=1;rounded=0;entryX=0.037;entryY=0.634;entryDx=0;entryDy=0;entryPerimeter=0;exitX=0.973;exitY=0.618;exitDx=0;exitDy=0;exitPerimeter=0;" edge="1" parent="1" source="HOcB04jdrLRsM1EVW5iR-3" target="HOcB04jdrLRsM1EVW5iR-4">
          <mxGeometry width="50" height="50" relative="1" as="geometry">
            <mxPoint x="460.00000000000006" y="389.99999999999994" as="sourcePoint" />
            <mxPoint x="590.02" y="455.55" as="targetPoint" />
          </mxGeometry>
        </mxCell>
        <mxCell id="HOcB04jdrLRsM1EVW5iR-18" value="" style="endArrow=none;html=1;rounded=0;entryX=0;entryY=1;entryDx=0;entryDy=0;exitX=1;exitY=0.5;exitDx=0;exitDy=0;" edge="1" parent="1" source="HOcB04jdrLRsM1EVW5iR-4" target="HOcB04jdrLRsM1EVW5iR-5">
          <mxGeometry width="50" height="50" relative="1" as="geometry">
            <mxPoint x="709.9999999999999" y="390" as="sourcePoint" />
            <mxPoint x="911.89" y="396.72" as="targetPoint" />
          </mxGeometry>
        </mxCell>
        <mxCell id="HOcB04jdrLRsM1EVW5iR-19" value="" style="endArrow=none;html=1;rounded=0;entryX=0;entryY=0;entryDx=0;entryDy=0;exitX=1;exitY=0.5;exitDx=0;exitDy=0;" edge="1" parent="1" source="HOcB04jdrLRsM1EVW5iR-2" target="HOcB04jdrLRsM1EVW5iR-5">
          <mxGeometry width="50" height="50" relative="1" as="geometry">
            <mxPoint x="670" y="336.45" as="sourcePoint" />
            <mxPoint x="824.78" y="253.55" as="targetPoint" />
          </mxGeometry>
        </mxCell>
      </root>
    </mxGraphModel>
  </diagram>
  <diagram id="SbUipbA0HIr7EObzcN6T" name="Page-2">
    <mxGraphModel dx="1019" dy="553" grid="1" gridSize="10" guides="1" tooltips="1" connect="1" arrows="1" fold="1" page="1" pageScale="1" pageWidth="2000" pageHeight="2000" math="0" shadow="0">
      <root>
        <mxCell id="x3BQYDs028xXG-aCnjXN-0" />
        <mxCell id="x3BQYDs028xXG-aCnjXN-1" parent="x3BQYDs028xXG-aCnjXN-0" />
        <mxCell id="CJR2Ei2ENCEQsa_NYqyr-0" value="3" style="ellipse;whiteSpace=wrap;html=1;aspect=fixed;fillColor=#f0a30a;fontColor=#000000;strokeColor=#BD7000;" vertex="1" parent="x3BQYDs028xXG-aCnjXN-1">
          <mxGeometry x="360" y="160" width="70" height="70" as="geometry" />
        </mxCell>
        <mxCell id="CJR2Ei2ENCEQsa_NYqyr-1" value="2" style="ellipse;whiteSpace=wrap;html=1;aspect=fixed;fillColor=#0050ef;fontColor=#ffffff;strokeColor=#001DBC;" vertex="1" parent="x3BQYDs028xXG-aCnjXN-1">
          <mxGeometry x="620" y="160" width="70" height="70" as="geometry" />
        </mxCell>
        <mxCell id="CJR2Ei2ENCEQsa_NYqyr-2" value="5" style="ellipse;whiteSpace=wrap;html=1;aspect=fixed;fillColor=#f0a30a;fontColor=#000000;strokeColor=#BD7000;" vertex="1" parent="x3BQYDs028xXG-aCnjXN-1">
          <mxGeometry x="360" y="370" width="70" height="70" as="geometry" />
        </mxCell>
        <mxCell id="CJR2Ei2ENCEQsa_NYqyr-3" value="4" style="ellipse;whiteSpace=wrap;html=1;aspect=fixed;fillColor=#0050ef;fontColor=#ffffff;strokeColor=#001DBC;" vertex="1" parent="x3BQYDs028xXG-aCnjXN-1">
          <mxGeometry x="630" y="370" width="70" height="70" as="geometry" />
        </mxCell>
        <mxCell id="CJR2Ei2ENCEQsa_NYqyr-4" value="6" style="ellipse;whiteSpace=wrap;html=1;aspect=fixed;fillColor=#60a917;fontColor=#ffffff;strokeColor=#2D7600;" vertex="1" parent="x3BQYDs028xXG-aCnjXN-1">
          <mxGeometry x="800" y="260" width="70" height="70" as="geometry" />
        </mxCell>
        <mxCell id="CJR2Ei2ENCEQsa_NYqyr-5" value="1" style="ellipse;whiteSpace=wrap;html=1;aspect=fixed;fillColor=#60a917;fontColor=#ffffff;strokeColor=#2D7600;" vertex="1" parent="x3BQYDs028xXG-aCnjXN-1">
          <mxGeometry x="490" y="270" width="70" height="70" as="geometry" />
        </mxCell>
        <mxCell id="CJR2Ei2ENCEQsa_NYqyr-6" value="7" style="ellipse;whiteSpace=wrap;html=1;aspect=fixed;fillColor=#60a917;fontColor=#ffffff;strokeColor=#2D7600;" vertex="1" parent="x3BQYDs028xXG-aCnjXN-1">
          <mxGeometry x="200" y="260" width="70" height="70" as="geometry" />
        </mxCell>
        <mxCell id="CJR2Ei2ENCEQsa_NYqyr-7" value="" style="endArrow=none;html=1;rounded=0;entryX=0;entryY=1;entryDx=0;entryDy=0;" edge="1" parent="x3BQYDs028xXG-aCnjXN-1" source="CJR2Ei2ENCEQsa_NYqyr-5" target="CJR2Ei2ENCEQsa_NYqyr-1">
          <mxGeometry width="50" height="50" relative="1" as="geometry">
            <mxPoint x="610" y="310" as="sourcePoint" />
            <mxPoint x="660" y="260" as="targetPoint" />
          </mxGeometry>
        </mxCell>
        <mxCell id="CJR2Ei2ENCEQsa_NYqyr-8" value="" style="endArrow=none;html=1;rounded=0;exitX=0.941;exitY=0.3;exitDx=0;exitDy=0;exitPerimeter=0;" edge="1" parent="x3BQYDs028xXG-aCnjXN-1" source="CJR2Ei2ENCEQsa_NYqyr-2" target="CJR2Ei2ENCEQsa_NYqyr-5">
          <mxGeometry width="50" height="50" relative="1" as="geometry">
            <mxPoint x="430.0001911355753" y="416.17188507978216" as="sourcePoint" />
            <mxPoint x="511.05999999999995" y="359.99999999999994" as="targetPoint" />
          </mxGeometry>
        </mxCell>
        <mxCell id="CJR2Ei2ENCEQsa_NYqyr-9" value="" style="endArrow=none;html=1;rounded=0;exitX=0.925;exitY=0.745;exitDx=0;exitDy=0;entryX=0;entryY=0;entryDx=0;entryDy=0;exitPerimeter=0;" edge="1" parent="x3BQYDs028xXG-aCnjXN-1" source="CJR2Ei2ENCEQsa_NYqyr-5" target="CJR2Ei2ENCEQsa_NYqyr-3">
          <mxGeometry width="50" height="50" relative="1" as="geometry">
            <mxPoint x="519.9999999999999" y="413.05" as="sourcePoint" />
            <mxPoint x="592.7073182857454" y="350.0030366406659" as="targetPoint" />
          </mxGeometry>
        </mxCell>
        <mxCell id="CJR2Ei2ENCEQsa_NYqyr-10" value="" style="endArrow=none;html=1;rounded=0;exitX=1;exitY=1;exitDx=0;exitDy=0;" edge="1" parent="x3BQYDs028xXG-aCnjXN-1" source="CJR2Ei2ENCEQsa_NYqyr-0" target="CJR2Ei2ENCEQsa_NYqyr-5">
          <mxGeometry width="50" height="50" relative="1" as="geometry">
            <mxPoint x="449.99873734152925" y="199.49873734152925" as="sourcePoint" />
            <mxPoint x="540.5012626584708" y="250.00126265847075" as="targetPoint" />
          </mxGeometry>
        </mxCell>
        <mxCell id="CJR2Ei2ENCEQsa_NYqyr-11" value="" style="endArrow=none;html=1;rounded=0;exitX=1;exitY=0.5;exitDx=0;exitDy=0;entryX=0;entryY=0.5;entryDx=0;entryDy=0;" edge="1" parent="x3BQYDs028xXG-aCnjXN-1" source="CJR2Ei2ENCEQsa_NYqyr-0" target="CJR2Ei2ENCEQsa_NYqyr-1">
          <mxGeometry width="50" height="50" relative="1" as="geometry">
            <mxPoint x="469.99873734152925" y="166.76873734152926" as="sourcePoint" />
            <mxPoint x="548.04642952524" y="229.99806199662297" as="targetPoint" />
          </mxGeometry>
        </mxCell>
        <mxCell id="CJR2Ei2ENCEQsa_NYqyr-12" value="" style="endArrow=none;html=1;rounded=0;" edge="1" parent="x3BQYDs028xXG-aCnjXN-1" source="CJR2Ei2ENCEQsa_NYqyr-6" target="CJR2Ei2ENCEQsa_NYqyr-0">
          <mxGeometry width="50" height="50" relative="1" as="geometry">
            <mxPoint x="260" y="284.5" as="sourcePoint" />
            <mxPoint x="450" y="284.5" as="targetPoint" />
          </mxGeometry>
        </mxCell>
        <mxCell id="CJR2Ei2ENCEQsa_NYqyr-13" value="" style="endArrow=none;html=1;rounded=0;entryX=0.021;entryY=0.348;entryDx=0;entryDy=0;entryPerimeter=0;exitX=0.735;exitY=0.983;exitDx=0;exitDy=0;exitPerimeter=0;" edge="1" parent="x3BQYDs028xXG-aCnjXN-1" source="CJR2Ei2ENCEQsa_NYqyr-6" target="CJR2Ei2ENCEQsa_NYqyr-2">
          <mxGeometry width="50" height="50" relative="1" as="geometry">
            <mxPoint x="230" y="320" as="sourcePoint" />
            <mxPoint x="368.82449533574226" y="304.02750259125435" as="targetPoint" />
          </mxGeometry>
        </mxCell>
        <mxCell id="CJR2Ei2ENCEQsa_NYqyr-14" value="" style="endArrow=none;html=1;rounded=0;entryX=0.037;entryY=0.634;entryDx=0;entryDy=0;entryPerimeter=0;exitX=0.973;exitY=0.618;exitDx=0;exitDy=0;exitPerimeter=0;" edge="1" parent="x3BQYDs028xXG-aCnjXN-1" source="CJR2Ei2ENCEQsa_NYqyr-2" target="CJR2Ei2ENCEQsa_NYqyr-3">
          <mxGeometry width="50" height="50" relative="1" as="geometry">
            <mxPoint x="460.00000000000006" y="389.99999999999994" as="sourcePoint" />
            <mxPoint x="590.02" y="455.55" as="targetPoint" />
          </mxGeometry>
        </mxCell>
        <mxCell id="CJR2Ei2ENCEQsa_NYqyr-15" value="" style="endArrow=none;html=1;rounded=0;entryX=0;entryY=1;entryDx=0;entryDy=0;exitX=1;exitY=0.5;exitDx=0;exitDy=0;" edge="1" parent="x3BQYDs028xXG-aCnjXN-1" source="CJR2Ei2ENCEQsa_NYqyr-3" target="CJR2Ei2ENCEQsa_NYqyr-4">
          <mxGeometry width="50" height="50" relative="1" as="geometry">
            <mxPoint x="709.9999999999999" y="390" as="sourcePoint" />
            <mxPoint x="911.89" y="396.72" as="targetPoint" />
          </mxGeometry>
        </mxCell>
        <mxCell id="CJR2Ei2ENCEQsa_NYqyr-16" value="" style="endArrow=none;html=1;rounded=0;entryX=0;entryY=0;entryDx=0;entryDy=0;exitX=1;exitY=0.5;exitDx=0;exitDy=0;" edge="1" parent="x3BQYDs028xXG-aCnjXN-1" source="CJR2Ei2ENCEQsa_NYqyr-1" target="CJR2Ei2ENCEQsa_NYqyr-4">
          <mxGeometry width="50" height="50" relative="1" as="geometry">
            <mxPoint x="670" y="336.45" as="sourcePoint" />
            <mxPoint x="824.78" y="253.55" as="targetPoint" />
          </mxGeometry>
        </mxCell>
      </root>
    </mxGraphModel>
  </diagram>
</mxfile>
