%YAML 1.1
%TAG !u! tag:unity3d.com,2011:
--- !u!114 &11400000
MonoBehaviour:
  m_ObjectHideFlags: 0
  m_CorrespondingSourceObject: {fileID: 0}
  m_PrefabInstance: {fileID: 0}
  m_PrefabAsset: {fileID: 0}
  m_GameObject: {fileID: 0}
  m_Enabled: 1
  m_EditorHideFlags: 0
  m_Script: {fileID: 11500000, guid: 0d15565ed78e567488c33c9eae518384, type: 3}
  m_Name: Mercader
  m_EditorClassIdentifier: 
  tipoCarta: 0
  valor: 6
  colorIndex: 3
  nombre: MERCADER
  informacion: 'Recibe 1 de oro por cada distrito verde y 1 de oro extra en su turno.  '
  "dise\xF1o": {fileID: 21300000, guid: afffa02f443222647bedd059c8bc15ce, type: 3}
