%YAML 1.1
%TAG !u! tag:unity3d.com,2011:
--- !u!114 &11400000
MonoBehaviour:
  m_ObjectHideFlags: 0
  m_CorrespondingSourceObject: {fileID: 0}
  m_PrefabInstance: {fileID: 0}
  m_PrefabAsset: {fileID: 0}
  m_GameObject: {fileID: 0}
  m_Enabled: 1
  m_EditorHideFlags: 0
  m_Script: {fileID: 11500000, guid: 0d15565ed78e567488c33c9eae518384, type: 3}
  m_Name: Castillo
  m_EditorClassIdentifier: 
  tipoCarta: 1
  valor: 4
  colorIndex: 2
  nombre: Castillo
  informacion: 
  "dise\xF1o": {fileID: 21300000, guid: 2d21204b1bb915445a7f4c98fdd8dc82, type: 3}
