{
  "$schema": "http://json.schemastore.org/template",
  "author": "Arquidev",
  "classifications": [
    "Arquidev",
    "Fx"
  ],
  "identity": "Arquidev.Fx.Template.Sln",
  "sourceName": "Arquidev.Fx.Template",
  "name": "Arquidev Framework Extensions Solution",
  "shortName": "arq-sln",
  "tags": {
    "type": "solution",
    "language": "C#"
  },
  "symbols": {
    "component": {
      "type": "parameter",
      "replaces": "__COMPONENT__",
      "isRequired": "true"
    },
    "description": {
      "type": "parameter",
      "replaces": "__DESCRIPTION__",
      "isRequired": "true"
    }
  },
  "sources": [
    {
      "modifiers": [
        {
          "include": [
            "src/packages.lock.json"
          ]
        }
      ]
    }
  ]
}
