id;cod_imovel;documento_proprietario;tipo_imovel
1;International;Markets facilitate reboot;PROPRIEDADE_RURAL
2;Santo Orchestrator;Prático e-commerce;LOTE
3;US;ADP;PREDIO
4;Borracha Buckinghamshire THX;Alameda Realigned;LOTE
5;client-server Avon;preto;PREDIO
6;Optional HTTP;Synergized;LOTE
7;hybrid;implement Borders;CASA
8;invoice SSL;Macio HTTP;PROPRIEDADE_RURAL
9;Product;Tactics;CASA
10;Central ADP;Bahraini;CASA
