{
  "name": "Area",
  "fields": [
    {
      "fieldName": "codArea",
      "fieldType": "String"
    },
    {
      "fieldName": "descricao",
      "fieldType": "String"
    }
  ],
  "relationships": [
    {
      "relationshipType": "one-to-one",
      "otherEntityName": "solicitacao",
      "otherEntityRelationshipName": "area",
      "relationshipName": "solicitacao",
      "ownerSide": true
    }
  ],
  "entityTableName": "area",
  "dto": "no",
  "pagination": "no",
  "service": "serviceImpl",
  "jpaMetamodelFiltering": false,
  "fluentMethods": true,
  "readOnly": false,
  "embedded": false,
  "applications": "*",
  "microserviceName": "mmac",
  "clientRootFolder": "mmac",
  "databaseType": "sql",
  "changelogDate": "20211030043030"
}
