{
  "name": "Agenda",
  "fields": [
    {
      "fieldName": "data",
      "fieldType": "LocalDate"
    },
    {
      "fieldName": "descricaoPrevia",
      "fieldType": "String"
    }
  ],
  "relationships": [
    {
      "relationshipType": "one-to-one",
      "otherEntityName": "solicitacao",
      "otherEntityRelationshipName": "agenda",
      "relationshipName": "solicitacao",
      "ownerSide": false
    }
  ],
  "entityTableName": "agenda",
  "dto": "no",
  "pagination": "no",
  "service": "serviceImpl",
  "jpaMetamodelFiltering": false,
  "fluentMethods": true,
  "readOnly": false,
  "embedded": false,
  "applications": "*",
  "microserviceName": "mmac",
  "clientRootFolder": "mmac",
  "databaseType": "sql",
  "changelogDate": "20211030043029"
}
