{
  "name": "Imposto",
  "fields": [
    {
      "fieldName": "tipoImposto",
      "fieldType": "TipoImposto",
      "fieldValues": "IPTU,ITBI"
    },
    {
      "fieldName": "valorDevido",
      "fieldType": "Double"
    },
    {
      "fieldName": "dataVencimento",
      "fieldType": "LocalDate"
    }
  ],
  "relationships": [
    {
      "relationshipType": "many-to-one",
      "otherEntityName": "imovel",
      "otherEntityRelationshipName": "imposto",
      "relationshipName": "imovel"
    }
  ],
  "entityTableName": "imposto",
  "dto": "no",
  "pagination": "no",
  "service": "serviceImpl",
  "jpaMetamodelFiltering": false,
  "fluentMethods": true,
  "readOnly": false,
  "embedded": false,
  "applications": "*",
  "changelogDate": "20211030042927"
}
