id;data;descricao_previa
1;2021-10-29;Berkshire
2;2021-10-30;Feito
3;2021-10-29;Group Plástico esmeralda
4;2021-10-29;up Aço
5;2021-10-29;Bola action-items ferrugem
6;2021-10-29;Engineer
7;2021-10-29;Ergonômico Automotivo Jogos
8;2021-10-29;Computadores azul
9;2021-10-29;SMS indexing Account
10;2021-10-29;Bacon
