780
127
127
95
71
64
50
51
46
44
36
28
37
33
29
35
46
50
37
61
71
65
61
75
87
95
105
93
137
127
183
208
231
252
323
413
438
492
407
400
399
394
411
423
416
531
511
478
455
443
483
399
509
472
512
468
526
443
478
461
501
431
494
533
441
434
430
425
422
402
417
398
430
508
639
697
645
625
625
700
682
636
595
518
446
409
425
413
400
359
387
345
346
381
388
370
367
372
357
406
394
355
410
416
407
465
431
441
450
487
449
520
504
435
463
462
513
601
683
747
758
711
757
760
666
684
647
607
670
613
707
751
855
955
835
788
916
1041
956
862
754
711
735
684
704
642
706
749
727
552
438
415
375
332
315
327
313
286
272
314
274
286
319
280
323
289
287
261
281
266
262
266
264
262
288
267
259
253
245
256
249
220
247
212
248
230
236
255
231
242
225
230
231
247
240
211
252
230
220
228
225
206
228
236
243
239
231
218
213
195
252
232
227
201
214
190
262
250
215
206
216
192
209
206
225
241
231
214
228
241
229
248
235
234
254
252
214
265
273
292
311
340
303
317
354
301
339
365
427
478
623
734
467
1454
364
3425
