module gitlab.com/arpachain/mpc

go 1.12

require (
	github.com/allegro/bigcache v1.2.1 // indirect
	github.com/aristanetworks/goarista v0.0.0-20190924011532-60b7b74727fd // indirect
	github.com/deckarep/golang-set v1.7.1 // indirect
	github.com/dgraph-io/badger v1.6.0
	github.com/edsrzf/mmap-go v1.0.0 // indirect
	github.com/elastic/gosigar v0.10.5 // indirect
	github.com/ethereum/go-ethereum v1.9.5
	github.com/fjl/memsize v0.0.0-20190710130421-bcb5799ab5e5 // indirect
	github.com/gballet/go-libpcsclite v0.0.0-20190607065134-2772fd86a8ff // indirect
	github.com/golang/mock v1.3.1
	github.com/golang/protobuf v1.3.2
	github.com/gorilla/websocket v1.4.1 // indirect
	github.com/hashicorp/golang-lru v0.5.3 // indirect
	github.com/huin/goupnp v1.0.0 // indirect
	github.com/jackpal/go-nat-pmp v1.0.1 // indirect
	github.com/karalabe/usb v0.0.0-20190919080040-51dc0efba356 // indirect
	github.com/mattn/go-colorable v0.1.4 // indirect
	github.com/mattn/go-isatty v0.0.10 // indirect
	github.com/mattn/go-runewidth v0.0.4 // indirect
	github.com/olekukonko/tablewriter v0.0.1 // indirect
	github.com/pborman/uuid v1.2.0 // indirect
	github.com/processout/grpc-go-pool v1.2.1
	github.com/prometheus/tsdb v0.10.0 // indirect
	github.com/rjeczalik/notify v0.9.2 // indirect
	github.com/rs/cors v1.7.0 // indirect
	github.com/rs/xid v1.2.1
	github.com/status-im/keycard-go v0.0.0-20190424133014-d95853db0f48 // indirect
	github.com/steakknife/bloomfilter v0.0.0-20180922174646-6819c0d2a570 // indirect
	github.com/steakknife/hamming v0.0.0-20180906055917-c99c65617cd3 // indirect
	github.com/stretchr/testify v1.4.0
	github.com/syndtr/goleveldb v1.0.0 // indirect
	github.com/tyler-smith/go-bip39 v1.0.2 // indirect
	github.com/wsddn/go-ecdh v0.0.0-20161211032359-48726bab9208 // indirect
	golang.org/x/net v0.0.0-20190926025831-c00fd9afed17
	google.golang.org/grpc v1.24.0
	gopkg.in/natefinch/npipe.v2 v2.0.0-20160621034901-c1b8fa8bdcce // indirect
	gopkg.in/olebedev/go-duktape.v3 v3.0.0-20190709231704-1e4459ed25ff // indirect
)
