<?xml version="1.0" encoding="utf-8"?>
<!-- Generator: Adobe Illustrator 24.0.1, SVG Export Plug-In . SVG Version: 6.00 Build 0)  -->
<svg version="1.1" id="레이어_1" xmlns="http://www.w3.org/2000/svg" xmlns:xlink="http://www.w3.org/1999/xlink" x="0px"
	 y="0px" viewBox="0 0 232 31.65" style="enable-background:new 0 0 232 31.65;" xml:space="preserve">
<style type="text/css">
	.st0{fill:#30A2DC;}
	.st1{fill:#209DD5;}
	.st2{fill:#1B2780;}
</style>
<g>
	<path class="st0" d="M14.05,4.31c-3.32,2.17-4.26,6.64-2.1,9.97l7.09,10.94c0.1,0.16,0.21,0.3,0.33,0.45l6.55-10.11
		c0.78-1.21,1.27-2.52,1.49-3.86l-3.42-5.28C21.82,3.09,17.36,2.14,14.05,4.31"/>
	<path class="st1" d="M9.36,15.56C6.34,10.9,7.66,4.65,12.3,1.62c1.65-1.08,3.5-1.59,5.33-1.62c-3.33-0.04-6.61,1.56-8.55,4.57
		L1.62,16.08c-3.02,4.66-1.7,10.91,2.94,13.94c4.26,2.78,9.85,1.89,13.08-1.88c-0.29-0.34-0.57-0.69-0.81-1.07L9.36,15.56z"/>
	<path class="st2" d="M33.65,16.08L26.19,4.56c-1.94-3-5.22-4.61-8.55-4.56c-1.84,0.02-3.68,0.54-5.33,1.62
		C7.66,4.65,6.34,10.9,9.36,15.56l7.46,11.52c0.25,0.38,0.53,0.73,0.81,1.07c3.23,3.77,8.82,4.66,13.07,1.88
		C35.35,26.99,36.67,20.74,33.65,16.08 M28.96,27.33c-3.16,2.06-7.35,1.3-9.6-1.66c-0.11-0.15-0.22-0.29-0.33-0.45l-7.09-10.94
		c-2.16-3.33-1.22-7.8,2.1-9.97c3.32-2.17,7.77-1.22,9.93,2.11l3.42,5.28l3.67,5.66C33.22,20.69,32.28,25.16,28.96,27.33"/>
	<path class="st2" d="M62.63,9.78c0.62,0.65,1.12,1.41,1.49,2.27c0.38,0.86,0.56,1.78,0.56,2.76v9.54H61.8v-6.47H45.76v6.47h-2.88
		v-9.54c0-0.98,0.19-1.9,0.56-2.76c0.37-0.86,0.88-1.61,1.53-2.24c0.64-0.64,1.39-1.14,2.25-1.52c0.85-0.38,1.76-0.56,2.72-0.56
		h7.69c0.99,0,1.91,0.19,2.76,0.56C61.23,8.66,61.98,9.16,62.63,9.78 M61.8,14.98v-0.22c0-0.56-0.11-1.08-0.33-1.58
		c-0.22-0.5-0.52-0.94-0.9-1.32c-0.38-0.38-0.83-0.69-1.33-0.91c-0.51-0.22-1.04-0.33-1.61-0.33h-7.74c-0.56,0-1.08,0.11-1.57,0.33
		c-0.5,0.22-0.94,0.52-1.32,0.91c-0.38,0.38-0.69,0.83-0.91,1.34c-0.22,0.51-0.33,1.05-0.33,1.62v0.17H61.8z"/>
	<path class="st2" d="M90.03,17.04c-0.64,0.62-1.35,1.06-2.15,1.33c0.36,0.49,0.75,0.99,1.17,1.51c0.42,0.52,0.84,1.03,1.26,1.54
		c0.41,0.52,0.82,1.02,1.22,1.51c0.4,0.49,0.77,0.96,1.11,1.42h-3.59l-4.57-5.74H71.93v5.74h-2.86V7.74H86.1
		c0.55,0,1.1,0.08,1.65,0.25c0.55,0.16,1.04,0.38,1.48,0.66c0.75,0.49,1.36,1.14,1.82,1.94c0.46,0.8,0.7,1.67,0.7,2.6
		c0,0.77-0.15,1.47-0.44,2.12C91,15.96,90.58,16.53,90.03,17.04 M71.93,15.71h14.26c0.36,0,0.7-0.06,1.03-0.2
		c0.33-0.13,0.61-0.31,0.85-0.54c0.24-0.23,0.44-0.49,0.59-0.8c0.15-0.3,0.22-0.63,0.22-0.99c0-0.36-0.08-0.7-0.23-1.01
		c-0.16-0.31-0.36-0.58-0.61-0.81c-0.25-0.23-0.55-0.41-0.89-0.54c-0.34-0.13-0.69-0.2-1.05-0.2H71.93V15.71z"/>
	<path class="st2" d="M103.61,24.35c-0.98,0-1.89-0.19-2.75-0.56c-0.86-0.38-1.6-0.88-2.24-1.52c-0.63-0.64-1.14-1.39-1.51-2.24
		c-0.37-0.86-0.56-1.77-0.56-2.73v-2.87c0-0.98,0.19-1.9,0.56-2.76c0.38-0.86,0.88-1.61,1.51-2.24c0.64-0.64,1.38-1.15,2.24-1.52
		c0.86-0.38,1.77-0.56,2.75-0.56h11.72c0.98,0,1.89,0.19,2.75,0.56c0.86,0.38,1.6,0.88,2.23,1.52c0.64,0.64,1.14,1.39,1.52,2.24
		c0.38,0.86,0.56,1.78,0.56,2.76v2.87c0,0.97-0.19,1.88-0.56,2.73c-0.37,0.86-0.88,1.61-1.52,2.24c-0.63,0.64-1.38,1.14-2.23,1.52
		c-0.86,0.38-1.77,0.56-2.75,0.56H103.61z M99.43,17.28c0,0.57,0.11,1.11,0.33,1.62c0.22,0.51,0.51,0.95,0.89,1.32
		c0.37,0.38,0.82,0.68,1.33,0.9c0.51,0.22,1.05,0.33,1.63,0.33h11.72c0.57,0,1.1-0.11,1.61-0.33c0.5-0.22,0.95-0.52,1.33-0.9
		c0.38-0.38,0.69-0.82,0.91-1.32c0.22-0.51,0.33-1.05,0.33-1.62v-2.87c0-0.57-0.11-1.11-0.33-1.62c-0.22-0.51-0.52-0.95-0.91-1.34
		c-0.38-0.38-0.83-0.69-1.33-0.91c-0.5-0.22-1.04-0.33-1.61-0.33h-11.72c-0.57,0-1.11,0.11-1.63,0.33
		c-0.51,0.22-0.96,0.52-1.33,0.91c-0.38,0.38-0.67,0.83-0.89,1.34c-0.22,0.51-0.33,1.05-0.33,1.62V17.28z"/>
	<path class="st2" d="M143.5,24.17c-0.24-0.13-0.45-0.26-0.63-0.39c-0.18-0.13-0.39-0.34-0.64-0.64c-0.81-0.95-1.68-1.97-2.61-3.07
		c-0.93-1.1-1.87-2.21-2.83-3.35c-0.96-1.13-1.91-2.26-2.84-3.36c-0.94-1.1-1.8-2.13-2.6-3.08c-0.14-0.16-0.36-0.25-0.63-0.25
		c-0.21,0-0.41,0.06-0.59,0.17c-0.18,0.11-0.28,0.29-0.29,0.51v13.61h-2.88v-13.8l0.03-0.1c0.03-0.52,0.17-0.99,0.4-1.4
		c0.24-0.41,0.53-0.76,0.88-1.04c0.35-0.28,0.74-0.5,1.18-0.65c0.44-0.15,0.88-0.22,1.32-0.22c0.52,0,1.03,0.11,1.53,0.32
		c0.5,0.21,0.93,0.56,1.31,1.03l-0.02-0.02c1.82,2.16,3.64,4.3,5.43,6.43c1.8,2.13,3.61,4.28,5.43,6.44
		c0.16,0.18,0.38,0.27,0.66,0.27c0.2,0,0.37-0.07,0.54-0.2c0.16-0.13,0.27-0.3,0.32-0.49V7.3h2.91v13.83
		c-0.07,0.51-0.22,0.97-0.45,1.38c-0.24,0.42-0.53,0.77-0.87,1.07c-0.34,0.29-0.73,0.52-1.16,0.69c-0.43,0.16-0.86,0.25-1.31,0.25
		c-0.55,0-1.08-0.12-1.59-0.37L143.5,24.17z"/>
	<polygon class="st2" points="173.03,10.64 164.02,10.64 164.02,24.35 161.14,24.35 161.14,10.64 152.15,10.64 152.15,7.74 
		173.03,7.74 	"/>
	<rect x="176.25" y="7.8" class="st2" width="2.86" height="16.55"/>
	<path class="st2" d="M186.56,11.64c-0.83,0.83-1.25,1.82-1.25,2.97h18.09v2.7h-18.09c0,0.57,0.11,1.11,0.34,1.61
		c0.23,0.5,0.53,0.94,0.9,1.31c0.37,0.38,0.81,0.68,1.32,0.89c0.5,0.22,1.04,0.33,1.61,0.33h13.92v2.9h-13.92
		c-0.96,0-1.87-0.19-2.72-0.56c-0.86-0.38-1.6-0.88-2.24-1.52c-0.63-0.64-1.14-1.39-1.51-2.24c-0.38-0.86-0.56-1.77-0.56-2.73v-2.67
		c0-0.98,0.19-1.9,0.56-2.76c0.37-0.86,0.88-1.61,1.51-2.24c0.64-0.64,1.38-1.14,2.24-1.52c0.86-0.38,1.76-0.56,2.72-0.56h13.92
		v2.89h-13.92C188.35,10.42,187.37,10.83,186.56,11.64"/>
	<path class="st2" d="M229.39,17.04c-0.64,0.62-1.35,1.06-2.15,1.33c0.36,0.49,0.75,0.99,1.17,1.51c0.42,0.52,0.84,1.03,1.26,1.54
		c0.41,0.52,0.82,1.02,1.22,1.51c0.4,0.49,0.77,0.96,1.11,1.42h-3.59l-4.57-5.74h-12.55v5.74h-2.86V7.74h17.02
		c0.55,0,1.1,0.08,1.65,0.25c0.54,0.16,1.04,0.38,1.47,0.66c0.75,0.49,1.36,1.14,1.82,1.94c0.47,0.8,0.7,1.67,0.7,2.6
		c0,0.77-0.14,1.47-0.44,2.12C230.36,15.96,229.94,16.53,229.39,17.04 M211.29,15.71h14.26c0.36,0,0.7-0.06,1.03-0.2
		c0.32-0.13,0.61-0.31,0.85-0.54c0.24-0.23,0.44-0.49,0.59-0.8c0.14-0.3,0.22-0.63,0.22-0.99c0-0.36-0.08-0.7-0.23-1.01
		c-0.15-0.31-0.36-0.58-0.61-0.81c-0.25-0.23-0.55-0.41-0.89-0.54c-0.34-0.13-0.69-0.2-1.05-0.2h-14.16V15.71z"/>
</g>
</svg>
