variations.sass:14 Debug: $arontier-sky-blue
variations.sass:16 Debug: lighten-4 #82c8eb rgb(130,200,235)
variations.sass:16 Debug: lighten-3 #6dbfe7 rgb(109,191,231)
variations.sass:16 Debug: lighten-2 #59b5e4 rgb(89,181,228)
variations.sass:16 Debug: lighten-1 #44ace0 rgb(68,172,224)
variations.sass:17 Debug:    origin #2fa3dd rgb(47,163,221)
variations.sass:19 Debug:  darken-1 #2296cf rgb(34,150,207)
variations.sass:19 Debug:  darken-2 #1e85b8 rgb(30,133,184)
variations.sass:19 Debug:  darken-3 #1a74a1 rgb(26,116,161)
variations.sass:19 Debug:  darken-4 #17648a rgb(23,100,138)
variations.sass:21 Debug: 
variations.sass:24 Debug: $arontier-blue
variations.sass:26 Debug: lighten-4 #4e61db rgb(78,97,219)
variations.sass:26 Debug: lighten-3 #3047d5 rgb(48,71,213)
variations.sass:26 Debug: lighten-2 #263abc rgb(38,58,188)
variations.sass:26 Debug: lighten-1 #20319f rgb(32,49,159)
variations.sass:27 Debug:    origin #1a2881 rgb(26,40,129)
variations.sass:29 Debug:  darken-1 #172474 rgb(23,36,116)
variations.sass:29 Debug:  darken-2 #152067 rgb(21,32,103)
variations.sass:29 Debug:  darken-3 #121c5a rgb(18,28,90)
variations.sass:29 Debug:  darken-4 #10184d rgb(16,24,77)
variations.sass:31 Debug: 
variations.sass:34 Debug: $arontier-gold
variations.sass:36 Debug: lighten-4 #d4c49d rgb(212,196,157)
variations.sass:36 Debug: lighten-3 #cdba8d rgb(205,186,141)
variations.sass:36 Debug: lighten-2 #c5b17d rgb(197,177,125)
variations.sass:36 Debug: lighten-1 #bea76c rgb(190,167,108)
variations.sass:37 Debug:    origin #b79d5c rgb(183,157,92)
variations.sass:39 Debug:  darken-1 #ac904c rgb(172,144,76)
variations.sass:39 Debug:  darken-2 #998043 rgb(153,128,67)
variations.sass:39 Debug:  darken-3 #86703b rgb(134,112,59)
variations.sass:39 Debug:  darken-4 #726033 rgb(114,96,51)
