<?xml version="1.0" encoding="utf-8"?>
<!-- Generator: Adobe Illustrator 24.0.1, SVG Export Plug-In . SVG Version: 6.00 Build 0)  -->
<svg version="1.1" id="레이어_1" xmlns="http://www.w3.org/2000/svg" xmlns:xlink="http://www.w3.org/1999/xlink" x="0px"
	 y="0px" viewBox="0 0 145.75 80.55" style="enable-background:new 0 0 145.75 80.55;" xml:space="preserve">
<style type="text/css">
	.st0{opacity:0.65;fill:#FFFFFF;}
	.st1{fill:#FFFFFF;}
</style>
<g>
	<g>
		<path class="st0" d="M66.8,7.72c-5.96,3.89-7.66,11.89-3.78,17.85l12.74,19.59c0.18,0.28,0.39,0.54,0.59,0.8l11.78-18.1
			c1.41-2.16,2.28-4.52,2.67-6.91l-6.15-9.45C80.77,5.53,72.76,3.84,66.8,7.72"/>
		<path class="st0" d="M58.37,27.86c-5.43-8.34-3.06-19.54,5.29-24.97c2.97-1.93,6.29-2.85,9.59-2.89
			c-5.98-0.08-11.88,2.8-15.38,8.17L44.45,28.8c-5.43,8.34-3.05,19.54,5.29,24.97c7.66,4.98,17.71,3.38,23.51-3.37
			c-0.52-0.6-1.02-1.23-1.46-1.92L58.37,27.86z"/>
		<path class="st1" d="M102.05,28.8L88.63,8.17C85.13,2.8,79.23-0.08,73.25,0c-3.3,0.04-6.62,0.96-9.59,2.89
			c-8.34,5.43-10.72,16.63-5.29,24.97l13.41,20.62c0.45,0.68,0.94,1.31,1.46,1.92c5.8,6.74,15.85,8.35,23.51,3.37
			C105.1,48.34,107.47,37.14,102.05,28.8 M93.62,48.94c-5.68,3.7-13.21,2.33-17.27-2.98c-0.2-0.26-0.4-0.52-0.59-0.8L63.02,25.57
			c-3.88-5.96-2.19-13.97,3.77-17.85c5.97-3.88,13.97-2.19,17.85,3.78l6.15,9.45l6.6,10.14C101.28,37.04,99.58,45.06,93.62,48.94"/>
	</g>
	<g>
		<path class="st1" d="M15.22,69.24c0.48,0.5,0.86,1.08,1.15,1.74c0.29,0.66,0.43,1.37,0.43,2.12v7.32h-2.22v-4.97H2.22v4.97H0V73.1
			c0-0.75,0.15-1.46,0.43-2.12c0.29-0.66,0.68-1.23,1.18-1.72c0.5-0.49,1.07-0.88,1.73-1.17C4,67.8,4.7,67.66,5.44,67.66h5.93
			c0.77,0,1.47,0.15,2.13,0.43C14.14,68.38,14.72,68.76,15.22,69.24 M14.58,73.23v-0.17c0-0.43-0.09-0.83-0.25-1.21
			c-0.17-0.38-0.4-0.72-0.7-1.02c-0.3-0.29-0.64-0.53-1.02-0.7c-0.39-0.17-0.8-0.25-1.24-0.25H5.4c-0.43,0-0.83,0.09-1.21,0.25
			c-0.38,0.17-0.72,0.4-1.02,0.7c-0.3,0.3-0.53,0.64-0.7,1.02c-0.17,0.39-0.25,0.8-0.25,1.24v0.13H14.58z"/>
		<path class="st1" d="M36.34,74.81c-0.49,0.48-1.04,0.82-1.66,1.02c0.28,0.38,0.58,0.76,0.9,1.16c0.33,0.4,0.65,0.79,0.97,1.18
			c0.32,0.4,0.63,0.78,0.94,1.16c0.31,0.38,0.59,0.74,0.86,1.09h-2.77l-3.52-4.4h-9.67v4.4h-2.2V67.68h13.12
			c0.43,0,0.85,0.06,1.27,0.19c0.42,0.13,0.8,0.3,1.14,0.51c0.58,0.38,1.05,0.87,1.4,1.49c0.36,0.61,0.54,1.28,0.54,2
			c0,0.59-0.11,1.13-0.34,1.63C37.09,73.98,36.76,74.42,36.34,74.81 M22.39,73.79h10.99c0.28,0,0.54-0.05,0.79-0.15
			c0.25-0.1,0.47-0.24,0.66-0.41c0.19-0.18,0.34-0.38,0.45-0.61c0.11-0.23,0.17-0.48,0.17-0.76c0-0.28-0.06-0.53-0.18-0.77
			c-0.12-0.24-0.28-0.44-0.47-0.62c-0.19-0.17-0.42-0.31-0.69-0.41c-0.26-0.1-0.53-0.15-0.81-0.15H22.39V73.79z"/>
		<path class="st1" d="M46.8,80.42c-0.75,0-1.46-0.14-2.12-0.43c-0.66-0.29-1.23-0.68-1.72-1.17c-0.49-0.49-0.88-1.06-1.17-1.72
			c-0.29-0.66-0.43-1.36-0.43-2.1v-2.2c0-0.75,0.14-1.46,0.43-2.12c0.29-0.66,0.68-1.23,1.17-1.72c0.49-0.49,1.06-0.88,1.72-1.17
			c0.66-0.29,1.37-0.43,2.12-0.43h9.03c0.75,0,1.46,0.15,2.12,0.43c0.66,0.29,1.23,0.68,1.72,1.17c0.49,0.49,0.88,1.06,1.17,1.72
			c0.29,0.66,0.43,1.36,0.43,2.12V75c0,0.74-0.15,1.44-0.43,2.1c-0.29,0.66-0.68,1.23-1.17,1.72c-0.49,0.49-1.06,0.88-1.72,1.17
			c-0.66,0.29-1.36,0.43-2.12,0.43H46.8z M43.58,75c0,0.44,0.09,0.85,0.25,1.24c0.17,0.39,0.4,0.73,0.69,1.02
			c0.29,0.29,0.63,0.52,1.02,0.69c0.4,0.17,0.81,0.25,1.25,0.25h9.03c0.44,0,0.85-0.08,1.24-0.25c0.39-0.17,0.73-0.4,1.02-0.69
			c0.3-0.29,0.53-0.63,0.7-1.02c0.17-0.39,0.25-0.8,0.25-1.24v-2.2c0-0.44-0.08-0.85-0.25-1.24c-0.17-0.39-0.4-0.73-0.7-1.02
			c-0.29-0.3-0.64-0.53-1.02-0.7c-0.39-0.17-0.8-0.25-1.24-0.25H46.8c-0.44,0-0.86,0.08-1.25,0.25c-0.39,0.17-0.74,0.4-1.02,0.7
			c-0.29,0.29-0.52,0.64-0.69,1.02c-0.17,0.39-0.25,0.8-0.25,1.24V75z"/>
		<path class="st1" d="M77.55,80.28c-0.19-0.1-0.35-0.2-0.49-0.3c-0.14-0.1-0.3-0.26-0.49-0.49c-0.63-0.73-1.3-1.51-2.01-2.35
			c-0.71-0.84-1.44-1.7-2.18-2.57c-0.74-0.87-1.47-1.73-2.19-2.58c-0.72-0.85-1.39-1.63-2-2.36c-0.11-0.13-0.28-0.19-0.49-0.19
			c-0.16,0-0.31,0.04-0.45,0.13c-0.14,0.09-0.21,0.22-0.23,0.39v10.45h-2.22v-10.6l0.02-0.08c0.03-0.4,0.13-0.76,0.31-1.07
			c0.18-0.31,0.41-0.58,0.68-0.8c0.27-0.22,0.57-0.38,0.91-0.5c0.34-0.11,0.68-0.17,1.02-0.17c0.4,0,0.79,0.08,1.18,0.24
			c0.38,0.16,0.72,0.43,1.01,0.79l-0.02-0.02c1.4,1.66,2.8,3.3,4.19,4.94c1.39,1.64,2.78,3.28,4.19,4.94
			c0.13,0.14,0.29,0.21,0.51,0.21c0.15,0,0.29-0.05,0.41-0.15c0.13-0.1,0.21-0.23,0.24-0.38V67.34h2.24v10.61
			c-0.05,0.39-0.17,0.74-0.35,1.06c-0.18,0.32-0.41,0.59-0.67,0.82c-0.26,0.23-0.56,0.4-0.89,0.53c-0.33,0.13-0.67,0.19-1.01,0.19
			c-0.43,0-0.83-0.09-1.22-0.28L77.55,80.28z"/>
		<polygon class="st1" points="100.3,69.9 93.36,69.9 93.36,80.42 91.14,80.42 91.14,69.9 84.21,69.9 84.21,67.68 100.3,67.68 		"/>
		<rect x="102.79" y="67.71" class="st1" width="2.2" height="12.7"/>
		<path class="st1" d="M110.73,70.67c-0.64,0.64-0.96,1.4-0.96,2.28h13.94v2.07h-13.94c0,0.44,0.09,0.85,0.26,1.23
			c0.18,0.38,0.41,0.72,0.7,1.01c0.29,0.29,0.63,0.52,1.02,0.69c0.39,0.17,0.8,0.25,1.24,0.25h10.73v2.22h-10.73
			c-0.74,0-1.44-0.14-2.1-0.43c-0.66-0.29-1.23-0.68-1.72-1.17c-0.49-0.49-0.88-1.06-1.17-1.72c-0.29-0.66-0.43-1.36-0.43-2.1v-2.05
			c0-0.75,0.14-1.46,0.43-2.12c0.29-0.66,0.68-1.23,1.17-1.72c0.49-0.49,1.06-0.88,1.72-1.17c0.66-0.29,1.36-0.43,2.1-0.43h10.73
			v2.22h-10.73C112.11,69.73,111.35,70.04,110.73,70.67"/>
		<path class="st1" d="M143.73,74.81c-0.49,0.48-1.04,0.82-1.66,1.02c0.28,0.38,0.58,0.76,0.9,1.16c0.33,0.4,0.65,0.79,0.97,1.18
			c0.32,0.4,0.63,0.78,0.94,1.16c0.31,0.38,0.59,0.74,0.86,1.09h-2.77l-3.52-4.4h-9.67v4.4h-2.2V67.68h13.12
			c0.43,0,0.85,0.06,1.27,0.19c0.42,0.13,0.8,0.3,1.14,0.51c0.58,0.38,1.04,0.87,1.4,1.49c0.36,0.61,0.54,1.28,0.54,2
			c0,0.59-0.11,1.13-0.34,1.63C144.48,73.98,144.16,74.42,143.73,74.81 M129.79,73.79h10.99c0.28,0,0.54-0.05,0.79-0.15
			c0.25-0.1,0.47-0.24,0.66-0.41c0.19-0.18,0.34-0.38,0.45-0.61c0.11-0.23,0.17-0.48,0.17-0.76c0-0.28-0.06-0.53-0.18-0.77
			c-0.12-0.24-0.28-0.44-0.47-0.62c-0.19-0.17-0.42-0.31-0.69-0.41c-0.26-0.1-0.53-0.15-0.81-0.15h-10.92V73.79z"/>
	</g>
</g>
</svg>
