<?xml version="1.0" encoding="utf-8"?>
<!-- Generator: Adobe Illustrator 24.0.1, SVG Export Plug-In . SVG Version: 6.00 Build 0)  -->
<svg version="1.1" id="레이어_1" xmlns="http://www.w3.org/2000/svg" xmlns:xlink="http://www.w3.org/1999/xlink" x="0px"
	 y="0px" viewBox="0 0 77.5 69.2" style="enable-background:new 0 0 77.5 69.2;" xml:space="preserve">
<style type="text/css">
	.st0{fill:#30A2DC;}
	.st1{fill:#209DD5;}
	.st2{fill:#1B2780;}
</style>
<g>
	<path class="st0" d="M30.9,9.4c-7.3,4.8-9.4,14.5-4.6,21.8l15.6,23.9c0.2,0.3,0.5,0.7,0.7,1L56.9,34c1.7-2.6,2.8-5.5,3.3-8.5
		L52.7,14C47.9,6.8,38.1,4.7,30.9,9.4"/>
	<path class="st1" d="M20.6,34C13.9,23.9,16.8,10.2,27,3.5c3.6-2.4,7.7-3.5,11.7-3.5C31.4-0.1,24.2,3.4,20,10L3.6,35.2
		C-3.1,45.4-0.2,59.1,10,65.7c9.4,6.1,21.6,4.1,28.7-4.1c-0.6-0.7-1.2-1.5-1.8-2.3L20.6,34z"/>
	<path class="st2" d="M73.9,35.2L57.5,10C53.2,3.4,46-0.1,38.7,0c-4,0.1-8.1,1.2-11.7,3.5C16.8,10.2,13.9,23.8,20.6,34L37,59.2
		c0.5,0.8,1.2,1.6,1.8,2.3c7.1,8.2,19.4,10.2,28.7,4.1C77.7,59,80.6,45.4,73.9,35.2 M63.6,59.8c-6.9,4.5-16.1,2.8-21.1-3.6
		c-0.2-0.3-0.5-0.6-0.7-1L26.2,31.2c-4.7-7.3-2.7-17.1,4.6-21.8c7.3-4.7,17.1-2.7,21.8,4.6l7.5,11.5L68.2,38
		C73,45.3,70.9,55,63.6,59.8"/>
</g>
</svg>
