smiles,probability,binary probability
CC(=O)NC1=CC=C(O)C=C1,0.0017188787,-0.49828112
CC[N+](C)(CC)CCOC(=O)C(O)(C1CCCCC1)C1=CC=CC=C1,0.09779516,-0.40220484
[H][C@@](CC(O)=O)(C(O)=O)C(=O)C(O)=O,0.0010700505,-0.49892995
CC\C=C/C\C=C/C\C=C/C\C=C/C\C=C/CCCC(O)=O,0.020707954,-0.47929204
[H][C@]12SC(C)(C)[C@@H](N1C(=O)[C@H]2NC(=O)C1(N)CCCCC1)C(O)=O,0.2536159,-0.24638411
