NO	PROTEIN	LIGAND	N_MODELS	MEAN(pKd)	STD(pKd)	MEAN(Kd,nM)	MEAN(kcal/mol)
1	1	1	20	7.807588	0.504849	15.574438	-10.678715
2	1	2	20	7.140190	0.522276	72.411889	-9.765892
3	1	3	20	7.319072	0.538746	47.965418	-10.010555
4	2	1	20	7.922627	0.514038	11.950128	-10.836059
5	2	2	20	7.483956	0.378790	32.812828	-10.236073
6	2	3	20	7.549477	0.545857	28.217815	-10.325688
