<?xml version="1.0" encoding="UTF-8"?>
<!DOCTYPE svg PUBLIC "-//W3C//DTD SVG 1.1//EN" "http://www.w3.org/Graphics/SVG/1.1/DTD/svg11.dtd">
<svg version="1.2" width="100mm" height="100mm" viewBox="0 0 10000 10000" preserveAspectRatio="xMidYMid" fill-rule="evenodd" stroke-width="28.222" stroke-linejoin="round" xmlns="http://www.w3.org/2000/svg" xmlns:ooo="http://xml.openoffice.org/svg/export" xmlns:xlink="http://www.w3.org/1999/xlink" xmlns:presentation="http://sun.com/xmlns/staroffice/presentation" xmlns:smil="http://www.w3.org/2001/SMIL20/" xmlns:anim="urn:oasis:names:tc:opendocument:xmlns:animation:1.0" xml:space="preserve">
 <defs class="ClipPathGroup">
  <clipPath id="presentation_clip_path" clipPathUnits="userSpaceOnUse">
   <rect x="0" y="0" width="10000" height="10000"/>
  </clipPath>
  <clipPath id="presentation_clip_path_shrink" clipPathUnits="userSpaceOnUse">
   <rect x="10" y="10" width="9980" height="9980"/>
  </clipPath>
 </defs>
 <defs class="TextShapeIndex">
  <g ooo:slide="id1" ooo:id-list="id3 id4 id5 id6 id7 id8 id9 id10 id11 id12 id13 id14 id15 id16 id17 id18 id19 id20 id21 id22 id23"/>
 </defs>
 <defs class="EmbeddedBulletChars">
  <g id="bullet-char-template-57356" transform="scale(0.00048828125,-0.00048828125)">
   <path d="M 580,1141 L 1163,571 580,0 -4,571 580,1141 Z"/>
  </g>
  <g id="bullet-char-template-57354" transform="scale(0.00048828125,-0.00048828125)">
   <path d="M 8,1128 L 1137,1128 1137,0 8,0 8,1128 Z"/>
  </g>
  <g id="bullet-char-template-10146" transform="scale(0.00048828125,-0.00048828125)">
   <path d="M 174,0 L 602,739 174,1481 1456,739 174,0 Z M 1358,739 L 309,1346 659,739 1358,739 Z"/>
  </g>
  <g id="bullet-char-template-10132" transform="scale(0.00048828125,-0.00048828125)">
   <path d="M 2015,739 L 1276,0 717,0 1260,543 174,543 174,936 1260,936 717,1481 1274,1481 2015,739 Z"/>
  </g>
  <g id="bullet-char-template-10007" transform="scale(0.00048828125,-0.00048828125)">
   <path d="M 0,-2 C -7,14 -16,27 -25,37 L 356,567 C 262,823 215,952 215,954 215,979 228,992 255,992 264,992 276,990 289,987 310,991 331,999 354,1012 L 381,999 492,748 772,1049 836,1024 860,1049 C 881,1039 901,1025 922,1006 886,937 835,863 770,784 769,783 710,716 594,584 L 774,223 C 774,196 753,168 711,139 L 727,119 C 717,90 699,76 672,76 641,76 570,178 457,381 L 164,-76 C 142,-110 111,-127 72,-127 30,-127 9,-110 8,-76 1,-67 -2,-52 -2,-32 -2,-23 -1,-13 0,-2 Z"/>
  </g>
  <g id="bullet-char-template-10004" transform="scale(0.00048828125,-0.00048828125)">
   <path d="M 285,-33 C 182,-33 111,30 74,156 52,228 41,333 41,471 41,549 55,616 82,672 116,743 169,778 240,778 293,778 328,747 346,684 L 369,508 C 377,444 397,411 428,410 L 1163,1116 C 1174,1127 1196,1133 1229,1133 1271,1133 1292,1118 1292,1087 L 1292,965 C 1292,929 1282,901 1262,881 L 442,47 C 390,-6 338,-33 285,-33 Z"/>
  </g>
  <g id="bullet-char-template-9679" transform="scale(0.00048828125,-0.00048828125)">
   <path d="M 813,0 C 632,0 489,54 383,161 276,268 223,411 223,592 223,773 276,916 383,1023 489,1130 632,1184 813,1184 992,1184 1136,1130 1245,1023 1353,916 1407,772 1407,592 1407,412 1353,268 1245,161 1136,54 992,0 813,0 Z"/>
  </g>
  <g id="bullet-char-template-8226" transform="scale(0.00048828125,-0.00048828125)">
   <path d="M 346,457 C 273,457 209,483 155,535 101,586 74,649 74,723 74,796 101,859 155,911 209,963 273,989 346,989 419,989 480,963 531,910 582,859 608,796 608,723 608,648 583,586 532,535 482,483 420,457 346,457 Z"/>
  </g>
  <g id="bullet-char-template-8211" transform="scale(0.00048828125,-0.00048828125)">
   <path d="M -4,459 L 1135,459 1135,606 -4,606 -4,459 Z"/>
  </g>
  <g id="bullet-char-template-61548" transform="scale(0.00048828125,-0.00048828125)">
   <path d="M 173,740 C 173,903 231,1043 346,1159 462,1274 601,1332 765,1332 928,1332 1067,1274 1183,1159 1299,1043 1357,903 1357,740 1357,577 1299,437 1183,322 1067,206 928,148 765,148 601,148 462,206 346,322 231,437 173,577 173,740 Z"/>
  </g>
 </defs>
 <defs class="TextEmbeddedBitmaps"/>
 <g>
  <g id="id2" class="Master_Slide">
   <g id="bg-id2" class="Background"/>
   <g id="bo-id2" class="BackgroundObjects"/>
  </g>
 </g>
 <g class="SlideGroup">
  <g>
   <g id="container-id1">
    <g id="id1" class="Slide" clip-path="url(#presentation_clip_path)">
     <g class="Page">
      <g class="Group">
       <g class="Graphic">
        <title>Hand Left
        </title>
        <g id="id3">
         <rect class="BoundingBox" stroke="none" fill="none" x="210" y="-1041" width="11939" height="11942"/>
         <path fill="none" stroke="rgb(0,0,0)" stroke-width="533" stroke-linejoin="round" stroke-linecap="round" d="M 3560,8137 L 1843,5758 1843,5758 C 1785,5678 1754,5598 1744,5500 1735,5402 1748,5317 1789,5227 1829,5138 1883,5071 1963,5013 L 1963,5013 1963,5013 C 2043,4956 2123,4925 2221,4915 2319,4905 2404,4919 2494,4959 2583,4999 2650,5054 2708,5133 L 2708,5133 3800,6647"/>
         <path fill="none" stroke="rgb(0,0,0)" stroke-width="533" stroke-linejoin="round" stroke-linecap="round" d="M 3800,6647 L 2083,4268 2083,4268 C 2026,4189 1995,4108 1985,4010 1975,3913 1989,3827 2029,3738 2069,3648 2124,3581 2204,3524 L 2204,3524 2204,3524 C 2283,3466 2364,3435 2462,3425 2559,3416 2645,3429 2734,3469 2824,3510 2891,3564 2948,3644 L 2948,3644 4509,5806"/>
         <path fill="none" stroke="rgb(0,0,0)" stroke-width="533" stroke-linejoin="round" stroke-linecap="round" d="M 5384,5195 L 3969,3236 3969,3236 C 3912,3156 3881,3075 3871,2978 3861,2880 3875,2795 3915,2705 3956,2615 4010,2548 4090,2491 L 4090,2491 4090,2491 C 4169,2433 4250,2403 4348,2393 4446,2383 4531,2396 4620,2437 4710,2477 4777,2531 4834,2611 L 4834,2611 7020,5639"/>
         <path fill="none" stroke="rgb(0,0,0)" stroke-width="533" stroke-linejoin="round" stroke-linecap="round" d="M 4509,5806 L 2636,3211 2636,3211 C 2579,3132 2548,3051 2538,2953 2528,2856 2542,2770 2582,2681 2622,2591 2677,2524 2756,2467 L 2756,2467 2756,2467 C 2836,2409 2917,2378 3015,2368 3112,2358 3198,2372 3287,2412 3377,2453 3444,2507 3501,2587 L 3501,2587 5374,5182"/>
         <path fill="none" stroke="rgb(0,0,0)" stroke-width="533" stroke-linejoin="round" stroke-linecap="round" d="M 3560,8137 C 4705,9724 6141,9891 7331,9032 8520,8174 8617,7290 8419,6438 L 7726,3977 C 7640,3668 7436,3471 7141,3504 L 7141,3504 C 6845,3536 6613,3796 6656,4094 L 7020,5639"/>
        </g>
       </g>
       <g class="Group">
        <g class="com.sun.star.drawing.CustomShape">
         <g id="id4">
          <rect class="BoundingBox" stroke="none" fill="none" x="5444" y="1679" width="2844" height="3041"/>
          <path fill="rgb(255,255,255)" stroke="none" d="M 5892,1711 C 6145,1544 6760,2061 7312,2904 7863,3748 8091,4520 7838,4687 7585,4854 6970,4337 6418,3494 5867,2650 5639,1878 5892,1711 Z M 5445,2006 L 5445,2006 Z M 8286,4393 L 8286,4393 Z"/>
          <path fill="none" stroke="rgb(255,255,255)" d="M 5892,1711 C 6145,1544 6760,2061 7312,2904 7863,3748 8091,4520 7838,4687 7585,4854 6970,4337 6418,3494 5867,2650 5639,1878 5892,1711 Z"/>
          <path fill="none" stroke="rgb(255,255,255)" d="M 5445,2006 L 5445,2006 Z"/>
          <path fill="none" stroke="rgb(255,255,255)" d="M 8286,4393 L 8286,4393 Z"/>
         </g>
        </g>
        <g class="Group">
         <g class="Group">
          <g class="com.sun.star.drawing.CustomShape">
           <g id="id5">
            <rect class="BoundingBox" stroke="none" fill="none" x="2110" y="3065" width="7908" height="5965"/>
            <path fill="rgb(255,255,255)" stroke="none" d="M 3811,3489 C 4774,2642 6486,3102 7763,4552 9040,6002 9278,7758 8315,8605 7352,9452 5640,8992 4363,7542 3086,6092 2848,4336 3811,3489 Z M 2111,4984 L 2111,4984 Z M 10016,7110 L 10016,7110 Z"/>
            <path fill="none" stroke="rgb(250,166,26)" d="M 3811,3489 C 4774,2642 6486,3102 7763,4552 9040,6002 9278,7758 8315,8605 7352,9452 5640,8992 4363,7542 3086,6092 2848,4336 3811,3489 Z"/>
            <path fill="none" stroke="rgb(250,166,26)" d="M 2111,4984 L 2111,4984 Z"/>
            <path fill="none" stroke="rgb(250,166,26)" d="M 10016,7110 L 10016,7110 Z"/>
           </g>
          </g>
          <g class="com.sun.star.drawing.CustomShape">
           <g id="id6">
            <rect class="BoundingBox" stroke="none" fill="none" x="7419" y="3141" width="2051" height="4655"/>
            <path fill="rgb(255,255,255)" stroke="none" d="M 8857,7681 L 8246,7794 7420,3370 8642,3142 9468,7567 8857,7681 Z"/>
            <path fill="none" stroke="rgb(255,255,255)" d="M 8857,7681 L 8246,7794 7420,3370 8642,3142 9468,7567 8857,7681 Z"/>
           </g>
          </g>
          <g class="com.sun.star.drawing.CustomShape">
           <g id="id7">
            <rect class="BoundingBox" stroke="none" fill="none" x="4532" y="2132" width="1764" height="1895"/>
            <path fill="rgb(255,255,255)" stroke="none" d="M 5413,2133 C 5912,2133 6293,2542 6293,3078 6293,3614 5912,4024 5413,4024 4914,4024 4533,3614 4533,3078 4533,2542 4914,2133 5413,2133 Z M 4533,2133 L 4533,2133 Z M 6294,4025 L 6294,4025 Z"/>
            <path fill="none" stroke="rgb(255,255,255)" d="M 5413,2133 C 5912,2133 6293,2542 6293,3078 6293,3614 5912,4024 5413,4024 4914,4024 4533,3614 4533,3078 4533,2542 4914,2133 5413,2133 Z"/>
            <path fill="none" stroke="rgb(255,255,255)" d="M 4533,2133 L 4533,2133 Z"/>
            <path fill="none" stroke="rgb(255,255,255)" d="M 6294,4025 L 6294,4025 Z"/>
           </g>
          </g>
          <g class="com.sun.star.drawing.CustomShape">
           <g id="id8">
            <rect class="BoundingBox" stroke="none" fill="none" x="3586" y="2256" width="1451" height="1269"/>
            <path fill="rgb(255,255,255)" stroke="none" d="M 4311,3523 L 3587,3523 3587,2257 5035,2257 5035,3523 4311,3523 Z"/>
            <path fill="none" stroke="rgb(255,255,255)" d="M 4311,3523 L 3587,3523 3587,2257 5035,2257 5035,3523 4311,3523 Z"/>
           </g>
          </g>
          <g class="com.sun.star.drawing.CustomShape">
           <g id="id9">
            <rect class="BoundingBox" stroke="none" fill="none" x="3079" y="3264" width="947" height="1016"/>
            <path fill="rgb(255,255,255)" stroke="none" d="M 3552,4278 L 3080,4278 3080,3265 4024,3265 4024,4278 3552,4278 Z"/>
            <path fill="none" stroke="rgb(255,255,255)" d="M 3552,4278 L 3080,4278 3080,3265 4024,3265 4024,4278 3552,4278 Z"/>
           </g>
          </g>
          <g class="com.sun.star.drawing.CustomShape">
           <g id="id10">
            <rect class="BoundingBox" stroke="none" fill="none" x="2828" y="4842" width="1263" height="884"/>
            <path fill="rgb(255,255,255)" stroke="none" d="M 3459,5724 L 2829,5724 2829,4843 4089,4843 4089,5724 3459,5724 Z"/>
            <path fill="none" stroke="rgb(255,255,255)" d="M 3459,5724 L 2829,5724 2829,4843 4089,4843 4089,5724 3459,5724 Z"/>
           </g>
          </g>
         </g>
         <g class="Graphic">
          <title>Hand Left
          </title>
          <g id="id11">
           <rect class="BoundingBox" stroke="none" fill="none" x="1119" y="-1458" width="11984" height="11979"/>
           <path fill="none" stroke="rgb(0,0,0)" stroke-width="533" stroke-linejoin="round" stroke-linecap="round" d="M 4563,7795 L 2792,5456 2792,5456 C 2733,5377 2701,5297 2688,5200 2676,5102 2688,5017 2726,4926 2764,4836 2818,4768 2896,4709 L 2896,4709 2896,4709 C 2974,4649 3054,4617 3152,4605 3249,4593 3335,4604 3425,4643 3516,4681 3584,4734 3643,4812 L 3643,4812 4770,6301"/>
           <path fill="none" stroke="rgb(0,0,0)" stroke-width="533" stroke-linejoin="round" stroke-linecap="round" d="M 4770,6301 L 2999,3962 2999,3962 C 2940,3883 2907,3803 2895,3706 2883,3608 2895,3523 2933,3432 2971,3342 3024,3274 3103,3214 L 3103,3214 3103,3214 C 3181,3155 3261,3123 3359,3111 3456,3098 3542,3110 3632,3148 3723,3187 3791,3240 3850,3318 L 3850,3318 5460,5445"/>
           <path fill="none" stroke="rgb(0,0,0)" stroke-width="533" stroke-linejoin="round" stroke-linecap="round" d="M 6321,4814 L 4862,2887 4862,2887 C 4803,2809 4770,2729 4758,2631 4746,2534 4758,2448 4796,2358 4834,2268 4887,2199 4965,2140 L 4965,2140 4965,2140 C 5044,2081 5124,2048 5221,2036 5319,2024 5404,2036 5495,2074 5585,2112 5654,2165 5713,2244 L 5713,2244 7967,5221"/>
           <path fill="none" stroke="rgb(0,0,0)" stroke-width="533" stroke-linejoin="round" stroke-linecap="round" d="M 5460,5445 L 3528,2893 3528,2893 C 3469,2814 3436,2734 3424,2637 3412,2540 3424,2454 3462,2364 3500,2273 3553,2205 3632,2146 L 3632,2146 3632,2146 C 3710,2086 3790,2054 3887,2042 3985,2030 4070,2041 4161,2080 4251,2118 4320,2171 4379,2249 L 4379,2249 6311,4801"/>
           <path fill="none" stroke="rgb(0,0,0)" stroke-width="533" stroke-linejoin="round" stroke-linecap="round" d="M 4563,7795 C 5745,9355 7185,9491 8355,8606 9525,7721 9602,6836 9384,5988 L 8636,3544 C 8543,3238 8334,3045 8039,3084 L 8039,3084 C 7744,3123 7519,3388 7568,3685 L 7967,5221"/>
          </g>
         </g>
        </g>
       </g>
       <g class="Group">
        <g class="Group">
         <g class="com.sun.star.drawing.CustomShape">
          <g id="id12">
           <rect class="BoundingBox" stroke="none" fill="none" x="4349" y="486" width="784" height="689"/>
           <path fill="rgb(0,0,0)" stroke="none" d="M 4939,1173 L 4350,768 4735,487 4939,1173 Z M 5131,1033 L 5131,1033 Z M 4350,768 L 4350,768 Z"/>
           <path fill="none" stroke="rgb(0,0,0)" d="M 4939,1173 L 4350,768 4735,487 4939,1173 Z"/>
           <path fill="none" stroke="rgb(0,0,0)" d="M 5131,1033 L 5131,1033 Z"/>
           <path fill="none" stroke="rgb(0,0,0)" d="M 4350,768 L 4350,768 Z"/>
          </g>
         </g>
         <g class="com.sun.star.drawing.CustomShape">
          <g id="id13">
           <rect class="BoundingBox" stroke="none" fill="none" x="4319" y="476" width="454" height="301"/>
           <path fill="rgb(0,0,0)" stroke="none" d="M 4580,678 C 4472,757 4375,794 4356,765 4337,735 4404,652 4512,573 4621,494 4718,457 4737,487 4756,516 4689,599 4580,678 Z M 4771,539 L 4771,539 Z M 4320,712 L 4320,712 Z"/>
           <path fill="none" stroke="rgb(0,0,0)" d="M 4580,678 C 4472,757 4375,794 4356,765 4337,735 4404,652 4512,573 4621,494 4718,457 4737,487 4756,516 4689,599 4580,678 Z"/>
           <path fill="none" stroke="rgb(0,0,0)" d="M 4771,539 L 4771,539 Z"/>
           <path fill="none" stroke="rgb(0,0,0)" d="M 4320,712 L 4320,712 Z"/>
          </g>
         </g>
        </g>
        <g class="Group">
         <g class="com.sun.star.drawing.CustomShape">
          <g id="id14">
           <rect class="BoundingBox" stroke="none" fill="none" x="5265" y="199" width="614" height="979"/>
           <path fill="rgb(0,0,0)" stroke="none" d="M 5427,1124 L 5266,200 5877,304 5427,1124 Z M 5732,1176 L 5732,1176 Z M 5266,200 L 5266,200 Z"/>
           <path fill="none" stroke="rgb(0,0,0)" d="M 5427,1124 L 5266,200 5877,304 5427,1124 Z"/>
           <path fill="none" stroke="rgb(0,0,0)" d="M 5732,1176 L 5732,1176 Z"/>
           <path fill="none" stroke="rgb(0,0,0)" d="M 5266,200 L 5266,200 Z"/>
          </g>
         </g>
         <g class="com.sun.star.drawing.CustomShape">
          <g id="id15">
           <rect class="BoundingBox" stroke="none" fill="none" x="5266" y="121" width="617" height="264"/>
           <path fill="rgb(0,0,0)" stroke="none" d="M 5559,331 C 5386,301 5259,245 5267,201 5276,157 5415,146 5589,175 5762,205 5889,261 5881,305 5872,349 5733,360 5559,331 Z M 5866,383 L 5866,383 Z M 5281,122 L 5281,122 Z"/>
           <path fill="none" stroke="rgb(0,0,0)" d="M 5559,331 C 5386,301 5259,245 5267,201 5276,157 5415,146 5589,175 5762,205 5889,261 5881,305 5872,349 5733,360 5559,331 Z"/>
           <path fill="none" stroke="rgb(0,0,0)" d="M 5866,383 L 5866,383 Z"/>
           <path fill="none" stroke="rgb(0,0,0)" d="M 5281,122 L 5281,122 Z"/>
          </g>
         </g>
        </g>
        <g class="Group">
         <g class="com.sun.star.drawing.CustomShape">
          <g id="id16">
           <rect class="BoundingBox" stroke="none" fill="none" x="5873" y="780" width="711" height="731"/>
           <path fill="rgb(0,0,0)" stroke="none" d="M 5874,1297 L 6367,781 6582,1207 5874,1297 Z M 5981,1509 L 5981,1509 Z M 6367,781 L 6367,781 Z"/>
           <path fill="none" stroke="rgb(0,0,0)" d="M 5874,1297 L 6367,781 6582,1207 5874,1297 Z"/>
           <path fill="none" stroke="rgb(0,0,0)" d="M 5981,1509 L 5981,1509 Z"/>
           <path fill="none" stroke="rgb(0,0,0)" d="M 6367,781 L 6367,781 Z"/>
          </g>
         </g>
         <g class="com.sun.star.drawing.CustomShape">
          <g id="id17">
           <rect class="BoundingBox" stroke="none" fill="none" x="6354" y="755" width="240" height="479"/>
           <path fill="rgb(0,0,0)" stroke="none" d="M 6422,1021 C 6362,901 6338,798 6367,784 6395,770 6464,850 6525,970 6585,1090 6609,1193 6580,1207 6552,1221 6483,1140 6422,1021 Z M 6529,1232 L 6529,1232 Z M 6419,756 L 6419,756 Z"/>
           <path fill="none" stroke="rgb(0,0,0)" d="M 6422,1021 C 6362,901 6338,798 6367,784 6395,770 6464,850 6525,970 6585,1090 6609,1193 6580,1207 6552,1221 6483,1140 6422,1021 Z"/>
           <path fill="none" stroke="rgb(0,0,0)" d="M 6529,1232 L 6529,1232 Z"/>
           <path fill="none" stroke="rgb(0,0,0)" d="M 6419,756 L 6419,756 Z"/>
          </g>
         </g>
        </g>
       </g>
       <g class="Group">
        <g class="Group">
         <g class="com.sun.star.drawing.CustomShape">
          <g id="id18">
           <rect class="BoundingBox" stroke="none" fill="none" x="324" y="3542" width="714" height="724"/>
           <path fill="rgb(0,0,0)" stroke="none" d="M 1036,3759 L 527,4264 325,3832 1036,3759 Z M 935,3543 L 935,3543 Z M 527,4264 L 527,4264 Z"/>
           <path fill="none" stroke="rgb(0,0,0)" d="M 1036,3759 L 527,4264 325,3832 1036,3759 Z"/>
           <path fill="none" stroke="rgb(0,0,0)" d="M 935,3543 L 935,3543 Z"/>
           <path fill="none" stroke="rgb(0,0,0)" d="M 527,4264 L 527,4264 Z"/>
          </g>
         </g>
         <g class="com.sun.star.drawing.CustomShape">
          <g id="id19">
           <rect class="BoundingBox" stroke="none" fill="none" x="314" y="3807" width="230" height="481"/>
           <path fill="rgb(0,0,0)" stroke="none" d="M 481,4022 C 537,4144 558,4247 529,4260 500,4273 433,4190 376,4069 320,3948 299,3844 328,3831 357,3818 424,3901 481,4022 Z M 380,3808 L 380,3808 Z M 476,4286 L 476,4286 Z"/>
           <path fill="none" stroke="rgb(0,0,0)" d="M 481,4022 C 537,4144 558,4247 529,4260 500,4273 433,4190 376,4069 320,3948 299,3844 328,3831 357,3818 424,3901 481,4022 Z"/>
           <path fill="none" stroke="rgb(0,0,0)" d="M 380,3808 L 380,3808 Z"/>
           <path fill="none" stroke="rgb(0,0,0)" d="M 476,4286 L 476,4286 Z"/>
          </g>
         </g>
        </g>
        <g class="Group">
         <g class="com.sun.star.drawing.CustomShape">
          <g id="id20">
           <rect class="BoundingBox" stroke="none" fill="none" x="147" y="2675" width="1046" height="602"/>
           <path fill="rgb(0,0,0)" stroke="none" d="M 1081,3275 L 148,3258 368,2676 1081,3275 Z M 1191,2984 L 1191,2984 Z M 148,3258 L 148,3258 Z"/>
           <path fill="none" stroke="rgb(0,0,0)" d="M 1081,3275 L 148,3258 368,2676 1081,3275 Z"/>
           <path fill="none" stroke="rgb(0,0,0)" d="M 1191,2984 L 1191,2984 Z"/>
           <path fill="none" stroke="rgb(0,0,0)" d="M 148,3258 L 148,3258 Z"/>
          </g>
         </g>
         <g class="com.sun.star.drawing.CustomShape">
          <g id="id21">
           <rect class="BoundingBox" stroke="none" fill="none" x="71" y="2668" width="366" height="582"/>
           <path fill="rgb(0,0,0)" stroke="none" d="M 327,2987 C 265,3150 186,3263 146,3246 105,3230 121,3091 182,2929 243,2766 322,2654 363,2671 403,2687 388,2825 327,2987 Z M 435,2700 L 435,2700 Z M 72,3217 L 72,3217 Z"/>
           <path fill="none" stroke="rgb(0,0,0)" d="M 327,2987 C 265,3150 186,3263 146,3246 105,3230 121,3091 182,2929 243,2766 322,2654 363,2671 403,2687 388,2825 327,2987 Z"/>
           <path fill="none" stroke="rgb(0,0,0)" d="M 435,2700 L 435,2700 Z"/>
           <path fill="none" stroke="rgb(0,0,0)" d="M 72,3217 L 72,3217 Z"/>
          </g>
         </g>
        </g>
        <g class="Group">
         <g class="com.sun.star.drawing.CustomShape">
          <g id="id22">
           <rect class="BoundingBox" stroke="none" fill="none" x="923" y="2155" width="649" height="718"/>
           <path fill="rgb(0,0,0)" stroke="none" d="M 1340,2871 L 924,2286 1384,2156 1340,2871 Z M 1570,2806 L 1570,2806 Z M 924,2286 L 924,2286 Z"/>
           <path fill="none" stroke="rgb(0,0,0)" d="M 1340,2871 L 924,2286 1384,2156 1340,2871 Z"/>
           <path fill="none" stroke="rgb(0,0,0)" d="M 1570,2806 L 1570,2806 Z"/>
           <path fill="none" stroke="rgb(0,0,0)" d="M 924,2286 L 924,2286 Z"/>
          </g>
         </g>
         <g class="com.sun.star.drawing.CustomShape">
          <g id="id23">
           <rect class="BoundingBox" stroke="none" fill="none" x="904" y="2129" width="501" height="178"/>
           <path fill="rgb(0,0,0)" stroke="none" d="M 1173,2274 C 1042,2311 934,2315 924,2283 914,2250 1007,2197 1138,2160 1268,2123 1375,2120 1385,2153 1395,2185 1304,2237 1173,2274 Z M 1403,2209 L 1403,2209 Z M 905,2225 L 905,2225 Z"/>
           <path fill="none" stroke="rgb(0,0,0)" d="M 1173,2274 C 1042,2311 934,2315 924,2283 914,2250 1007,2197 1138,2160 1268,2123 1375,2120 1385,2153 1395,2185 1304,2237 1173,2274 Z"/>
           <path fill="none" stroke="rgb(0,0,0)" d="M 1403,2209 L 1403,2209 Z"/>
           <path fill="none" stroke="rgb(0,0,0)" d="M 905,2225 L 905,2225 Z"/>
          </g>
         </g>
        </g>
       </g>
      </g>
     </g>
    </g>
   </g>
  </g>
 </g>
</svg>