Place,Name,Sex,Age,Country,State,Equipment,Division,BodyweightKg,WeightClassKg,Squat1Kg,Squat2Kg,Squat3Kg,Best3SquatKg,Bench1Kg,Bench2Kg,Bench3Kg,Best3BenchKg,Deadlift1Kg,Deadlift2Kg,Deadlift3Kg,Best3DeadliftKg,TotalKg,Event,BirthDate
1,Holly Nupcharoen,F,45,USA,WA,Raw,M45-49,88.2,90,100,107.5,-115,107.5,67.5,70,-75,70,127.5,135,142.5,142.5,320,SBD,
1,Cary Vanos,F,48,USA,WA,Raw,M45-49,91.1,100,85,95,100,100,50,-55,55,55,115,130,-137.5,130,285,SBD,
1,Rachel Zenk,F,25,USA,WA,Raw,Open,50.8,52,105,112.5,115,115,70,75,77.5,77.5,115,-122.5,-122.5,115,307.5,SBD,
1,Erin Westby,F,29,USA,WA,Raw,Open,67.3,67.5,182.5,195,-202.5,195,95,100,105,105,192.5,202.5,210,210,510,SBD,
2,Precious Andrew,F,36,USA,WA,Raw,Open,67.05,67.5,155,165,170,170,97.5,102.5,-105,102.5,182.5,197.5,-202.5,197.5,470,SBD,
1,Manda Wolf,F,32,USA,WA,Wraps,Open,74.45,75,182.5,197.5,-205,197.5,122.5,-130,-130,122.5,200,215,-222.5,215,535,SBD,
2,Sarah O'Brien,F,29,USA,WA,Raw,Open,74.7,75,145,157.5,165,165,102.5,110,-115,110,165,175,182.5,182.5,457.5,SBD,
1,Holly Nupcharoen,F,45,USA,WA,Raw,Open,88.2,90,100,107.5,-115,107.5,67.5,70,-75,70,127.5,135,142.5,142.5,320,SBD,
2,Rachel Seath,F,32,USA,WA,Raw,Open,86.6,90,92.5,100,107.5,107.5,57.5,62.5,65,65,130,140,145,145,317.5,SBD,
1,Kayla Nipp,F,32,USA,WA,Raw,Open,93.2,100,-150,160,-172.5,160,85,92.5,-95,92.5,167.5,185,197.5,197.5,450,SBD,
2,Cyrenah Martinot,F,29,USA,WA,Raw,Open,97.5,100,147.5,157.5,-162.5,157.5,65,70,75,75,142.5,155,162.5,162.5,395,SBD,
3,Cary Vanos,F,48,USA,WA,Raw,Open,91.1,100,85,95,100,100,50,-55,55,55,115,130,-137.5,130,285,SBD,
1,Jack Curnow,M,48,USA,WA,Wraps,M45-49,122.55,125,220,-235,240,240,182.5,192.5,200,200,227.5,247.5,-257.5,247.5,687.5,SBD,
1,Kelson Chen,M,21,USA,WA,Raw,Open,68.35,75,175,192.5,205,205,142.5,157.5,-170,157.5,220,240,257.5,257.5,620,SBD,
1,Jordan Holesworth,F,29,USA,WA,Raw,Open,79.2,82.5,80,-90,95,95,75,-85,-85,75,125,140,-145,140,310,SBD,
1,Mackie Fleishman,M,35,,,Wraps,Open,90,90,-300,300,325,325,215,227.5,,227.5,300,-320,-320,300,852.5,SBD,
2,Mitch Bond,M,34,USA,WA,Raw,Open,88.4,90,215,225,235,235,142.5,150,155,155,240,252.5,265,265,655,SBD,
3,Shale Winston,M,19,USA,WA,Raw,Open,85.6,90,102.5,112.5,122.5,122.5,105,110,117.5,117.5,190,205,207.5,207.5,447.5,SBD,
1,Devon Porter,M,24,USA,WA,Wraps,Open,98.6,100,300,320,332.5,332.5,187.5,197.5,-202.5,197.5,320,335,345,345,875,SBD,
2,Matt Scroggin,M,28,USA,WA,Raw,Open,97.4,100,265,280,285,285,160,175,182.5,182.5,300,325,-332.5,325,792.5,SBD,
3,Cameron Martinot,M,31,USA,WA,Wraps,Open,98.8,100,290,305,-312.5,305,177.5,187.5,-192.5,187.5,282.5,-305,-305,282.5,775,SBD,
4,Kyle Lopez,M,37,USA,WA,Raw,Open,99.35,100,175,185,200,200,130,137.5,145,145,215,232.5,250,250,595,SBD,
5,Adam Roach,M,34,,,Raw,Open,90.5,100,-125,-125,125,125,100,107.5,-112.5,107.5,150,160,170,170,402.5,SBD,
1,Zane Johnson,M,25,USA,WA,Raw,Open,100.9,110,240,257.5,267.5,267.5,167.5,175,182.5,182.5,267.5,282.5,295,295,745,SBD,
2,Chasen Zeits,M,25,USA,WA,Raw,Open,104.8,110,205,225,235,235,140,150,-155,150,220,240,255,255,640,SBD,
1,Gabriel Vega,M,27,USA,WA,Wraps,Open,123.9,125,375,-390,-390,375,210,217.5,-222.5,217.5,325,-335,,325,917.5,SBD,
2,Colton O'Brien,M,31,USA,WA,Raw,Open,116,125,-227.5,237.5,250,250,170,180,-185,180,282.5,305,-320,305,735,SBD,
3,Jack Curnow,M,48,USA,WA,Wraps,Open,122.55,125,220,-235,240,240,182.5,192.5,200,200,227.5,247.5,-257.5,247.5,687.5,SBD,
4,Jeffery Harwell,M,37,USA,WA,Raw,Open,114.3,125,237.5,250,262.5,262.5,137.5,150,157.5,157.5,242.5,260,-272.5,260,680,SBD,
5,Manuel Guiterrez,M,30,USA,WA,Raw,Open,120,125,235,242.5,-250,242.5,175,182.5,190,190,222.5,235,245,245,677.5,SBD,
6,Joel Robles,M,17,USA,WA,Raw,Open,120.2,125,220,235,245,245,135,147.5,-157.5,147.5,282.5,-305,-305,282.5,675,SBD,
7,Jeff Smith,M,42,USA,WA,Raw,Open,116.35,125,205,-220,-230,205,165,175,185,185,235,252.5,272.5,272.5,662.5,SBD,
8,David Georges #2,M,24,USA,WA,Raw,Open,125,125,235,240,,240,155,160,-162.5,160,235,250,255,255,655,SBD,
DQ,Nathan Brandhorst,M,28,USA,WA,Raw,Open,128.2,140,325,345,-365,345,230,240,-250,240,,,,,,SBD,
1,Daniel Bell #1,M,35,USA,WA,Wraps,Open,177.5,140+,430,460,475,475,240,255,265,265,380,400,,400,1140,SBD,
2,Jordan Allman,M,31,USA,WA,Wraps,Open,173.5,140+,365,385,400,400,215,227.5,235,235,340,365,-375,365,1000,SBD,
3,Bryan Gifford,M,32,USA,WA,Raw,Open,145,140+,345,365,-375,365,200,212.5,217.5,217.5,320,345,355,355,937.5,SBD,
4,David Osborn #1,M,34,USA,WA,Wraps,Open,142.95,140+,325,345,-365,345,227.5,-235,-242.5,227.5,305,320,-337.5,320,892.5,SBD,
1,Joel Robles,M,17,USA,WA,Raw,J17-19,120.2,125,220,235,245,245,135,147.5,-157.5,147.5,282.5,-305,-305,282.5,675,SBD,
