26 93 3
65520 30 200
2	1	65596	0	400
2	7	65513	2.9680841411	200
2	14	65513	6.5694507959	200
2	13	65496	1.5482177111	100
3	1	4	0	100
3	13	65526	1.5482177111	200
3	23	65506	3.3224805223	200
3	25	65512	1.81515217	100
3	15	65527	3.0244990875	300
4	6	65495	3.3786585202	100
4	8	65507	7.2851069055	200
5	20	65515	8.3062922366	100
6	4	65495	3.3533387641	100
6	22	65508	2.8697906664	100
6	12	65511	2.2091310402	200
6	19	65512	1.7104380103	100
6	8	65509	7.2851069055	100
7	2	65513	3.3355703195	200
7	14	65501	6.5694507959	200
8	17	4	4.7263025169	50
8	25	65504	1.81515217	200
8	19	65527	1.7104380103	100
8	12	65492	2.2091310402	150
9	12	65493	2.2091310402	150
9	15	65520	3.0244990875	200
9	13	65512	1.5482177111	100
9	18	65495	4.5092915321	100
10	21	65506	5.3845877058	100
10	24	65527	3.0799788719	200
10	26	65514	3.0754318633	100
11	1	4	0	200
11	23	65502	3.3224805223	200
12	19	65533	1.7104380103	150
12	8	65492	7.2851069055	150
12	25	65501	1.81515217	200
12	3	65496	3.877455285	100
12	15	65527	3.0244990875	100
12	9	65493	2.9990398814	150
12	6	65511	3.3786585202	200
13	1	4	0	200
13	2	65494	3.3355703195	100
13	3	65526	3.877455285	200
13	9	65512	2.9990398814	100
13	14	65520	6.5694507959	200
13	15	65526	3.0244990875	100
14	2	65531	3.3355703195	200
14	7	65501	2.9680841411	200
14	13	65520	1.5482177111	200
15	3	65527	3.877455285	300
15	12	65527	2.2091310402	100
15	13	65526	1.5482177111	100
15	9	65520	2.9990398814	100
15	19	65502	1.7104380103	200
15	25	65495	1.81515217	200
16	18	65494	4.5092915321	100
17	8	4	7.2851069055	50
17	19	65515	1.7104380103	200
17	25	65516	1.81515217	100
18	9	65495	2.9990398814	100
18	16	65494	2.4017335602	100
18	14	65494	6.5694507959	200
19	3	65492	3.877455285	100
19	12	65533	2.2091310402	200
19	15	65502	3.0244990875	200
19	25	65527	1.81515217	100
19	8	65527	7.2851069055	100
19	17	65515	4.7263025169	100
19	6	65512	3.3786585202	100
20	5	65515	2.6195978249	100
20	21	65488	5.3845877058	100
20	26	65497	3.0754318633	100
20	17	65511	4.7263025169	150
20	8	65493	7.2851069055	100
21	26	65525	3.0754318633	100
21	10	65506	2.8299405375	100
21	24	65512	3.0799788719	100
22	6	65508	3.3786585202	100
22	12	65510	2.2091310402	150
23	1	4	0	200
23	11	65502	1.8354089594	200
23	3	65503	3.877455285	200
23	25	65526	1.81515217	200
24	21	65512	5.3845877058	100
24	10	65527	2.8299405375	100
25	1	4	0	100
25	3	65512	3.877455285	100
25	15	65495	3.0244990875	200
25	12	65501	2.2091310402	200
25	19	65527	1.7104380103	100
25	23	65526	3.3224805223	150
25	8	65504	7.2851069055	200
25	17	65516	4.7263025169	100
26	20	65497	8.3062922366	100
26	21	65525	5.3845877058	100
26	10	65514	2.8299405375	100