6 16 4
1 2 1 4 2 9
1 4 6 9 8 1
2 1 7 8 10 2
2 6 1 8 1 10
3 4 5 1 8 10
3 5 2 5 1 9
3 6 6 7 10 4
4 1 4 5 9 6
4 3 8 7 7 4
4 6 8 5 6 7
5 3 8 2 9 7
5 6 10 8 1 6
6 2 1 6 9 8
6 3 1 10 10 9
6 4 3 5 6 10
6 5 5 6 6 7