%!PS-Adobe-3.0 EPSF-3.0
%%BoundingBox: 0 0 200 200
1 1 1 setrgbcolor
0 200 moveto
0 -200 rlineto 200 0 rlineto 0 200 rlineto closepath
fill
0 0 0 setrgbcolor
0 200 moveto
0 -8 rlineto 8 0 rlineto 0 8 rlineto closepath
fill
8 200 moveto
0 -8 rlineto 8 0 rlineto 0 8 rlineto closepath
fill
16 200 moveto
0 -8 rlineto 8 0 rlineto 0 8 rlineto closepath
fill
24 200 moveto
0 -8 rlineto 8 0 rlineto 0 8 rlineto closepath
fill
32 200 moveto
0 -8 rlineto 8 0 rlineto 0 8 rlineto closepath
fill
40 200 moveto
0 -8 rlineto 8 0 rlineto 0 8 rlineto closepath
fill
48 200 moveto
0 -8 rlineto 8 0 rlineto 0 8 rlineto closepath
fill
80 200 moveto
0 -8 rlineto 8 0 rlineto 0 8 rlineto closepath
fill
104 200 moveto
0 -8 rlineto 8 0 rlineto 0 8 rlineto closepath
fill
112 200 moveto
0 -8 rlineto 8 0 rlineto 0 8 rlineto closepath
fill
144 200 moveto
0 -8 rlineto 8 0 rlineto 0 8 rlineto closepath
fill
152 200 moveto
0 -8 rlineto 8 0 rlineto 0 8 rlineto closepath
fill
160 200 moveto
0 -8 rlineto 8 0 rlineto 0 8 rlineto closepath
fill
168 200 moveto
0 -8 rlineto 8 0 rlineto 0 8 rlineto closepath
fill
176 200 moveto
0 -8 rlineto 8 0 rlineto 0 8 rlineto closepath
fill
184 200 moveto
0 -8 rlineto 8 0 rlineto 0 8 rlineto closepath
fill
192 200 moveto
0 -8 rlineto 8 0 rlineto 0 8 rlineto closepath
fill
0 192 moveto
0 -8 rlineto 8 0 rlineto 0 8 rlineto closepath
fill
48 192 moveto
0 -8 rlineto 8 0 rlineto 0 8 rlineto closepath
fill
72 192 moveto
0 -8 rlineto 8 0 rlineto 0 8 rlineto closepath
fill
80 192 moveto
0 -8 rlineto 8 0 rlineto 0 8 rlineto closepath
fill
112 192 moveto
0 -8 rlineto 8 0 rlineto 0 8 rlineto closepath
fill
144 192 moveto
0 -8 rlineto 8 0 rlineto 0 8 rlineto closepath
fill
192 192 moveto
0 -8 rlineto 8 0 rlineto 0 8 rlineto closepath
fill
0 184 moveto
0 -8 rlineto 8 0 rlineto 0 8 rlineto closepath
fill
16 184 moveto
0 -8 rlineto 8 0 rlineto 0 8 rlineto closepath
fill
24 184 moveto
0 -8 rlineto 8 0 rlineto 0 8 rlineto closepath
fill
32 184 moveto
0 -8 rlineto 8 0 rlineto 0 8 rlineto closepath
fill
48 184 moveto
0 -8 rlineto 8 0 rlineto 0 8 rlineto closepath
fill
72 184 moveto
0 -8 rlineto 8 0 rlineto 0 8 rlineto closepath
fill
80 184 moveto
0 -8 rlineto 8 0 rlineto 0 8 rlineto closepath
fill
88 184 moveto
0 -8 rlineto 8 0 rlineto 0 8 rlineto closepath
fill
96 184 moveto
0 -8 rlineto 8 0 rlineto 0 8 rlineto closepath
fill
112 184 moveto
0 -8 rlineto 8 0 rlineto 0 8 rlineto closepath
fill
120 184 moveto
0 -8 rlineto 8 0 rlineto 0 8 rlineto closepath
fill
128 184 moveto
0 -8 rlineto 8 0 rlineto 0 8 rlineto closepath
fill
144 184 moveto
0 -8 rlineto 8 0 rlineto 0 8 rlineto closepath
fill
160 184 moveto
0 -8 rlineto 8 0 rlineto 0 8 rlineto closepath
fill
168 184 moveto
0 -8 rlineto 8 0 rlineto 0 8 rlineto closepath
fill
176 184 moveto
0 -8 rlineto 8 0 rlineto 0 8 rlineto closepath
fill
192 184 moveto
0 -8 rlineto 8 0 rlineto 0 8 rlineto closepath
fill
0 176 moveto
0 -8 rlineto 8 0 rlineto 0 8 rlineto closepath
fill
16 176 moveto
0 -8 rlineto 8 0 rlineto 0 8 rlineto closepath
fill
24 176 moveto
0 -8 rlineto 8 0 rlineto 0 8 rlineto closepath
fill
32 176 moveto
0 -8 rlineto 8 0 rlineto 0 8 rlineto closepath
fill
48 176 moveto
0 -8 rlineto 8 0 rlineto 0 8 rlineto closepath
fill
64 176 moveto
0 -8 rlineto 8 0 rlineto 0 8 rlineto closepath
fill
72 176 moveto
0 -8 rlineto 8 0 rlineto 0 8 rlineto closepath
fill
96 176 moveto
0 -8 rlineto 8 0 rlineto 0 8 rlineto closepath
fill
104 176 moveto
0 -8 rlineto 8 0 rlineto 0 8 rlineto closepath
fill
128 176 moveto
0 -8 rlineto 8 0 rlineto 0 8 rlineto closepath
fill
144 176 moveto
0 -8 rlineto 8 0 rlineto 0 8 rlineto closepath
fill
160 176 moveto
0 -8 rlineto 8 0 rlineto 0 8 rlineto closepath
fill
168 176 moveto
0 -8 rlineto 8 0 rlineto 0 8 rlineto closepath
fill
176 176 moveto
0 -8 rlineto 8 0 rlineto 0 8 rlineto closepath
fill
192 176 moveto
0 -8 rlineto 8 0 rlineto 0 8 rlineto closepath
fill
0 168 moveto
0 -8 rlineto 8 0 rlineto 0 8 rlineto closepath
fill
16 168 moveto
0 -8 rlineto 8 0 rlineto 0 8 rlineto closepath
fill
24 168 moveto
0 -8 rlineto 8 0 rlineto 0 8 rlineto closepath
fill
32 168 moveto
0 -8 rlineto 8 0 rlineto 0 8 rlineto closepath
fill
48 168 moveto
0 -8 rlineto 8 0 rlineto 0 8 rlineto closepath
fill
64 168 moveto
0 -8 rlineto 8 0 rlineto 0 8 rlineto closepath
fill
88 168 moveto
0 -8 rlineto 8 0 rlineto 0 8 rlineto closepath
fill
104 168 moveto
0 -8 rlineto 8 0 rlineto 0 8 rlineto closepath
fill
128 168 moveto
0 -8 rlineto 8 0 rlineto 0 8 rlineto closepath
fill
144 168 moveto
0 -8 rlineto 8 0 rlineto 0 8 rlineto closepath
fill
160 168 moveto
0 -8 rlineto 8 0 rlineto 0 8 rlineto closepath
fill
168 168 moveto
0 -8 rlineto 8 0 rlineto 0 8 rlineto closepath
fill
176 168 moveto
0 -8 rlineto 8 0 rlineto 0 8 rlineto closepath
fill
192 168 moveto
0 -8 rlineto 8 0 rlineto 0 8 rlineto closepath
fill
0 160 moveto
0 -8 rlineto 8 0 rlineto 0 8 rlineto closepath
fill
48 160 moveto
0 -8 rlineto 8 0 rlineto 0 8 rlineto closepath
fill
80 160 moveto
0 -8 rlineto 8 0 rlineto 0 8 rlineto closepath
fill
96 160 moveto
0 -8 rlineto 8 0 rlineto 0 8 rlineto closepath
fill
104 160 moveto
0 -8 rlineto 8 0 rlineto 0 8 rlineto closepath
fill
112 160 moveto
0 -8 rlineto 8 0 rlineto 0 8 rlineto closepath
fill
144 160 moveto
0 -8 rlineto 8 0 rlineto 0 8 rlineto closepath
fill
192 160 moveto
0 -8 rlineto 8 0 rlineto 0 8 rlineto closepath
fill
0 152 moveto
0 -8 rlineto 8 0 rlineto 0 8 rlineto closepath
fill
8 152 moveto
0 -8 rlineto 8 0 rlineto 0 8 rlineto closepath
fill
16 152 moveto
0 -8 rlineto 8 0 rlineto 0 8 rlineto closepath
fill
24 152 moveto
0 -8 rlineto 8 0 rlineto 0 8 rlineto closepath
fill
32 152 moveto
0 -8 rlineto 8 0 rlineto 0 8 rlineto closepath
fill
40 152 moveto
0 -8 rlineto 8 0 rlineto 0 8 rlineto closepath
fill
48 152 moveto
0 -8 rlineto 8 0 rlineto 0 8 rlineto closepath
fill
64 152 moveto
0 -8 rlineto 8 0 rlineto 0 8 rlineto closepath
fill
80 152 moveto
0 -8 rlineto 8 0 rlineto 0 8 rlineto closepath
fill
96 152 moveto
0 -8 rlineto 8 0 rlineto 0 8 rlineto closepath
fill
112 152 moveto
0 -8 rlineto 8 0 rlineto 0 8 rlineto closepath
fill
128 152 moveto
0 -8 rlineto 8 0 rlineto 0 8 rlineto closepath
fill
144 152 moveto
0 -8 rlineto 8 0 rlineto 0 8 rlineto closepath
fill
152 152 moveto
0 -8 rlineto 8 0 rlineto 0 8 rlineto closepath
fill
160 152 moveto
0 -8 rlineto 8 0 rlineto 0 8 rlineto closepath
fill
168 152 moveto
0 -8 rlineto 8 0 rlineto 0 8 rlineto closepath
fill
176 152 moveto
0 -8 rlineto 8 0 rlineto 0 8 rlineto closepath
fill
184 152 moveto
0 -8 rlineto 8 0 rlineto 0 8 rlineto closepath
fill
192 152 moveto
0 -8 rlineto 8 0 rlineto 0 8 rlineto closepath
fill
80 144 moveto
0 -8 rlineto 8 0 rlineto 0 8 rlineto closepath
fill
88 144 moveto
0 -8 rlineto 8 0 rlineto 0 8 rlineto closepath
fill
120 144 moveto
0 -8 rlineto 8 0 rlineto 0 8 rlineto closepath
fill
128 144 moveto
0 -8 rlineto 8 0 rlineto 0 8 rlineto closepath
fill
0 136 moveto
0 -8 rlineto 8 0 rlineto 0 8 rlineto closepath
fill
8 136 moveto
0 -8 rlineto 8 0 rlineto 0 8 rlineto closepath
fill
40 136 moveto
0 -8 rlineto 8 0 rlineto 0 8 rlineto closepath
fill
48 136 moveto
0 -8 rlineto 8 0 rlineto 0 8 rlineto closepath
fill
56 136 moveto
0 -8 rlineto 8 0 rlineto 0 8 rlineto closepath
fill
72 136 moveto
0 -8 rlineto 8 0 rlineto 0 8 rlineto closepath
fill
88 136 moveto
0 -8 rlineto 8 0 rlineto 0 8 rlineto closepath
fill
96 136 moveto
0 -8 rlineto 8 0 rlineto 0 8 rlineto closepath
fill
104 136 moveto
0 -8 rlineto 8 0 rlineto 0 8 rlineto closepath
fill
112 136 moveto
0 -8 rlineto 8 0 rlineto 0 8 rlineto closepath
fill
160 136 moveto
0 -8 rlineto 8 0 rlineto 0 8 rlineto closepath
fill
168 136 moveto
0 -8 rlineto 8 0 rlineto 0 8 rlineto closepath
fill
0 128 moveto
0 -8 rlineto 8 0 rlineto 0 8 rlineto closepath
fill
8 128 moveto
0 -8 rlineto 8 0 rlineto 0 8 rlineto closepath
fill
40 128 moveto
0 -8 rlineto 8 0 rlineto 0 8 rlineto closepath
fill
72 128 moveto
0 -8 rlineto 8 0 rlineto 0 8 rlineto closepath
fill
80 128 moveto
0 -8 rlineto 8 0 rlineto 0 8 rlineto closepath
fill
88 128 moveto
0 -8 rlineto 8 0 rlineto 0 8 rlineto closepath
fill
96 128 moveto
0 -8 rlineto 8 0 rlineto 0 8 rlineto closepath
fill
104 128 moveto
0 -8 rlineto 8 0 rlineto 0 8 rlineto closepath
fill
112 128 moveto
0 -8 rlineto 8 0 rlineto 0 8 rlineto closepath
fill
120 128 moveto
0 -8 rlineto 8 0 rlineto 0 8 rlineto closepath
fill
136 128 moveto
0 -8 rlineto 8 0 rlineto 0 8 rlineto closepath
fill
152 128 moveto
0 -8 rlineto 8 0 rlineto 0 8 rlineto closepath
fill
160 128 moveto
0 -8 rlineto 8 0 rlineto 0 8 rlineto closepath
fill
168 128 moveto
0 -8 rlineto 8 0 rlineto 0 8 rlineto closepath
fill
176 128 moveto
0 -8 rlineto 8 0 rlineto 0 8 rlineto closepath
fill
184 128 moveto
0 -8 rlineto 8 0 rlineto 0 8 rlineto closepath
fill
8 120 moveto
0 -8 rlineto 8 0 rlineto 0 8 rlineto closepath
fill
16 120 moveto
0 -8 rlineto 8 0 rlineto 0 8 rlineto closepath
fill
24 120 moveto
0 -8 rlineto 8 0 rlineto 0 8 rlineto closepath
fill
32 120 moveto
0 -8 rlineto 8 0 rlineto 0 8 rlineto closepath
fill
48 120 moveto
0 -8 rlineto 8 0 rlineto 0 8 rlineto closepath
fill
56 120 moveto
0 -8 rlineto 8 0 rlineto 0 8 rlineto closepath
fill
80 120 moveto
0 -8 rlineto 8 0 rlineto 0 8 rlineto closepath
fill
104 120 moveto
0 -8 rlineto 8 0 rlineto 0 8 rlineto closepath
fill
120 120 moveto
0 -8 rlineto 8 0 rlineto 0 8 rlineto closepath
fill
128 120 moveto
0 -8 rlineto 8 0 rlineto 0 8 rlineto closepath
fill
144 120 moveto
0 -8 rlineto 8 0 rlineto 0 8 rlineto closepath
fill
152 120 moveto
0 -8 rlineto 8 0 rlineto 0 8 rlineto closepath
fill
168 120 moveto
0 -8 rlineto 8 0 rlineto 0 8 rlineto closepath
fill
184 120 moveto
0 -8 rlineto 8 0 rlineto 0 8 rlineto closepath
fill
192 120 moveto
0 -8 rlineto 8 0 rlineto 0 8 rlineto closepath
fill
16 112 moveto
0 -8 rlineto 8 0 rlineto 0 8 rlineto closepath
fill
24 112 moveto
0 -8 rlineto 8 0 rlineto 0 8 rlineto closepath
fill
72 112 moveto
0 -8 rlineto 8 0 rlineto 0 8 rlineto closepath
fill
112 112 moveto
0 -8 rlineto 8 0 rlineto 0 8 rlineto closepath
fill
168 112 moveto
0 -8 rlineto 8 0 rlineto 0 8 rlineto closepath
fill
192 112 moveto
0 -8 rlineto 8 0 rlineto 0 8 rlineto closepath
fill
24 104 moveto
0 -8 rlineto 8 0 rlineto 0 8 rlineto closepath
fill
40 104 moveto
0 -8 rlineto 8 0 rlineto 0 8 rlineto closepath
fill
48 104 moveto
0 -8 rlineto 8 0 rlineto 0 8 rlineto closepath
fill
56 104 moveto
0 -8 rlineto 8 0 rlineto 0 8 rlineto closepath
fill
64 104 moveto
0 -8 rlineto 8 0 rlineto 0 8 rlineto closepath
fill
72 104 moveto
0 -8 rlineto 8 0 rlineto 0 8 rlineto closepath
fill
88 104 moveto
0 -8 rlineto 8 0 rlineto 0 8 rlineto closepath
fill
96 104 moveto
0 -8 rlineto 8 0 rlineto 0 8 rlineto closepath
fill
120 104 moveto
0 -8 rlineto 8 0 rlineto 0 8 rlineto closepath
fill
128 104 moveto
0 -8 rlineto 8 0 rlineto 0 8 rlineto closepath
fill
144 104 moveto
0 -8 rlineto 8 0 rlineto 0 8 rlineto closepath
fill
152 104 moveto
0 -8 rlineto 8 0 rlineto 0 8 rlineto closepath
fill
192 104 moveto
0 -8 rlineto 8 0 rlineto 0 8 rlineto closepath
fill
0 96 moveto
0 -8 rlineto 8 0 rlineto 0 8 rlineto closepath
fill
24 96 moveto
0 -8 rlineto 8 0 rlineto 0 8 rlineto closepath
fill
40 96 moveto
0 -8 rlineto 8 0 rlineto 0 8 rlineto closepath
fill
72 96 moveto
0 -8 rlineto 8 0 rlineto 0 8 rlineto closepath
fill
88 96 moveto
0 -8 rlineto 8 0 rlineto 0 8 rlineto closepath
fill
120 96 moveto
0 -8 rlineto 8 0 rlineto 0 8 rlineto closepath
fill
128 96 moveto
0 -8 rlineto 8 0 rlineto 0 8 rlineto closepath
fill
152 96 moveto
0 -8 rlineto 8 0 rlineto 0 8 rlineto closepath
fill
184 96 moveto
0 -8 rlineto 8 0 rlineto 0 8 rlineto closepath
fill
0 88 moveto
0 -8 rlineto 8 0 rlineto 0 8 rlineto closepath
fill
40 88 moveto
0 -8 rlineto 8 0 rlineto 0 8 rlineto closepath
fill
48 88 moveto
0 -8 rlineto 8 0 rlineto 0 8 rlineto closepath
fill
96 88 moveto
0 -8 rlineto 8 0 rlineto 0 8 rlineto closepath
fill
112 88 moveto
0 -8 rlineto 8 0 rlineto 0 8 rlineto closepath
fill
120 88 moveto
0 -8 rlineto 8 0 rlineto 0 8 rlineto closepath
fill
136 88 moveto
0 -8 rlineto 8 0 rlineto 0 8 rlineto closepath
fill
152 88 moveto
0 -8 rlineto 8 0 rlineto 0 8 rlineto closepath
fill
160 88 moveto
0 -8 rlineto 8 0 rlineto 0 8 rlineto closepath
fill
168 88 moveto
0 -8 rlineto 8 0 rlineto 0 8 rlineto closepath
fill
184 88 moveto
0 -8 rlineto 8 0 rlineto 0 8 rlineto closepath
fill
192 88 moveto
0 -8 rlineto 8 0 rlineto 0 8 rlineto closepath
fill
0 80 moveto
0 -8 rlineto 8 0 rlineto 0 8 rlineto closepath
fill
16 80 moveto
0 -8 rlineto 8 0 rlineto 0 8 rlineto closepath
fill
24 80 moveto
0 -8 rlineto 8 0 rlineto 0 8 rlineto closepath
fill
40 80 moveto
0 -8 rlineto 8 0 rlineto 0 8 rlineto closepath
fill
56 80 moveto
0 -8 rlineto 8 0 rlineto 0 8 rlineto closepath
fill
64 80 moveto
0 -8 rlineto 8 0 rlineto 0 8 rlineto closepath
fill
80 80 moveto
0 -8 rlineto 8 0 rlineto 0 8 rlineto closepath
fill
88 80 moveto
0 -8 rlineto 8 0 rlineto 0 8 rlineto closepath
fill
120 80 moveto
0 -8 rlineto 8 0 rlineto 0 8 rlineto closepath
fill
152 80 moveto
0 -8 rlineto 8 0 rlineto 0 8 rlineto closepath
fill
168 80 moveto
0 -8 rlineto 8 0 rlineto 0 8 rlineto closepath
fill
176 80 moveto
0 -8 rlineto 8 0 rlineto 0 8 rlineto closepath
fill
192 80 moveto
0 -8 rlineto 8 0 rlineto 0 8 rlineto closepath
fill
0 72 moveto
0 -8 rlineto 8 0 rlineto 0 8 rlineto closepath
fill
24 72 moveto
0 -8 rlineto 8 0 rlineto 0 8 rlineto closepath
fill
48 72 moveto
0 -8 rlineto 8 0 rlineto 0 8 rlineto closepath
fill
80 72 moveto
0 -8 rlineto 8 0 rlineto 0 8 rlineto closepath
fill
104 72 moveto
0 -8 rlineto 8 0 rlineto 0 8 rlineto closepath
fill
112 72 moveto
0 -8 rlineto 8 0 rlineto 0 8 rlineto closepath
fill
120 72 moveto
0 -8 rlineto 8 0 rlineto 0 8 rlineto closepath
fill
128 72 moveto
0 -8 rlineto 8 0 rlineto 0 8 rlineto closepath
fill
136 72 moveto
0 -8 rlineto 8 0 rlineto 0 8 rlineto closepath
fill
144 72 moveto
0 -8 rlineto 8 0 rlineto 0 8 rlineto closepath
fill
152 72 moveto
0 -8 rlineto 8 0 rlineto 0 8 rlineto closepath
fill
160 72 moveto
0 -8 rlineto 8 0 rlineto 0 8 rlineto closepath
fill
176 72 moveto
0 -8 rlineto 8 0 rlineto 0 8 rlineto closepath
fill
64 64 moveto
0 -8 rlineto 8 0 rlineto 0 8 rlineto closepath
fill
72 64 moveto
0 -8 rlineto 8 0 rlineto 0 8 rlineto closepath
fill
80 64 moveto
0 -8 rlineto 8 0 rlineto 0 8 rlineto closepath
fill
88 64 moveto
0 -8 rlineto 8 0 rlineto 0 8 rlineto closepath
fill
112 64 moveto
0 -8 rlineto 8 0 rlineto 0 8 rlineto closepath
fill
120 64 moveto
0 -8 rlineto 8 0 rlineto 0 8 rlineto closepath
fill
128 64 moveto
0 -8 rlineto 8 0 rlineto 0 8 rlineto closepath
fill
160 64 moveto
0 -8 rlineto 8 0 rlineto 0 8 rlineto closepath
fill
0 56 moveto
0 -8 rlineto 8 0 rlineto 0 8 rlineto closepath
fill
8 56 moveto
0 -8 rlineto 8 0 rlineto 0 8 rlineto closepath
fill
16 56 moveto
0 -8 rlineto 8 0 rlineto 0 8 rlineto closepath
fill
24 56 moveto
0 -8 rlineto 8 0 rlineto 0 8 rlineto closepath
fill
32 56 moveto
0 -8 rlineto 8 0 rlineto 0 8 rlineto closepath
fill
40 56 moveto
0 -8 rlineto 8 0 rlineto 0 8 rlineto closepath
fill
48 56 moveto
0 -8 rlineto 8 0 rlineto 0 8 rlineto closepath
fill
64 56 moveto
0 -8 rlineto 8 0 rlineto 0 8 rlineto closepath
fill
88 56 moveto
0 -8 rlineto 8 0 rlineto 0 8 rlineto closepath
fill
112 56 moveto
0 -8 rlineto 8 0 rlineto 0 8 rlineto closepath
fill
128 56 moveto
0 -8 rlineto 8 0 rlineto 0 8 rlineto closepath
fill
144 56 moveto
0 -8 rlineto 8 0 rlineto 0 8 rlineto closepath
fill
160 56 moveto
0 -8 rlineto 8 0 rlineto 0 8 rlineto closepath
fill
192 56 moveto
0 -8 rlineto 8 0 rlineto 0 8 rlineto closepath
fill
0 48 moveto
0 -8 rlineto 8 0 rlineto 0 8 rlineto closepath
fill
48 48 moveto
0 -8 rlineto 8 0 rlineto 0 8 rlineto closepath
fill
64 48 moveto
0 -8 rlineto 8 0 rlineto 0 8 rlineto closepath
fill
72 48 moveto
0 -8 rlineto 8 0 rlineto 0 8 rlineto closepath
fill
88 48 moveto
0 -8 rlineto 8 0 rlineto 0 8 rlineto closepath
fill
120 48 moveto
0 -8 rlineto 8 0 rlineto 0 8 rlineto closepath
fill
128 48 moveto
0 -8 rlineto 8 0 rlineto 0 8 rlineto closepath
fill
160 48 moveto
0 -8 rlineto 8 0 rlineto 0 8 rlineto closepath
fill
184 48 moveto
0 -8 rlineto 8 0 rlineto 0 8 rlineto closepath
fill
0 40 moveto
0 -8 rlineto 8 0 rlineto 0 8 rlineto closepath
fill
16 40 moveto
0 -8 rlineto 8 0 rlineto 0 8 rlineto closepath
fill
24 40 moveto
0 -8 rlineto 8 0 rlineto 0 8 rlineto closepath
fill
32 40 moveto
0 -8 rlineto 8 0 rlineto 0 8 rlineto closepath
fill
48 40 moveto
0 -8 rlineto 8 0 rlineto 0 8 rlineto closepath
fill
72 40 moveto
0 -8 rlineto 8 0 rlineto 0 8 rlineto closepath
fill
88 40 moveto
0 -8 rlineto 8 0 rlineto 0 8 rlineto closepath
fill
96 40 moveto
0 -8 rlineto 8 0 rlineto 0 8 rlineto closepath
fill
104 40 moveto
0 -8 rlineto 8 0 rlineto 0 8 rlineto closepath
fill
112 40 moveto
0 -8 rlineto 8 0 rlineto 0 8 rlineto closepath
fill
120 40 moveto
0 -8 rlineto 8 0 rlineto 0 8 rlineto closepath
fill
128 40 moveto
0 -8 rlineto 8 0 rlineto 0 8 rlineto closepath
fill
136 40 moveto
0 -8 rlineto 8 0 rlineto 0 8 rlineto closepath
fill
144 40 moveto
0 -8 rlineto 8 0 rlineto 0 8 rlineto closepath
fill
152 40 moveto
0 -8 rlineto 8 0 rlineto 0 8 rlineto closepath
fill
160 40 moveto
0 -8 rlineto 8 0 rlineto 0 8 rlineto closepath
fill
176 40 moveto
0 -8 rlineto 8 0 rlineto 0 8 rlineto closepath
fill
184 40 moveto
0 -8 rlineto 8 0 rlineto 0 8 rlineto closepath
fill
0 32 moveto
0 -8 rlineto 8 0 rlineto 0 8 rlineto closepath
fill
16 32 moveto
0 -8 rlineto 8 0 rlineto 0 8 rlineto closepath
fill
24 32 moveto
0 -8 rlineto 8 0 rlineto 0 8 rlineto closepath
fill
32 32 moveto
0 -8 rlineto 8 0 rlineto 0 8 rlineto closepath
fill
48 32 moveto
0 -8 rlineto 8 0 rlineto 0 8 rlineto closepath
fill
80 32 moveto
0 -8 rlineto 8 0 rlineto 0 8 rlineto closepath
fill
88 32 moveto
0 -8 rlineto 8 0 rlineto 0 8 rlineto closepath
fill
112 32 moveto
0 -8 rlineto 8 0 rlineto 0 8 rlineto closepath
fill
136 32 moveto
0 -8 rlineto 8 0 rlineto 0 8 rlineto closepath
fill
144 32 moveto
0 -8 rlineto 8 0 rlineto 0 8 rlineto closepath
fill
184 32 moveto
0 -8 rlineto 8 0 rlineto 0 8 rlineto closepath
fill
192 32 moveto
0 -8 rlineto 8 0 rlineto 0 8 rlineto closepath
fill
0 24 moveto
0 -8 rlineto 8 0 rlineto 0 8 rlineto closepath
fill
16 24 moveto
0 -8 rlineto 8 0 rlineto 0 8 rlineto closepath
fill
24 24 moveto
0 -8 rlineto 8 0 rlineto 0 8 rlineto closepath
fill
32 24 moveto
0 -8 rlineto 8 0 rlineto 0 8 rlineto closepath
fill
48 24 moveto
0 -8 rlineto 8 0 rlineto 0 8 rlineto closepath
fill
72 24 moveto
0 -8 rlineto 8 0 rlineto 0 8 rlineto closepath
fill
80 24 moveto
0 -8 rlineto 8 0 rlineto 0 8 rlineto closepath
fill
96 24 moveto
0 -8 rlineto 8 0 rlineto 0 8 rlineto closepath
fill
104 24 moveto
0 -8 rlineto 8 0 rlineto 0 8 rlineto closepath
fill
128 24 moveto
0 -8 rlineto 8 0 rlineto 0 8 rlineto closepath
fill
168 24 moveto
0 -8 rlineto 8 0 rlineto 0 8 rlineto closepath
fill
176 24 moveto
0 -8 rlineto 8 0 rlineto 0 8 rlineto closepath
fill
192 24 moveto
0 -8 rlineto 8 0 rlineto 0 8 rlineto closepath
fill
0 16 moveto
0 -8 rlineto 8 0 rlineto 0 8 rlineto closepath
fill
48 16 moveto
0 -8 rlineto 8 0 rlineto 0 8 rlineto closepath
fill
64 16 moveto
0 -8 rlineto 8 0 rlineto 0 8 rlineto closepath
fill
96 16 moveto
0 -8 rlineto 8 0 rlineto 0 8 rlineto closepath
fill
112 16 moveto
0 -8 rlineto 8 0 rlineto 0 8 rlineto closepath
fill
128 16 moveto
0 -8 rlineto 8 0 rlineto 0 8 rlineto closepath
fill
136 16 moveto
0 -8 rlineto 8 0 rlineto 0 8 rlineto closepath
fill
144 16 moveto
0 -8 rlineto 8 0 rlineto 0 8 rlineto closepath
fill
152 16 moveto
0 -8 rlineto 8 0 rlineto 0 8 rlineto closepath
fill
160 16 moveto
0 -8 rlineto 8 0 rlineto 0 8 rlineto closepath
fill
192 16 moveto
0 -8 rlineto 8 0 rlineto 0 8 rlineto closepath
fill
0 8 moveto
0 -8 rlineto 8 0 rlineto 0 8 rlineto closepath
fill
8 8 moveto
0 -8 rlineto 8 0 rlineto 0 8 rlineto closepath
fill
16 8 moveto
0 -8 rlineto 8 0 rlineto 0 8 rlineto closepath
fill
24 8 moveto
0 -8 rlineto 8 0 rlineto 0 8 rlineto closepath
fill
32 8 moveto
0 -8 rlineto 8 0 rlineto 0 8 rlineto closepath
fill
40 8 moveto
0 -8 rlineto 8 0 rlineto 0 8 rlineto closepath
fill
48 8 moveto
0 -8 rlineto 8 0 rlineto 0 8 rlineto closepath
fill
64 8 moveto
0 -8 rlineto 8 0 rlineto 0 8 rlineto closepath
fill
96 8 moveto
0 -8 rlineto 8 0 rlineto 0 8 rlineto closepath
fill
120 8 moveto
0 -8 rlineto 8 0 rlineto 0 8 rlineto closepath
fill
128 8 moveto
0 -8 rlineto 8 0 rlineto 0 8 rlineto closepath
fill
144 8 moveto
0 -8 rlineto 8 0 rlineto 0 8 rlineto closepath
fill
168 8 moveto
0 -8 rlineto 8 0 rlineto 0 8 rlineto closepath
fill
192 8 moveto
0 -8 rlineto 8 0 rlineto 0 8 rlineto closepath
fill