<?xml version="1.0" encoding="UTF-8" standalone="no"?>
<!-- Created with Inkscape (http://www.inkscape.org/) -->

<svg
   width="256"
   height="256"
   viewBox="0 0 67.733332 67.733335"
   version="1.1"
   id="svg1082"
   inkscape:version="1.3.2 (1:1.3.2+202311252150+091e20ef0f)"
   sodipodi:docname="icon.svg"
   inkscape:export-filename="/home/abuathier/icon.png"
   inkscape:export-xdpi="96.000008"
   inkscape:export-ydpi="96.000008"
   xml:space="preserve"
   xmlns:inkscape="http://www.inkscape.org/namespaces/inkscape"
   xmlns:sodipodi="http://sodipodi.sourceforge.net/DTD/sodipodi-0.dtd"
   xmlns:xlink="http://www.w3.org/1999/xlink"
   xmlns="http://www.w3.org/2000/svg"
   xmlns:svg="http://www.w3.org/2000/svg"><sodipodi:namedview
     id="namedview1084"
     pagecolor="#ffffff"
     bordercolor="#666666"
     borderopacity="1.0"
     inkscape:pageshadow="2"
     inkscape:pageopacity="0.0"
     inkscape:pagecheckerboard="0"
     inkscape:document-units="px"
     showgrid="false"
     units="px"
     width="793.70081px"
     showborder="true"
     inkscape:showpageshadow="false"
     inkscape:zoom="2.8284272"
     inkscape:cx="4.596194"
     inkscape:cy="84.676035"
     inkscape:window-width="2560"
     inkscape:window-height="1524"
     inkscape:window-x="0"
     inkscape:window-y="0"
     inkscape:window-maximized="1"
     inkscape:current-layer="layer1"
     inkscape:deskcolor="#d1d1d1" /><defs
     id="defs1079"><linearGradient
       id="linearGradient8"
       inkscape:collect="always"><stop
         style="stop-color:#ff836b;stop-opacity:1"
         offset="0"
         id="stop3" /><stop
         style="stop-color:#ffffff;stop-opacity:1;"
         offset="1"
         id="stop8" /></linearGradient><linearGradient
       id="linearGradient105"
       inkscape:collect="always"><stop
         style="stop-color:#e8e8e7;stop-opacity:1"
         offset="0.78641707"
         id="stop104" /><stop
         style="stop-color:#c7c6c6;stop-opacity:1"
         offset="1"
         id="stop105" /></linearGradient><linearGradient
       id="linearGradient67"
       inkscape:collect="always"><stop
         style="stop-color:#00ad58;stop-opacity:1;"
         offset="0"
         id="stop67" /><stop
         style="stop-color:#ffffff;stop-opacity:1;"
         offset="1"
         id="stop68" /></linearGradient><linearGradient
       id="linearGradient65"
       inkscape:collect="always"><stop
         style="stop-color:#fff224;stop-opacity:1;"
         offset="0"
         id="stop65" /><stop
         style="stop-color:#ffffff;stop-opacity:1;"
         offset="1"
         id="stop66" /></linearGradient><linearGradient
       id="linearGradient63"
       inkscape:collect="always"><stop
         style="stop-color:#f63d9e;stop-opacity:1;"
         offset="0"
         id="stop63" /><stop
         style="stop-color:#ffffff;stop-opacity:1;"
         offset="1"
         id="stop64" /></linearGradient><linearGradient
       id="linearGradient61"
       inkscape:collect="always"><stop
         style="stop-color:#00ad58;stop-opacity:1;"
         offset="0"
         id="stop61" /><stop
         style="stop-color:#ffffff;stop-opacity:1;"
         offset="1"
         id="stop62" /></linearGradient><linearGradient
       id="linearGradient59"
       inkscape:collect="always"><stop
         style="stop-color:#f96c41;stop-opacity:1;"
         offset="0"
         id="stop59" /><stop
         style="stop-color:#ffffff;stop-opacity:1;"
         offset="1"
         id="stop60" /></linearGradient><linearGradient
       id="linearGradient57"
       inkscape:collect="always"><stop
         style="stop-color:#fff224;stop-opacity:1;"
         offset="0"
         id="stop57" /><stop
         style="stop-color:#ffffff;stop-opacity:1;"
         offset="1"
         id="stop58" /></linearGradient><linearGradient
       id="linearGradient55"
       inkscape:collect="always"><stop
         style="stop-color:#00b3f6;stop-opacity:1;"
         offset="0"
         id="stop55" /><stop
         style="stop-color:#ffffff;stop-opacity:1;"
         offset="1"
         id="stop56" /></linearGradient><linearGradient
       id="linearGradient53"
       inkscape:collect="always"><stop
         style="stop-color:#00b3f6;stop-opacity:1;"
         offset="0"
         id="stop53" /><stop
         style="stop-color:#ffffff;stop-opacity:1;"
         offset="1"
         id="stop54" /></linearGradient><linearGradient
       id="linearGradient19"
       inkscape:collect="always"><stop
         style="stop-color:#f3b95d;stop-opacity:1;"
         offset="0"
         id="stop19" /><stop
         style="stop-color:#e19010;stop-opacity:1;"
         offset="1"
         id="stop20" /></linearGradient><linearGradient
       id="linearGradient16"
       inkscape:collect="always"><stop
         style="stop-color:#ff836b;stop-opacity:1;"
         offset="0"
         id="stop16" /><stop
         style="stop-color:#ffffff;stop-opacity:1;"
         offset="1"
         id="stop17" /></linearGradient><linearGradient
       id="linearGradient12"
       inkscape:collect="always"><stop
         style="stop-color:#fc7761;stop-opacity:1"
         offset="0.5438419"
         id="stop12" /><stop
         style="stop-color:#f92d0b;stop-opacity:1;"
         offset="0.75168729"
         id="stop14" /><stop
         style="stop-color:#a92b16;stop-opacity:1"
         offset="1"
         id="stop13" /></linearGradient><linearGradient
       id="linearGradient9"
       inkscape:collect="always"><stop
         style="stop-color:#ffaf10;stop-opacity:1;"
         offset="0"
         id="stop9" /><stop
         style="stop-color:#ffffff;stop-opacity:1;"
         offset="1"
         id="stop10" /></linearGradient><linearGradient
       id="linearGradient6"
       inkscape:collect="always"><stop
         style="stop-color:#fefefe;stop-opacity:1"
         offset="0"
         id="stop6" /><stop
         style="stop-color:#ced2d7;stop-opacity:1"
         offset="1"
         id="stop7" /></linearGradient><linearGradient
       id="linearGradient4"
       inkscape:collect="always"><stop
         style="stop-color:#e8e8e7;stop-opacity:1;"
         offset="0.725676"
         id="stop4" /><stop
         style="stop-color:#c7c6c6;stop-opacity:1;"
         offset="1"
         id="stop5" /></linearGradient><linearGradient
       id="linearGradient1"
       inkscape:collect="always"><stop
         style="stop-color:#ffffff;stop-opacity:1;"
         offset="0"
         id="stop1" /><stop
         style="stop-color:#000000;stop-opacity:1;"
         offset="1"
         id="stop2" /></linearGradient><rect
       x="10.066227"
       y="49.051266"
       width="226.56485"
       height="164.61897"
       id="rect5085" /><radialGradient
       inkscape:collect="always"
       xlink:href="#linearGradient1"
       id="radialGradient2"
       cx="32.154766"
       cy="19.767427"
       fx="32.154766"
       fy="19.767427"
       r="2.232492"
       gradientUnits="userSpaceOnUse"
       gradientTransform="matrix(0.47213068,0,0,0.37292953,16.973515,12.191974)" /><radialGradient
       inkscape:collect="always"
       xlink:href="#linearGradient1"
       id="radialGradient3"
       gradientUnits="userSpaceOnUse"
       gradientTransform="matrix(0.35084275,0,0,0.27712587,-48.97456,14.454979)"
       cx="32.154766"
       cy="19.767427"
       fx="32.154766"
       fy="19.767427"
       r="2.232492" /><radialGradient
       inkscape:collect="always"
       xlink:href="#linearGradient105"
       id="radialGradient5"
       cx="28.339096"
       cy="16.897932"
       fx="28.339096"
       fy="16.897932"
       r="7.4958668"
       gradientTransform="matrix(1,0,0,0.95818313,0,0.7066186)"
       gradientUnits="userSpaceOnUse" /><radialGradient
       inkscape:collect="always"
       xlink:href="#linearGradient4"
       id="radialGradient6"
       gradientUnits="userSpaceOnUse"
       gradientTransform="matrix(0.79723507,0,0,0.60648407,19.332056,9.3032694)"
       cx="28.339096"
       cy="16.897932"
       fx="28.339096"
       fy="16.897932"
       r="7.4958668" /><linearGradient
       inkscape:collect="always"
       xlink:href="#linearGradient6"
       id="linearGradient7"
       x1="66.554344"
       y1="4.0912714"
       x2="66.554344"
       y2="24.63048"
       gradientUnits="userSpaceOnUse"
       gradientTransform="translate(-32.780642)" /><linearGradient
       inkscape:collect="always"
       xlink:href="#linearGradient9"
       id="linearGradient10"
       x1="52.887184"
       y1="31.870127"
       x2="52.887184"
       y2="22.726776"
       gradientUnits="userSpaceOnUse"
       gradientTransform="translate(-17.989608,0.07214944)" /><radialGradient
       inkscape:collect="always"
       xlink:href="#linearGradient12"
       id="radialGradient13"
       cx="34.15881"
       cy="17.75107"
       fx="34.15881"
       fy="17.75107"
       r="20.556884"
       gradientTransform="matrix(-1.5060854,0,0,-1.3661153,84.32366,58.751344)"
       gradientUnits="userSpaceOnUse" /><linearGradient
       inkscape:collect="always"
       xlink:href="#linearGradient8"
       id="linearGradient17"
       x1="3.3815887"
       y1="34.368217"
       x2="12.595174"
       y2="26.004387"
       gradientUnits="userSpaceOnUse" /><linearGradient
       inkscape:collect="always"
       xlink:href="#linearGradient16"
       id="linearGradient18"
       gradientUnits="userSpaceOnUse"
       x1="3.3815887"
       y1="34.368217"
       x2="12.595174"
       y2="26.004387"
       gradientTransform="matrix(-1,0,0,1,67.454695,0)" /><radialGradient
       inkscape:collect="always"
       xlink:href="#linearGradient19"
       id="radialGradient20"
       cx="22.769798"
       cy="59.917801"
       fx="22.769798"
       fy="59.917801"
       r="9.4025021"
       gradientTransform="matrix(0.92488064,0,0,0.47085429,1.7104527,31.705248)"
       gradientUnits="userSpaceOnUse" /><filter
       inkscape:collect="always"
       style="color-interpolation-filters:sRGB"
       id="filter22"
       x="-0.13465441"
       y="-0.418915"
       width="1.2693088"
       height="1.83783"><feGaussianBlur
         inkscape:collect="always"
         stdDeviation="0.6351274"
         id="feGaussianBlur22" /></filter><radialGradient
       inkscape:collect="always"
       xlink:href="#linearGradient19"
       id="radialGradient24"
       gradientUnits="userSpaceOnUse"
       gradientTransform="matrix(0.92488064,0,0,0.47085429,24.296998,31.705248)"
       cx="22.769798"
       cy="59.917801"
       fx="22.769798"
       fy="59.917801"
       r="9.4025021" /><linearGradient
       inkscape:collect="always"
       xlink:href="#linearGradient53"
       id="linearGradient54"
       x1="-464.91394"
       y1="-111.2402"
       x2="-471.81293"
       y2="-8.6339827"
       gradientUnits="userSpaceOnUse"
       gradientTransform="matrix(0.07267873,0,0,0.0589936,54.330513,39.994122)" /><linearGradient
       inkscape:collect="always"
       xlink:href="#linearGradient55"
       id="linearGradient56"
       x1="-86.069054"
       y1="-108.15295"
       x2="-89.232109"
       y2="-4.4039769"
       gradientUnits="userSpaceOnUse"
       gradientTransform="matrix(0.07267873,0,0,0.0589936,54.152782,39.994122)" /><linearGradient
       inkscape:collect="always"
       xlink:href="#linearGradient57"
       id="linearGradient58"
       x1="-427.63647"
       y1="-109.68707"
       x2="-435.38583"
       y2="-5.0621996"
       gradientUnits="userSpaceOnUse"
       gradientTransform="matrix(0.07267873,0,0,0.0589936,54.330513,39.994122)" /><linearGradient
       inkscape:collect="always"
       xlink:href="#linearGradient59"
       id="linearGradient60"
       x1="-355.80792"
       y1="-106.80829"
       x2="-361.01779"
       y2="-1.5404205"
       gradientUnits="userSpaceOnUse"
       gradientTransform="matrix(0.07267873,0,0,0.0589936,54.330513,39.994122)" /><linearGradient
       inkscape:collect="always"
       xlink:href="#linearGradient61"
       id="linearGradient62"
       x1="-286.44922"
       y1="-106.38175"
       x2="-286.44922"
       y2="-2.7455928"
       gradientUnits="userSpaceOnUse"
       gradientTransform="matrix(0.07267873,0,0,0.0589936,54.330513,39.994122)" /><linearGradient
       inkscape:collect="always"
       xlink:href="#linearGradient63"
       id="linearGradient64"
       x1="-235.75613"
       y1="-110.66621"
       x2="-224.26003"
       y2="-8.0096359"
       gradientUnits="userSpaceOnUse"
       gradientTransform="matrix(0.07267873,0,0,0.0589936,54.330513,39.994122)" /><linearGradient
       inkscape:collect="always"
       xlink:href="#linearGradient65"
       id="linearGradient66"
       x1="-179.65825"
       y1="-107.64371"
       x2="-180.6682"
       y2="-5.6978383"
       gradientUnits="userSpaceOnUse"
       gradientTransform="matrix(0.07267873,0,0,0.0589936,54.330513,39.994122)" /><linearGradient
       inkscape:collect="always"
       xlink:href="#linearGradient67"
       id="linearGradient68"
       x1="-133.58635"
       y1="-113.19967"
       x2="-141.42094"
       y2="-7.6910706"
       gradientUnits="userSpaceOnUse"
       gradientTransform="matrix(0.07267873,0,0,0.0589936,54.330513,39.994122)" /><filter
       inkscape:collect="always"
       style="color-interpolation-filters:sRGB"
       id="filter102"
       x="-0.047227717"
       y="-0.048797962"
       width="1.0944554"
       height="1.0975959"><feGaussianBlur
         inkscape:collect="always"
         stdDeviation="1.2577528"
         id="feGaussianBlur102" /></filter><filter
       inkscape:collect="always"
       style="color-interpolation-filters:sRGB"
       id="filter103"
       x="-0.057066765"
       y="-0.10936932"
       width="1.1141335"
       height="1.2187386"><feGaussianBlur
         inkscape:collect="always"
         stdDeviation="0.97759574"
         id="feGaussianBlur103" /></filter></defs><g
     inkscape:label="Calque 1"
     inkscape:groupmode="layer"
     id="layer1"><path
       id="path69"
       style="fill:#000000;fill-opacity:1;stroke:none;stroke-width:0.529167;stroke-linecap:round;stroke-linejoin:round;stroke-dasharray:none;stroke-opacity:1;filter:url(#filter102);opacity:0.8"
       d="M 33.866667,2.8453128 A 22.584528,29.814697 0 0 0 12.061279,24.905465 L 1.5027507,35.1374 c 0,0 5.3286239,0.95511 10.0278113,1.78232 a 22.584528,29.814697 0 0 0 1.593185,7.35924 c -0.01081,0.0099 -0.0223,0.01962 -0.03307,0.02946 a 22.584528,29.814697 0 0 0 0.175183,0.47387 22.584528,29.814697 0 0 0 0.301274,0.8139 22.584528,29.814697 0 0 0 1.100708,2.65875 22.584528,29.814697 0 0 0 0.421162,0.88522 22.584528,29.814697 0 0 0 1.613855,2.84634 22.584528,29.814697 0 0 0 0.140044,0.23513 22.584528,29.814697 0 0 0 2.071191,2.73368 22.584528,29.814697 0 0 0 0.452169,0.50591 9.4025021,4.7867889 0 0 0 -5.999117,4.45658 9.4025021,4.7867889 0 0 0 9.402527,4.78679 9.4025021,4.7867889 0 0 0 8.243941,-2.49753 22.584528,29.814697 0 0 0 2.853056,0.26769 22.584528,29.814697 0 0 0 2.817916,-0.26872 22.584528,29.814697 0 0 0 0.39119,-0.03772 9.4025021,4.7867889 0 0 0 8.280632,2.53628 9.4025021,4.7867889 0 0 0 9.402526,-4.78679 9.4025021,4.7867889 0 0 0 -6.324678,-4.52221 22.584528,29.814697 0 0 0 1.232483,-1.55081 22.584528,29.814697 0 0 0 0.794783,-1.05471 22.584528,29.814697 0 0 0 1.086239,-1.70171 22.584528,29.814697 0 0 0 0.592212,-1.0511 22.584528,29.814697 0 0 0 4.084505,-13.26379 c 4.470699,-0.78911 9.194271,-1.63607 9.194271,-1.63607 L 55.857572,25.871815 A 22.584528,29.814697 0 0 0 33.866667,2.8453128 Z" /><path
       id="path11"
       style="fill:#ffffff;fill-opacity:1;stroke:none;stroke-width:0.529167;stroke-linecap:round;stroke-linejoin:round;stroke-dasharray:none;stroke-opacity:1"
       d="M 33.866667,2.8453044 A 22.584528,29.814697 0 0 0 12.061279,24.905457 L 1.5027507,35.13739 c 0,0 5.3286189,0.955111 10.0278113,1.78232 A 22.584528,29.814697 0 0 0 33.866667,62.47474 22.584528,29.814697 0 0 0 56.224475,36.773466 c 4.470703,-0.789121 9.194271,-1.636076 9.194271,-1.636076 L 55.857572,25.871806 A 22.584528,29.814697 0 0 0 33.866667,2.8453044 Z" /><path
       id="path103"
       style="opacity:0.6;mix-blend-mode:normal;fill:#000000;fill-opacity:1;stroke:none;stroke-width:0.264583px;stroke-linecap:butt;stroke-linejoin:miter;stroke-opacity:1;filter:url(#filter103)"
       d="m 18.320846,40.495202 c -0.709727,-0.02486 -1.443809,0.18217 -2.181779,0.697115 -0.725519,0.506256 -1.969661,1.602527 -3.048393,2.586923 A 22.584528,29.814697 0 0 0 33.866667,61.945573 22.584528,29.814697 0 0 0 54.204443,44.953845 c -0.702763,0.003 -1.447253,0.0562 -2.169376,0.218591 -2.498003,0.561761 -4.542509,-0.997862 -6.24458,-2.171443 -1.702071,-1.173583 -3.499043,-0.786457 -5.356263,2.430342 -1.85722,3.216798 -3.398009,5.028634 -4.823995,5.028634 -1.425983,0 -2.69333,-2.016154 -4.560445,-4.638477 -1.867113,-2.622325 -3.377924,-2.641836 -5.690092,-2.658235 -2.312167,-0.01641 -3.725222,-1.15375 -5.004345,-1.975591 -0.639563,-0.410892 -1.324775,-0.667601 -2.034501,-0.692464 z" /><ellipse
       style="fill:url(#linearGradient7);stroke-width:0.264583;stroke-linecap:round;opacity:0.8"
       id="path6"
       cx="33.866665"
       cy="14.409834"
       rx="14.767447"
       ry="10.3162" /><ellipse
       style="fill:url(#radialGradient5);fill-opacity:1;stroke-width:0.264583;stroke-linecap:round"
       id="path4"
       cx="28.339096"
       cy="16.897932"
       rx="7.4958668"
       ry="7.1824131" /><circle
       style="mix-blend-mode:normal;fill:url(#radialGradient2);fill-rule:nonzero;stroke:none;stroke-width:0.264583;stroke-linecap:round;stroke-opacity:1"
       id="path1"
       cx="31.572184"
       cy="20.381948"
       r="2.232492" /><ellipse
       style="fill:url(#radialGradient6);fill-opacity:1;stroke-width:0.264583;stroke-linecap:round"
       id="ellipse5"
       cx="41.924976"
       cy="19.551596"
       rx="5.9759679"
       ry="4.546124" /><circle
       style="mix-blend-mode:normal;fill:url(#radialGradient3);fill-opacity:1;fill-rule:nonzero;stroke:none;stroke-width:0.264583;stroke-linecap:round;stroke-opacity:1"
       id="circle2"
       cx="-38.126213"
       cy="20.540993"
       r="1.6589763"
       transform="scale(-1,1)" /><ellipse
       style="fill:#ffffff;fill-opacity:1;stroke-width:0.264583;stroke-linecap:round"
       id="path3"
       cx="28.142147"
       cy="13.877069"
       rx="4.716126"
       ry="1.1714858" /><ellipse
       style="fill:#ffffff;fill-opacity:1;stroke-width:0.264583;stroke-linecap:round"
       id="ellipse6"
       cx="42.703625"
       cy="17.508963"
       rx="3.1740401"
       ry="1.0221186" /><path
       id="path10"
       style="fill:url(#radialGradient13);fill-opacity:1;stroke:none;stroke-width:0.264583px;stroke-linecap:butt;stroke-linejoin:miter;stroke-opacity:1"
       d="m 18.320846,41.024369 c -0.709727,-0.02486 -1.443809,0.18217 -2.181779,0.697115 -0.725519,0.506256 -1.969661,1.602527 -3.048393,2.586923 A 22.584528,29.814697 0 0 0 33.866667,62.47474 22.584528,29.814697 0 0 0 54.204443,45.483012 c -0.702763,0.003 -1.447253,0.0562 -2.169376,0.218591 -2.498003,0.561761 -4.542509,-0.997862 -6.24458,-2.171443 -1.702071,-1.173583 -3.499043,-0.786457 -5.356263,2.430342 -1.85722,3.216798 -3.398009,5.028634 -4.823995,5.028634 -1.425983,0 -2.69333,-2.016154 -4.560445,-4.638477 -1.867113,-2.622325 -3.377924,-2.641836 -5.690092,-2.658235 -2.312167,-0.01641 -3.725222,-1.15375 -5.004345,-1.975591 -0.639563,-0.410892 -1.324775,-0.667601 -2.034501,-0.692464 z" /><path
       id="path16"
       style="fill:url(#linearGradient17);fill-opacity:1;stroke:none;stroke-width:0.264583px;stroke-linecap:butt;stroke-linejoin:miter;stroke-opacity:1"
       d="m 11.79928,26.617497 -8.6030927,7.891508 8.1793457,-3.73569 a 22.584528,29.814697 0 0 1 0.423747,-4.155818 z" /><path
       id="path17"
       style="fill:url(#linearGradient18);fill-opacity:1;stroke:none;stroke-width:0.264583px;stroke-linecap:butt;stroke-linejoin:miter;stroke-opacity:1"
       d="m 55.655415,26.617497 8.603093,7.891508 -8.179346,-3.73569 a 22.584528,29.814697 0 0 0 -0.423747,-4.155818 z" /><ellipse
       style="fill:url(#radialGradient20);fill-opacity:1;stroke:none;stroke-width:0.529167;stroke-linecap:round;stroke-linejoin:round;stroke-dasharray:none;stroke-opacity:1"
       id="path18"
       cx="22.769798"
       cy="59.917801"
       rx="9.4025021"
       ry="4.7867889" /><ellipse
       style="opacity:0.8;mix-blend-mode:normal;fill:#ffffff;fill-opacity:1;stroke:none;stroke-width:0.474953;stroke-linecap:round;stroke-linejoin:round;stroke-dasharray:none;stroke-opacity:1;filter:url(#filter22)"
       id="ellipse22"
       cx="22.769798"
       cy="58.848591"
       rx="5.6600666"
       ry="1.8193498"
       transform="matrix(1.2413199,0,0,1,-5.4948059,-0.3739233)" /><ellipse
       style="fill:url(#radialGradient24);fill-opacity:1;stroke:none;stroke-width:0.529167;stroke-linecap:round;stroke-linejoin:round;stroke-dasharray:none;stroke-opacity:1"
       id="ellipse23"
       cx="45.356342"
       cy="59.917801"
       rx="9.4025021"
       ry="4.7867889" /><ellipse
       style="opacity:0.8;mix-blend-mode:normal;fill:#ffffff;fill-opacity:1;stroke:none;stroke-width:0.474953;stroke-linecap:round;stroke-linejoin:round;stroke-dasharray:none;stroke-opacity:1;filter:url(#filter22)"
       id="ellipse24"
       cx="22.769798"
       cy="58.848591"
       rx="5.6600666"
       ry="1.8193498"
       transform="matrix(1.2413199,0,0,1,17.091739,-0.3739233)" /><g
       id="g68"
       transform="matrix(0.35942969,0,0,0.35942969,19.423208,20.004759)"
       style="stroke-width:2.78219"><path
         style="opacity:0.8;fill:#000000;fill-opacity:1;stroke:none;stroke-width:1.47225;stroke-linecap:round;stroke-linejoin:round;stroke-dasharray:none;stroke-opacity:1"
         d="m 10.810782,33.798148 c -0.036,-0.09477 -0.0382,-16.394257 -0.002,-16.430264 0.0279,-0.02796 3.59084,-0.02107 3.6095,0.007 0.006,0.0088 0.003,1.649732 -0.005,3.646443 -0.0106,2.396794 -0.005,3.643503 0.016,3.668997 0.0248,0.02985 0.0668,0.02716 0.18473,-0.01185 0.0839,-0.02775 0.15261,-0.06327 0.15261,-0.07894 0,-0.02415 0.23541,-0.309375 0.50054,-0.606445 0.20591,-0.230709 0.42173,-0.482391 0.52753,-0.615187 0.0442,-0.05544 0.11646,-0.139816 0.16064,-0.187496 0.0442,-0.04768 0.18043,-0.201027 0.30279,-0.340771 0.26552,-0.303235 0.3587,-0.406277 0.47629,-0.526716 0.0486,-0.04977 0.0883,-0.10315 0.0883,-0.118629 0,-0.01549 0.0398,-0.06541 0.0884,-0.110957 0.0486,-0.04554 0.12449,-0.128707 0.16867,-0.184807 0.0442,-0.0561 0.12369,-0.149943 0.1767,-0.208545 0.053,-0.05861 0.18313,-0.204225 0.28914,-0.3236 0.10603,-0.119381 0.26867,-0.298649 0.36144,-0.398381 0.0928,-0.09973 0.16866,-0.19841 0.16866,-0.219283 0,-0.02087 0.0334,-0.06429 0.0743,-0.0965 0.0408,-0.03221 0.16673,-0.166986 0.27976,-0.299511 0.11303,-0.132524 0.22058,-0.251578 0.239,-0.264558 0.0184,-0.01298 0.96959,-0.02382 2.11372,-0.02409 2.0509,-5.15e-4 2.08024,5.16e-4 2.08024,0.06302 0,0.03493 -0.0356,0.08683 -0.0791,0.115318 -0.0435,0.02849 -0.0888,0.08304 -0.10076,0.121216 -0.0119,0.03818 -0.0485,0.09833 -0.0813,0.133668 -0.23565,0.253817 -0.33093,0.360326 -0.55808,0.623853 -0.14136,0.164005 -0.26254,0.314818 -0.26929,0.33514 -0.0155,0.04651 -0.38991,0.477801 -0.4449,0.512427 -0.0224,0.01413 -0.0408,0.05955 -0.0408,0.10093 0,0.05278 -0.0232,0.08106 -0.0777,0.09473 -0.0427,0.01073 -0.1098,0.07148 -0.14907,0.135029 -0.0393,0.06354 -0.10191,0.149039 -0.13919,0.18999 -0.0373,0.04095 -0.0967,0.11365 -0.13205,0.161552 -0.0353,0.04791 -0.15865,0.197364 -0.27402,0.332133 -0.20944,0.244653 -0.51772,0.615615 -0.65129,0.783713 -0.0388,0.04889 -0.10678,0.131399 -0.15095,0.183334 -0.22236,0.261451 -0.29601,0.350003 -0.40153,0.482759 -0.0632,0.07952 -0.15443,0.187941 -0.20276,0.240954 -0.0483,0.05301 -0.13091,0.154211 -0.18353,0.224889 -0.0526,0.07068 -0.11239,0.142965 -0.1328,0.160635 -0.0204,0.01767 -0.0963,0.101679 -0.16866,0.186686 -0.1151,0.135225 -0.13156,0.174276 -0.13156,0.312124 0,0.129257 0.0173,0.177288 0.0964,0.267339 0.053,0.06037 0.0964,0.138403 0.0964,0.173398 0,0.035 0.0434,0.118203 0.0964,0.18491 0.053,0.0667 0.0964,0.153189 0.0964,0.192185 0,0.039 0.0357,0.112428 0.0793,0.163184 0.0436,0.05075 0.0883,0.13315 0.0992,0.183097 0.011,0.04995 0.0538,0.124713 0.0953,0.166141 0.0414,0.04143 0.0851,0.127545 0.0971,0.191367 0.012,0.06382 0.0343,0.116031 0.0495,0.116031 0.0358,0 0.12576,0.17363 0.12576,0.242755 0,0.02925 0.0369,0.09704 0.082,0.150657 0.0451,0.05361 0.0904,0.139339 0.10062,0.190507 0.0102,0.05117 0.0431,0.106128 0.073,0.122129 0.0299,0.016 0.0727,0.09139 0.0952,0.167528 0.0225,0.07614 0.0668,0.16735 0.0986,0.202689 0.0318,0.03534 0.0673,0.109461 0.0789,0.164711 0.0117,0.05525 0.0566,0.148412 0.0999,0.207037 0.0433,0.05862 0.0786,0.123473 0.0786,0.144114 0,0.02064 0.0434,0.09211 0.0964,0.158814 0.053,0.0667 0.0964,0.153191 0.0964,0.192198 0,0.03901 0.029,0.0972 0.0645,0.129326 0.0355,0.03212 0.0816,0.117488 0.10247,0.189708 0.0209,0.07222 0.0714,0.172179 0.11217,0.222126 0.0408,0.04995 0.0742,0.11685 0.0742,0.148672 0,0.03182 0.0226,0.07664 0.0503,0.09961 0.0638,0.05298 0.14246,0.203716 0.14246,0.273122 0,0.02925 0.0362,0.09614 0.0803,0.148645 0.0442,0.0525 0.0885,0.134104 0.0986,0.181338 0.0341,0.160272 0.0771,0.231659 0.15801,0.262423 0.0637,0.02422 0.0807,0.05304 0.0807,0.136787 0,0.06634 0.0241,0.126717 0.0643,0.16112 0.0353,0.03025 0.0643,0.09019 0.0643,0.133182 0,0.04299 0.0347,0.119426 0.0772,0.169859 0.0424,0.05043 0.0936,0.152738 0.11369,0.227355 0.0201,0.07461 0.0512,0.135664 0.0692,0.135664 0.018,0 0.0626,0.06867 0.0991,0.152608 0.0365,0.08393 0.0845,0.174287 0.10657,0.200794 0.0221,0.0265 0.0572,0.101246 0.078,0.166095 0.0208,0.06485 0.058,0.134678 0.0827,0.155178 0.0247,0.02049 0.0622,0.09032 0.0833,0.155174 0.0211,0.06485 0.0725,0.158772 0.11409,0.208723 0.0416,0.04995 0.0757,0.116632 0.0757,0.148186 0,0.03155 0.0434,0.111947 0.0964,0.178649 0.053,0.06671 0.0964,0.154328 0.0964,0.194719 0,0.04039 0.0386,0.119325 0.0858,0.175413 0.0595,0.0707 0.0866,0.140813 0.0884,0.228615 l 0.003,0.126636 -1.92764,-6.86e-4 c -1.0602,-3.44e-4 -1.94514,-10e-4 -1.96654,-0.0012 -0.0592,-8.58e-4 -0.16992,-0.133208 -0.16992,-0.203157 0,-0.03409 -0.0434,-0.111386 -0.0964,-0.17176 -0.053,-0.06038 -0.0964,-0.143173 -0.0964,-0.183993 0,-0.04082 -0.0284,-0.0999 -0.0631,-0.131278 -0.0347,-0.03138 -0.0803,-0.109521 -0.1013,-0.173649 -0.021,-0.06412 -0.0644,-0.135077 -0.0963,-0.157672 -0.0319,-0.0226 -0.0673,-0.09042 -0.0786,-0.150734 -0.0113,-0.06031 -0.0553,-0.156673 -0.0977,-0.214145 -0.0424,-0.05747 -0.0771,-0.121383 -0.0771,-0.142028 0,-0.02064 -0.0434,-0.09211 -0.0964,-0.158813 -0.053,-0.0667 -0.0968,-0.15182 -0.0973,-0.189145 -5.1e-4,-0.03733 -0.0439,-0.12466 -0.0964,-0.19407 -0.0525,-0.06941 -0.0955,-0.150299 -0.0955,-0.179754 0,-0.02946 -0.0284,-0.07922 -0.063,-0.110606 -0.0347,-0.03138 -0.0801,-0.109521 -0.10104,-0.173647 -0.0209,-0.06413 -0.072,-0.157464 -0.11366,-0.20742 -0.0416,-0.04996 -0.0848,-0.129472 -0.0959,-0.1767 -0.0112,-0.04723 -0.0453,-0.114786 -0.0759,-0.150127 -0.0306,-0.03534 -0.07,-0.107644 -0.0877,-0.16067 -0.0177,-0.05303 -0.0703,-0.152633 -0.11689,-0.221344 -0.0466,-0.06871 -0.0848,-0.142643 -0.0848,-0.164302 0,-0.02166 -0.0269,-0.07386 -0.0598,-0.115995 -0.0329,-0.04214 -0.071,-0.11276 -0.0846,-0.156937 -0.0137,-0.04417 -0.0662,-0.127808 -0.11687,-0.185846 -0.0506,-0.05804 -0.092,-0.135474 -0.092,-0.172063 0,-0.03659 -0.0361,-0.109483 -0.0803,-0.161983 -0.0442,-0.0525 -0.0803,-0.12127 -0.0803,-0.152824 0,-0.03155 -0.0434,-0.111951 -0.0964,-0.178655 -0.053,-0.0667 -0.0964,-0.156385 -0.0964,-0.199295 0,-0.119838 -0.0582,-0.202294 -0.14282,-0.202294 -0.0962,0 -0.3321,0.152233 -0.35688,0.230336 -0.0103,0.03238 -0.0466,0.07383 -0.0808,0.0921 -0.0341,0.01827 -0.0621,0.05174 -0.0621,0.07437 0,0.02263 -0.047,0.0851 -0.10441,0.138825 -0.0574,0.05372 -0.19116,0.2005 -0.29718,0.326176 -0.10602,0.125679 -0.269,0.312083 -0.36217,0.414239 -0.27252,0.298803 -0.26678,0.251555 -0.26256,2.157264 0.002,0.964158 -0.009,1.662509 -0.0259,1.679737 -0.017,0.017 -0.77444,0.03243 -1.7896,0.03643 l -1.76013,0.0069 z"
         id="path24" /><path
         id="path25"
         style="opacity:0.8;fill:#f3452f;fill-opacity:1;stroke:none;stroke-width:1.47225;stroke-linecap:round;stroke-linejoin:round;stroke-dasharray:none;stroke-opacity:1"
         d="m 23.531372,20.089652 0.002,1.423562 c 0.001,0.78296 0.0105,1.437131 0.0208,1.453736 0.0113,0.01823 0.69938,0.03017 1.73655,0.03017 1.60588,0 1.7195,-0.0037 1.74108,-0.05626 0.0127,-0.03092 0.0231,-0.685089 0.0231,-1.453736 V 20.08965 h -1.76175 z m 23.82452,0.107553 c -0.25294,0.0042 -0.32896,0.01484 -0.34475,0.0339 -0.0275,0.03325 -0.0374,0.554973 -0.0374,1.9789 0,1.591698 -0.008,1.943091 -0.0441,1.986885 -0.0638,0.07697 -0.20584,0.066 -0.28885,-0.02236 -0.039,-0.04156 -0.12914,-0.09301 -0.2002,-0.1143 -0.0711,-0.02129 -0.15647,-0.06596 -0.18981,-0.0993 -0.0333,-0.03334 -0.11553,-0.07092 -0.18263,-0.0835 -0.0671,-0.01259 -0.18568,-0.05683 -0.26356,-0.09824 -0.0779,-0.0414 -0.17926,-0.07551 -0.22522,-0.07596 -0.046,-3.43e-4 -0.18477,-0.03695 -0.30846,-0.08128 -0.31563,-0.113105 -0.96407,-0.155477 -1.72111,-0.112437 -0.44241,0.02516 -0.60766,0.04723 -0.73707,0.09824 -0.0917,0.03616 -0.25567,0.07466 -0.36428,0.08554 -0.11046,0.01108 -0.26101,0.05311 -0.34174,0.09548 -0.0794,0.04166 -0.17482,0.07579 -0.21208,0.07579 -0.0948,0 -0.27989,0.06488 -0.31831,0.111547 -0.0177,0.02146 -0.0899,0.05753 -0.16062,0.08022 -0.0707,0.02269 -0.15018,0.05967 -0.17668,0.08217 -0.0265,0.02251 -0.1037,0.06391 -0.17154,0.09193 -0.0678,0.02802 -0.16658,0.08727 -0.21936,0.131692 -0.0528,0.04442 -0.11077,0.08075 -0.12885,0.08075 -0.061,0 -0.63688,0.51902 -0.83851,0.755708 -0.26546,0.311641 -0.56931,0.754557 -0.56935,0.829899 -10e-6,0.01511 -0.0362,0.07049 -0.0804,0.122991 -0.0442,0.0525 -0.0803,0.1271 -0.0803,0.165765 0,0.03866 -0.0308,0.127699 -0.0684,0.19789 -0.0376,0.0702 -0.0941,0.214548 -0.12565,0.320793 -0.0315,0.106244 -0.0795,0.258234 -0.10649,0.337745 -0.1333,0.391974 -0.23779,1.874472 -0.14749,2.092487 0.0203,0.0489 0.0405,0.136636 0.0449,0.194959 0.0255,0.336354 0.0677,0.578068 0.1308,0.748613 0.0392,0.106021 0.0812,0.260377 0.0932,0.343068 0.012,0.08269 0.0491,0.185042 0.0824,0.227437 0.0334,0.0424 0.0699,0.119304 0.0811,0.170917 0.0271,0.124328 0.2722,0.62393 0.30607,0.62393 0.0146,0 0.0362,0.03256 0.048,0.07232 0.0118,0.03976 0.0634,0.125651 0.11457,0.190876 0.0512,0.06523 0.0932,0.133724 0.0932,0.152194 0,0.115049 1.09695,1.223099 1.21085,1.223099 0.0183,0 0.0891,0.04443 0.15734,0.09868 0.0683,0.05425 0.16352,0.106536 0.21164,0.11616 0.0481,0.0096 0.11221,0.0448 0.14243,0.07818 0.0302,0.03339 0.11253,0.07616 0.18298,0.09513 0.0704,0.01897 0.1672,0.06339 0.21493,0.09868 0.0477,0.03528 0.15043,0.07217 0.22824,0.082 0.0778,0.0098 0.21372,0.0509 0.30207,0.09122 0.11993,0.05475 0.26648,0.0821 0.57831,0.107996 0.22971,0.01908 0.46098,0.04805 0.51399,0.06434 v -8.9e-5 c 0.12734,0.03912 0.67984,0.04324 0.7502,0.0056 0.0304,-0.01626 0.26444,-0.04703 0.52002,-0.06842 0.30734,-0.02572 0.51229,-0.05929 0.60538,-0.09903 0.0774,-0.03305 0.23255,-0.07473 0.34467,-0.09264 0.11211,-0.01791 0.27141,-0.06853 0.35398,-0.112433 0.0826,-0.0439 0.20141,-0.07978 0.26409,-0.07978 0.0709,0 0.16033,-0.03214 0.23676,-0.0851 0.0772,-0.05351 0.1814,-0.09072 0.28086,-0.100276 0.15159,-0.01456 0.16091,-0.01073 0.22425,0.09309 0.0363,0.05957 0.0879,0.173394 0.11438,0.252908 l 0.0482,0.144558 1.63947,0.002 c 1.6294,0.0019 1.63956,0.0015 1.65535,-0.06425 0.009,-0.03639 0.0119,-3.116682 0.007,-6.845035 l -0.009,-6.778841 -1.71357,-0.01606 c -0.72337,-0.0068 -1.15323,-0.0091 -1.40617,-0.0049 z m 9.3176,3.293578 c -0.57894,-0.0024 -1.05366,0.04068 -1.22931,0.118471 -0.0822,0.03641 -0.24663,0.07841 -0.36534,0.09335 -0.1353,0.01703 -0.24693,0.05167 -0.29915,0.09274 -0.0458,0.03603 -0.16081,0.08158 -0.25557,0.101251 -0.0948,0.01967 -0.18949,0.05659 -0.21058,0.082 -0.0211,0.02541 -0.0977,0.0621 -0.17029,0.08164 -0.0726,0.01954 -0.1731,0.07027 -0.22353,0.112701 -0.0504,0.04244 -0.11118,0.0772 -0.13498,0.0772 -0.0238,0 -0.0841,0.03386 -0.13408,0.07534 -0.0499,0.04149 -0.1286,0.09574 -0.17473,0.120511 -0.34443,0.184998 -0.96662,0.775464 -1.33385,1.265873 -0.0957,0.127803 -0.26893,0.41631 -0.2695,0.44876 -3.5e-4,0.01827 -0.0437,0.0968 -0.0964,0.17455 -0.0527,0.07775 -0.0958,0.169464 -0.0958,0.203835 0,0.03437 -0.0287,0.10282 -0.0638,0.152097 -0.0351,0.04928 -0.0803,0.166746 -0.10054,0.260987 -0.0202,0.09425 -0.0661,0.227729 -0.10205,0.296659 -0.0422,0.08106 -0.0735,0.22461 -0.0886,0.406426 -0.0128,0.154607 -0.0383,0.32999 -0.0565,0.389746 -0.1229,0.40178 -0.13972,1.129545 -0.0371,1.604862 0.036,0.166618 0.0792,0.410017 0.0962,0.540955 0.017,0.130938 0.0583,0.284554 0.0918,0.341293 0.0335,0.05674 0.0708,0.162375 0.0831,0.234807 0.0122,0.07243 0.0512,0.168535 0.0866,0.213508 0.0354,0.04497 0.0783,0.132215 0.0953,0.193896 0.017,0.06168 0.0573,0.137359 0.0894,0.168164 0.0322,0.03081 0.087,0.121033 0.12175,0.200549 0.0348,0.07952 0.0872,0.164416 0.11661,0.188664 0.0294,0.02425 0.0534,0.06153 0.0534,0.0828 0,0.02126 0.0361,0.07262 0.0803,0.114118 0.0442,0.0415 0.0803,0.09267 0.0803,0.113764 0,0.05487 0.82704,0.85004 0.88412,0.85004 0.0261,0 0.0476,0.01333 0.0476,0.02964 0,0.03996 0.42977,0.323724 0.49029,0.323724 0.0264,0 0.0679,0.02404 0.0921,0.05342 0.0242,0.02938 0.10915,0.08205 0.18866,0.117047 0.0795,0.035 0.17909,0.09054 0.22123,0.123348 0.0421,0.03281 0.1152,0.05963 0.16239,0.05963 0.0472,0 0.13343,0.03509 0.19159,0.078 0.0582,0.04291 0.16578,0.08792 0.23915,0.100011 0.0734,0.01209 0.21288,0.05506 0.31006,0.09548 0.0972,0.04042 0.27795,0.0827 0.40164,0.09398 0.12369,0.01128 0.29713,0.04102 0.38549,0.06611 0.0883,0.02509 0.22574,0.05709 0.30526,0.07108 0.22995,0.04045 1.14948,0.04563 1.41354,0.008 0.13252,-0.0189 0.31328,-0.05452 0.40163,-0.07916 0.0883,-0.02464 0.29482,-0.05817 0.45888,-0.07454 0.18985,-0.01894 0.31847,-0.04798 0.3538,-0.07995 0.0305,-0.02763 0.14903,-0.06528 0.26329,-0.08368 0.11427,-0.0184 0.24422,-0.05981 0.28876,-0.09193 0.0446,-0.03212 0.14283,-0.07643 0.21839,-0.0985 0.0756,-0.02207 0.1896,-0.07559 0.25344,-0.118911 0.0639,-0.04333 0.13748,-0.07871 0.16364,-0.07871 0.0764,0 0.34212,-0.175246 0.69315,-0.457013 0.1349,-0.108285 0.7282,-0.706279 0.7282,-0.733966 0,-0.01312 0.047,-0.08226 0.10444,-0.153698 0.14331,-0.178272 0.28104,-0.404883 0.28104,-0.462245 0,-0.02616 0.0363,-0.100923 0.0806,-0.166208 0.0443,-0.06529 0.0934,-0.176016 0.10915,-0.246076 0.0157,-0.07006 0.0518,-0.162771 0.0801,-0.205966 0.0283,-0.0432 0.0515,-0.117021 0.0515,-0.164082 v -0.08554 l -1.72688,0.01624 c -1.83379,0.01733 -1.88568,0.022 -1.92308,0.171003 -0.026,0.103701 -0.56782,0.624106 -0.64975,0.624106 -0.0369,0 -0.0974,0.03256 -0.13444,0.07232 -0.066,0.07078 -0.0821,0.07224 -0.785,0.07224 -0.62167,0 -0.72564,-0.007 -0.77727,-0.05298 -0.0328,-0.02918 -0.12468,-0.07174 -0.20419,-0.09451 -0.0795,-0.02277 -0.19249,-0.07838 -0.25105,-0.123614 -0.22321,-0.172452 -0.56015,-0.527329 -0.60689,-0.639196 -0.0268,-0.06416 -0.076,-0.15137 -0.10941,-0.193806 -0.0334,-0.04244 -0.0607,-0.115505 -0.0607,-0.162394 0,-0.04689 -0.0275,-0.163256 -0.061,-0.258586 -0.0742,-0.210632 -0.0513,-0.292468 0.0965,-0.344847 0.0826,-0.02929 0.99326,-0.03878 3.74846,-0.03878 2.00162,-8.1e-5 3.65558,-0.01018 3.67542,-0.02245 0.0261,-0.01611 0.0311,-0.295795 0.018,-1.007285 -0.0175,-0.95106 -0.021,-0.993582 -0.1017,-1.233842 -0.0459,-0.136859 -0.0969,-0.343545 -0.11332,-0.459228 -0.0164,-0.11568 -0.0533,-0.236279 -0.082,-0.267996 -0.0287,-0.03172 -0.0715,-0.131017 -0.0951,-0.220696 -0.0237,-0.08968 -0.0733,-0.212116 -0.11039,-0.272076 -0.0371,-0.05996 -0.0675,-0.131539 -0.0675,-0.159023 0,-0.02748 -0.0341,-0.09079 -0.0759,-0.140739 -0.0418,-0.04995 -0.0872,-0.127009 -0.10081,-0.171179 -0.0233,-0.07524 -0.0564,-0.122079 -0.28113,-0.398 -0.0486,-0.05965 -0.0883,-0.121243 -0.0883,-0.136923 0,-0.04519 -0.60065,-0.614934 -0.7054,-0.6691 -0.052,-0.0269 -0.1062,-0.06862 -0.12033,-0.09273 -0.0141,-0.02411 -0.0701,-0.06651 -0.12441,-0.09424 -0.0543,-0.02773 -0.11668,-0.07215 -0.1387,-0.09868 -0.022,-0.02653 -0.0828,-0.05766 -0.13497,-0.06913 -0.0522,-0.01147 -0.13437,-0.05354 -0.18254,-0.09353 -0.0482,-0.03999 -0.13095,-0.08302 -0.18396,-0.09566 -0.053,-0.01264 -0.14696,-0.05658 -0.2088,-0.09762 -0.0618,-0.04104 -0.17226,-0.0834 -0.24537,-0.09415 -0.0731,-0.01075 -0.21051,-0.05563 -0.30526,-0.09975 -0.0948,-0.04411 -0.23006,-0.08069 -0.30075,-0.08128 -0.14029,-0.0012 -0.28007,-0.03239 -0.48833,-0.109062 -0.0892,-0.03284 -0.36139,-0.06195 -0.80345,-0.08581 -0.20894,-0.01126 -0.41347,-0.01705 -0.60645,-0.01784 z m -22.37132,0.0355 c -0.40062,5.15e-4 -0.80751,0.02203 -0.9504,0.06443 -0.10602,0.03146 -0.32731,0.07585 -0.49171,0.09868 -0.1644,0.02283 -0.33458,0.06494 -0.37821,0.09353 -0.0436,0.02859 -0.1621,0.06702 -0.26329,0.08537 -0.10119,0.01835 -0.22018,0.05685 -0.26436,0.08555 -0.14313,0.09296 -0.36811,0.199754 -0.42133,0.199754 -0.0848,1.72e-4 -0.21326,-0.12097 -0.27394,-0.258497 l -0.0567,-0.128585 -1.59714,0.0089 c -0.87843,0.0049 -1.60922,0.02095 -1.62394,0.03568 -0.0399,0.03992 -0.054,9.883092 -0.0143,9.987492 0.0196,0.05145 0.0614,0.08894 0.10631,0.09531 0.19118,0.0271 3.38523,-0.01099 3.41498,-0.04073 0.0211,-0.02107 0.0387,-1.221463 0.0505,-3.444261 0.0115,-2.162538 0.0302,-3.458916 0.051,-3.540366 0.0687,-0.268244 0.37958,-0.618323 0.70193,-0.790493 0.19372,-0.10347 0.5457,-0.190871 0.755,-0.187511 0.17866,0.0029 0.51598,0.104088 0.69075,0.207298 0.20692,0.122206 0.43442,0.36629 0.56856,0.609998 l 0.10604,0.192834 0.0161,3.475049 c 0.009,1.911312 0.0243,3.483273 0.0343,3.493247 0.01,0.01 0.79428,0.02356 1.74285,0.03017 1.35239,0.0094 1.7319,0.0034 1.75803,-0.02813 0.0366,-0.04408 0.0464,-6.430612 0.0112,-7.291666 -0.0165,-0.404052 -0.0318,-0.510479 -0.0946,-0.658628 -0.0412,-0.09718 -0.0911,-0.259833 -0.11101,-0.361438 -0.0199,-0.101601 -0.0473,-0.184666 -0.0611,-0.184666 -0.0137,0 -0.0504,-0.06148 -0.0814,-0.136572 -0.0669,-0.16207 -0.066,-0.160648 -0.21404,-0.381225 -0.17568,-0.261782 -0.75556,-0.799458 -0.8622,-0.799458 -0.0223,0 -0.0828,-0.03551 -0.13444,-0.07898 -0.0517,-0.04347 -0.14776,-0.08891 -0.21351,-0.100897 -0.0657,-0.01199 -0.15872,-0.04933 -0.20667,-0.08297 -0.048,-0.03364 -0.20704,-0.08082 -0.35346,-0.104889 -0.14641,-0.02407 -0.33849,-0.06956 -0.42683,-0.101073 -0.11799,-0.04208 -0.51235,-0.06268 -0.91296,-0.06221 z m 34.57536,0.05209 c -0.15745,0.004 -0.32075,0.0242 -0.49411,0.06079 -0.16612,0.03506 -0.33624,0.06379 -0.37803,0.06424 -0.0418,3.43e-4 -0.14296,0.036 -0.22486,0.07933 -0.0819,0.04334 -0.21038,0.09449 -0.28548,0.113678 -0.0751,0.01919 -0.13657,0.04609 -0.13657,0.05981 0,0.0137 -0.0522,0.04988 -0.11598,0.08031 -0.1085,0.05174 -0.25763,0.161575 -0.45533,0.335523 -0.0515,0.04533 -0.11557,0.07012 -0.16594,0.06425 -0.0672,-0.0078 -0.0868,-0.03267 -0.10862,-0.137989 -0.0556,-0.267993 -0.087,-0.356095 -0.1576,-0.441659 l -0.0728,-0.08821 -1.5391,-0.002 c -1.23335,-0.0015 -1.5444,0.0064 -1.56573,0.04002 -0.0366,0.05777 -0.0353,9.975157 10e-4,10.043665 0.0266,0.04978 0.15939,0.05358 1.66014,0.04703 1.28305,-0.0056 1.63672,-0.01588 1.65722,-0.04819 0.0143,-0.02259 0.0264,-1.378738 0.0266,-3.013695 3.4e-4,-2.587813 0.007,-2.981574 0.0485,-3.041379 0.0265,-0.03778 0.0683,-0.164575 0.0928,-0.281752 0.0246,-0.117179 0.0662,-0.237641 0.0926,-0.267728 0.0264,-0.03009 0.0713,-0.100825 0.0998,-0.157158 0.0757,-0.149464 0.45891,-0.520753 0.61151,-0.592426 0.0723,-0.03395 0.16756,-0.08192 0.21173,-0.106576 0.0442,-0.02465 0.18158,-0.06256 0.30527,-0.08421 0.12369,-0.02166 0.28088,-0.05896 0.34936,-0.08289 0.22738,-0.07944 0.90429,-0.02638 1.11724,0.08759 0.13525,0.07238 0.14011,0.02565 0.13284,-1.28371 -0.004,-0.682455 -0.014,-1.269949 -0.0228,-1.305542 -0.0125,-0.0509 -0.0605,-0.07322 -0.22514,-0.104445 -0.14987,-0.02843 -0.3015,-0.04071 -0.45896,-0.03674 z m -43.58991,0.189812 c -1.40886,0 -1.72364,0.0078 -1.73717,0.04304 -0.0239,0.06239 -0.0334,9.987503 -0.01,10.044908 0.0175,0.04212 0.23812,0.04728 1.75092,0.04109 l 1.73096,-0.0071 0.0209,-0.07321 c 0.035,-0.122754 0.0311,-9.873938 -0.004,-9.966283 l -0.0314,-0.08244 z m 19.16098,2.021049 c 0.42974,5.15e-4 0.50221,0.0083 0.59181,0.06363 0.0561,0.03466 0.16954,0.07999 0.25202,0.10072 0.0825,0.02074 0.18259,0.07239 0.22247,0.114832 0.0399,0.04244 0.0843,0.0772 0.0987,0.0772 0.0558,0 0.41591,0.299152 0.45789,0.380339 0.0244,0.04712 0.0748,0.113151 0.1119,0.146772 0.0372,0.03362 0.0678,0.07694 0.0681,0.09629 3.4e-4,0.01935 0.0437,0.09884 0.0964,0.176591 0.0527,0.07776 0.0958,0.166169 0.0958,0.196469 0,0.0303 0.0297,0.0928 0.0659,0.138882 0.0362,0.04608 0.0795,0.168308 0.0961,0.271717 0.0166,0.103406 0.0597,0.27344 0.0957,0.377854 0.13231,0.384574 0.11056,1.545362 -0.034,1.815443 -0.0202,0.03778 -0.0496,0.157588 -0.0654,0.266217 -0.0158,0.10863 -0.0651,0.268656 -0.10959,0.355582 -0.0445,0.08693 -0.0808,0.175474 -0.0808,0.196823 0,0.02135 -0.0228,0.05768 -0.0506,0.08076 -0.0278,0.02307 -0.077,0.09351 -0.10932,0.156537 -0.0606,0.11809 -0.39981,0.476376 -0.57282,0.605029 -0.21587,0.160517 -0.47378,0.272172 -0.69696,0.301714 -0.53876,0.07132 -0.65405,0.07715 -0.7605,0.0386 -0.0588,-0.0213 -0.17395,-0.03981 -0.25584,-0.04117 -0.15673,-0.0026 -0.51626,-0.16605 -0.78837,-0.358422 -0.21304,-0.150612 -0.65303,-0.69936 -0.65303,-0.814455 0,-0.02281 -0.037,-0.09597 -0.0822,-0.16257 -0.0452,-0.06661 -0.0971,-0.202318 -0.11545,-0.301628 -0.0183,-0.09931 -0.0644,-0.245626 -0.10249,-0.32514 -0.0653,-0.136202 -0.0693,-0.191218 -0.0693,-0.949162 0,-0.722476 0.006,-0.813573 0.0581,-0.893343 0.032,-0.04886 0.0775,-0.189986 0.10107,-0.313609 0.0236,-0.123624 0.0647,-0.249301 0.0914,-0.279265 0.0267,-0.02996 0.0645,-0.114205 0.084,-0.187242 0.0194,-0.07304 0.058,-0.151588 0.0856,-0.174552 0.0277,-0.02296 0.0792,-0.0984 0.11456,-0.167627 0.12099,-0.237165 0.77604,-0.826168 0.91881,-0.826168 0.0189,0 0.10558,-0.03695 0.19257,-0.08209 0.14953,-0.07759 0.18485,-0.0821 0.6478,-0.08155 z m 12.50549,0.105599 c 0.0401,-8.59e-4 0.0765,4.1e-5 0.10764,0.0027 0.43015,0.03751 0.7443,0.09528 0.82288,0.151389 0.0462,0.03299 0.13683,0.08211 0.20135,0.109062 0.19392,0.08102 0.60325,0.517571 0.74284,0.79227 0.1445,0.284349 0.17048,0.518915 0.066,0.595355 -0.0523,0.03823 -0.37621,0.0457 -1.99763,0.0457 -2.17018,0 -2.03669,0.01539 -2.0356,-0.235247 3.4e-4,-0.09529 0.0284,-0.175289 0.0964,-0.275631 0.0527,-0.07776 0.0957,-0.154619 0.0957,-0.170821 0,-0.03489 0.16415,-0.243617 0.31867,-0.405189 0.14821,-0.154982 0.42313,-0.358861 0.4839,-0.358861 0.0271,0 0.11631,-0.03568 0.19815,-0.07925 0.15213,-0.08098 0.61865,-0.166055 0.89965,-0.171535 z" /></g><path
       id="path7"
       style="fill:url(#linearGradient10);stroke:#ffaf10;stroke-width:0.529167;stroke-linecap:round;stroke-linejoin:round;stroke-dasharray:none;stroke-opacity:1"
       d="m 35.196267,22.790659 a 11.562694,9.2772121 0 0 0 -6.342765,1.527039 l 5.98413,7.470345 h 0.09663 l 6.164482,-7.695138 a 11.562694,9.2772121 0 0 0 -5.902477,-1.302246 z" /><path
       style="fill:url(#linearGradient60);fill-opacity:1;stroke:#000000;stroke-width:0.3175;stroke-linecap:round;stroke-linejoin:round;stroke-dasharray:none;stroke-opacity:1"
       d="m 27.237016,33.518268 c -0.117374,-0.0019 -0.267241,-0.0045 -0.323598,0.09872 -0.05264,0.157825 -0.03295,0.325735 -0.05295,0.487714 -0.01466,0.303109 -0.05282,0.606518 -0.04033,0.90992 0.06896,0.335507 0.181204,0.667128 0.190415,1.009371 0.01393,0.344092 0.0099,0.685974 -0.0793,1.023017 -0.05878,0.302463 -0.156896,0.591655 -0.273806,0.88238 -0.0031,-0.0026 -0.02486,0.07711 -0.02461,0.108916 -0.04816,0.449344 -0.05596,0.897933 -0.09091,1.34749 -0.004,0.171253 -0.01778,0.343093 -0.02018,0.513803 0.02024,0.125705 0.188693,0.172088 0.324977,0.16917 0.49481,0.01401 0.991456,0.04607 1.485854,0.02717 0.130794,-0.0097 0.180816,-0.126874 0.169823,-0.219778 0.01896,-0.338546 0.01894,-0.679124 0.02763,-1.016904 0.431877,0.327547 0.856365,0.670843 1.296986,0.994307 0.09245,0.07649 0.250653,0.06513 0.33255,-0.0165 0.378554,-0.295917 0.749679,-0.599061 1.101119,-0.916307 0.105514,-0.0909 0.04713,-0.237723 -0.07884,-0.293809 -0.486267,-0.351146 -0.942752,-0.728469 -1.419869,-1.087739 0.391438,-0.08914 0.775887,-0.225504 1.074288,-0.455204 0.469517,-0.327753 0.769062,-0.799489 0.871861,-1.291967 0.02602,-0.213022 0.02607,-0.430647 -0.01705,-0.642152 -0.124335,-0.467987 -0.437262,-0.914047 -0.927755,-1.190088 -0.472717,-0.269754 -1.050477,-0.402959 -1.625726,-0.407693 -0.633193,-0.0193 -1.26692,-0.0331 -1.900586,-0.03385 z m 1.557244,1.341344 c 0.350857,7.38e-4 0.726888,0.146129 0.865149,0.420749 0.13202,0.250338 0.07612,0.55113 -0.108769,0.773967 -0.183844,0.215989 -0.52051,0.304753 -0.826449,0.314386 -0.03249,-0.02705 0.0025,-0.111104 -0.0065,-0.157859 0.02774,-0.4493 0.03587,-0.903279 0.05119,-1.352169 l 0.01358,5.07e-4 z"
       id="path35" /><path
       style="fill:url(#linearGradient62);fill-opacity:1;stroke:#000000;stroke-width:0.3175;stroke-linecap:round;stroke-linejoin:round;stroke-dasharray:none;stroke-opacity:1"
       d="m 31.297742,33.511822 c -0.124763,0.04838 -0.117153,0.168168 -0.111888,0.263186 0.007,0.164933 -0.01456,0.3324 0.01172,0.49563 0.05619,0.111512 0.168763,0.201181 0.232726,0.311432 0.141716,0.223074 0.240181,0.465366 0.266334,0.716397 0.02215,0.19463 0.01118,0.393194 -0.02924,0.585563 -0.04632,0.181495 -0.119388,0.357031 -0.218111,0.524188 -0.07283,0.146012 -0.202778,0.266895 -0.293426,0.404115 -0.03939,0.107229 -0.02397,0.224438 -0.0368,0.335964 -0.01596,0.457566 -0.0216,0.916035 -0.02049,1.373366 0.01996,0.118527 0.169444,0.179033 0.258301,0.263432 0.08165,0.03172 -0.0273,0.06603 -0.05116,0.0981 -0.09576,0.07028 -0.20547,0.151088 -0.19833,0.26573 -0.01179,0.218521 -0.03109,0.439538 -0.0012,0.657285 0.03491,0.117192 0.198725,0.138131 0.324494,0.13675 0.508042,0.0053 1.017053,0.0057 1.524614,9.22e-4 0.133832,-0.005 0.199585,-0.121508 0.179546,-0.218631 0.0059,-0.566572 0.01144,-1.133163 0.01786,-1.699447 0.675849,-0.04398 1.35641,-0.172856 1.942831,-0.457864 0.329185,-0.153138 0.608012,-0.371752 0.838496,-0.614755 0.07706,-0.1041 0.161899,-0.203819 0.212883,-0.318327 0.120291,-0.218788 0.19699,-0.455589 0.219258,-0.694601 0.0033,-0.294164 0.01713,-0.592805 -0.0738,-0.880344 -0.07361,-0.255005 -0.232337,-0.492009 -0.433185,-0.695386 -0.252488,-0.250299 -0.584431,-0.440399 -0.942837,-0.57771 -0.272592,-0.112318 -0.566243,-0.189413 -0.866329,-0.234719 -0.395347,-0.05114 -0.797656,-0.03143 -1.196299,-0.04374 -0.495971,-0.0045 -0.992794,-0.01373 -1.488311,-0.0085 -0.02255,0.004 -0.04511,0.008 -0.06766,0.01196 z m 1.874233,1.446434 c 0.184436,0.01442 0.369057,0.04928 0.530482,0.122076 0.286,0.116689 0.501719,0.358968 0.505396,0.62364 0.01796,0.208388 -0.04373,0.438068 -0.248506,0.577779 -0.145378,0.125945 -0.353967,0.181341 -0.559537,0.203431 -0.07096,0.0089 -0.142623,0.0131 -0.214266,0.01619 -0.01035,-0.512513 -0.01339,-1.029263 -0.01931,-1.54359 z m 2.945502,1.720333 c -0.0093,0.04579 -5.15e-4,-8.3e-4 0,0 z m -0.139691,0.201469 c -0.0082,0.02181 0.0056,-0.01884 0,0 z"
       id="path36"
       sodipodi:nodetypes="scccccccccccccccccccccccccccsscccccccccccc" /><path
       id="path42"
       style="fill:url(#linearGradient56);stroke:#000000;stroke-width:0.3175;stroke-linecap:round;stroke-linejoin:round;stroke-dasharray:none;stroke-opacity:1"
       d="m 46.067735,33.430684 c -0.08321,-0.0014 -0.166053,1.18e-4 -0.24668,0.01476 v -3e-5 c -0.143077,0.05736 -0.111091,0.198752 -0.122663,0.305224 -0.003,0.137146 -0.01856,0.274915 -0.02437,0.412442 l -0.0013,-0.0012 -0.145349,2.464562 0.0014,-5.9e-5 c -0.02125,0.31239 -0.03983,0.625051 -0.05645,0.93756 l -0.0015,7.84e-4 -0.104486,1.848749 c -0.01352,0.07697 -0.0077,0.158134 -0.01431,0.234345 -0.01692,0.108263 0.0982,0.208726 0.233835,0.196633 1.038518,0.02178 1.531564,0.02022 3.55146,0.06987 0.120305,0.0039 0.284197,0.007 0.328593,-0.106761 0.03163,-0.142762 0.01536,-0.292888 0.029,-0.438446 0.0081,-0.279398 0.03536,-0.559246 0.02881,-0.838847 -0.0059,-0.108237 -0.1483,-0.161874 -0.267674,-0.146637 -0.504234,-0.0048 -1.00838,-0.01474 -1.512001,-0.03445 -0.0766,-0.0012 -0.153239,-3.54e-4 -0.229816,-0.0024 0.0025,-0.361494 0.01539,-0.721283 0.03448,-1.081635 0.453504,-0.0068 0.905877,0.01593 1.360155,4.61e-4 0.131862,-0.0087 0.197979,-0.119992 0.192972,-0.217029 0.02527,-0.319112 0.04971,-0.63954 0.03722,-0.959296 -0.0091,-0.10472 -0.143682,-0.162614 -0.262528,-0.151972 -0.41362,-0.0149 -0.837616,-0.0085 -1.244252,-0.02332 0.02468,-0.295141 0.03574,-0.590875 0.05423,-0.886283 0.571383,-0.0092 1.152364,0.01525 1.729536,0.02759 0.132363,0.01376 0.256565,-0.07203 0.255693,-0.181086 0.05118,-0.397293 0.0811,-0.79663 0.126345,-1.191171 0.01152,-0.108252 -0.11775,-0.188754 -0.244389,-0.179043 -1.078157,-0.04147 -2.157636,-0.05998 -3.236877,-0.07076 -0.08224,0.0031 -0.165833,-0.0012 -0.249045,-0.0025 z"
       sodipodi:nodetypes="cccccccccccccccccccccccccccccccccc" /><path
       style="fill:url(#linearGradient68);fill-opacity:1;stroke:#000000;stroke-width:0.3175;stroke-linecap:round;stroke-linejoin:round;stroke-dasharray:none;stroke-opacity:1"
       d="m 44.897203,33.119814 c -0.581284,0.0084 -1.124901,0.247715 -1.531512,0.574292 -0.335485,0.255623 -0.558727,0.610579 -0.582189,0.986025 -0.06531,0.528613 0.09634,1.051707 0.267549,1.557355 0.08105,0.252422 0.202968,0.497917 0.245671,0.757426 0.0076,0.158544 -0.021,0.32125 -0.08754,0.470435 -0.09208,0.202089 -0.295294,0.383971 -0.566802,0.419577 -0.1906,0.0347 -0.389053,0.01597 -0.573082,-0.03156 -0.15744,-0.02513 -0.286526,0.110491 -0.243293,0.230505 0.05129,0.20705 0.132462,0.408637 0.189754,0.614755 0.06881,0.183516 0.09979,0.376998 0.189646,0.55474 0.108988,0.160803 0.336858,0.224449 0.528497,0.301095 0.22352,0.076 0.465253,0.109963 0.705809,0.119541 0.226627,-0.01601 0.455367,-0.03743 0.667811,-0.104809 0.389634,-0.119897 0.733632,-0.331194 0.982449,-0.602836 0.242564,-0.258889 0.390793,-0.573512 0.449196,-0.894097 0.07428,-0.432609 -0.08692,-0.863639 -0.299638,-1.255642 -0.108745,-0.247168 -0.220604,-0.494509 -0.277596,-0.753906 -0.04972,-0.240489 -0.100046,-0.491104 -0.03453,-0.732558 0.05409,-0.20066 0.292861,-0.362931 0.550322,-0.343593 0.127789,-0.0024 0.263692,0.0091 0.385694,0.05413 0.141164,0.04915 0.31495,-0.03464 0.319963,-0.161158 0.0572,-0.417973 0.108212,-0.835606 0.178599,-1.249383 0.01954,-0.107886 -0.05946,-0.211232 -0.184522,-0.248528 -0.3159,-0.121357 -0.648263,-0.225441 -0.999544,-0.24971 -0.0932,-0.0081 -0.186954,-0.01257 -0.280705,-0.0121 z m -0.977152,6.491888 c -0.03431,0.01463 0.03867,-0.01811 0,0 z m -0.547003,0.06029 c -0.06458,-0.01604 -0.05974,-0.0171 0,0 z"
       id="path50" /><path
       id="path38"
       style="fill:url(#linearGradient66);fill-opacity:1;stroke:#000000;stroke-width:0.3175;stroke-linecap:round;stroke-linejoin:round;stroke-dasharray:none;stroke-opacity:1"
       d="m 40.688517,33.430655 c -0.08321,-0.0014 -0.166014,1.17e-4 -0.246642,0.01476 -0.143077,0.05736 -0.11109,0.198753 -0.122664,0.305225 -0.003,0.137115 -0.01855,0.274854 -0.02437,0.41235 l -0.0016,5.99e-4 -0.154213,2.626351 c -0.01905,0.290931 -0.0362,0.581911 -0.05127,0.872777 l -0.10456,1.780858 c -0.0079,0.06783 -0.0046,0.137861 -0.01044,0.204224 -0.01692,0.108265 0.09824,0.208726 0.233872,0.196634 0.607033,0.01382 1.214074,0.02657 1.821101,0.03844 l 0.130589,-2.360544 c 0.0038,-0.08573 0.0066,-0.171471 0.01115,-0.25724 0.001,-1.5e-5 0.0021,1.6e-5 0.0031,0 l 0.210812,-3.811028 c -0.481888,-0.0093 -0.963856,-0.01604 -1.445787,-0.02085 -0.08224,0.0031 -0.16587,-0.0012 -0.249083,-0.0026 z" /><path
       style="fill:url(#linearGradient64);fill-opacity:1;stroke:#000000;stroke-width:0.3175;stroke-linecap:round;stroke-linejoin:round;stroke-dasharray:none;stroke-opacity:1"
       d="m 37.43536,33.178513 c -0.64934,0.0018 -1.290734,0.05139 -1.938936,0.06914 -0.143223,0.01436 -0.299501,-0.0081 -0.432699,0.04041 -0.136559,0.0727 -0.07934,0.218219 -0.09105,0.329307 -0.01474,0.12509 0.09143,0.228665 0.219321,0.285774 0.268411,0.133813 0.508997,0.303195 0.701519,0.506091 0.292297,0.285965 0.438376,0.655924 0.450652,1.024654 0.01948,0.373104 0.01158,0.758319 -0.163958,1.109634 -0.123996,0.27976 -0.341538,0.525972 -0.607905,0.728114 -0.09738,0.06321 -0.136074,0.169871 -0.102299,0.265346 0.09422,0.666011 0.176997,1.334087 0.275634,2.000094 0.0041,0.104576 0.09373,0.212825 0.232833,0.21309 0.47112,-0.02993 0.955699,-0.07157 1.417632,-0.101532 0.137191,-0.01756 0.31746,0.02278 0.40924,-0.08305 0.06504,-0.101358 0.02159,-0.221665 0.01949,-0.330983 -0.02399,-0.193606 -0.05318,-0.38706 -0.07299,-0.58046 0.413043,0.317855 0.827847,0.6348 1.246788,0.947158 0.09886,0.07004 0.249024,0.04009 0.325035,-0.03947 0.368933,-0.290173 0.737323,-0.581605 1.087126,-0.887015 0.08555,-0.08233 0.03383,-0.200024 -0.06159,-0.260427 -0.512027,-0.408653 -1.020697,-0.820219 -1.537433,-1.224981 0.357243,-0.221435 0.690361,-0.473886 0.93944,-0.779842 0.326824,-0.380537 0.525743,-0.85193 0.442631,-1.318638 -0.08746,-0.542687 -0.472196,-1.029991 -0.972899,-1.386293 -0.35753,-0.265199 -0.813975,-0.43026 -1.283758,-0.514168 -0.166046,-0.01862 -0.334745,-0.01 -0.501828,-0.01194 z m 1.326911,0.264846 c 0.01457,0.0041 -0.04257,-0.0094 0,0 z m -1.327655,1.213276 c 0.383266,0.0012 0.707136,0.256441 0.791754,0.550062 0.06212,0.203733 0.03297,0.434387 -0.135999,0.600634 -0.161031,0.144071 -0.381773,0.247797 -0.616609,0.289011 -0.05504,-0.461478 -0.116128,-0.937036 -0.177138,-1.395387 -0.02916,-0.064 0.07516,-0.03396 0.122775,-0.04423 0.0051,2.13e-4 0.01015,-9.4e-5 0.01522,-9.4e-5 z"
       id="path37" /><path
       id="path34"
       style="fill:url(#linearGradient58);fill-opacity:1;stroke:#000000;stroke-width:0.3175;stroke-linecap:round;stroke-linejoin:round;stroke-dasharray:none;stroke-opacity:1"
       d="m 21.930021,33.334319 c -0.02988,0.0024 -0.05963,0.0055 -0.08901,0.01085 -0.143078,0.05736 -0.111092,0.198756 -0.122664,0.305224 -0.003,0.137114 -0.01855,0.274854 -0.02437,0.412351 l -0.0016,5.99e-4 -0.101444,1.727599 c -0.0021,0.05228 -0.004,0.104556 -0.0068,0.156849 -8.01e-4,1.2e-5 -0.0016,0 -0.0024,0 l -0.0116,0.197457 -0.01112,0.201053 -0.0026,-1.83e-4 c 0,0 -0.240097,1.340696 0.194098,2.330181 0.0086,0.02893 0.02153,0.05718 0.03898,0.08435 0.01613,0.03218 0.03295,0.0619 0.05048,0.08923 0.196703,0.341364 0.502121,0.649853 0.916785,0.827781 0.247042,0.122685 0.528685,0.190378 0.811548,0.232911 0.138565,0.01206 0.274314,0.04548 0.414788,0.02537 0.254505,-0.0114 0.504139,-0.06369 0.738837,-0.142673 0.354518,-0.12263 0.669669,-0.309789 0.935677,-0.534995 0.316705,-0.249808 0.553478,-0.556436 0.761446,-0.869577 0.06269,-0.09918 0.11422,-0.204894 0.174418,-0.305985 0.125831,-0.256971 0.231762,-0.519253 0.300425,-0.790375 0.06592,-0.243278 0.11278,-0.49033 0.129687,-0.738915 3e-6,-5e-5 -3e-6,-1e-4 0,-1.53e-4 0.0011,-0.01603 0.0024,-0.03206 0.0033,-0.04811 l 0.07617,-1.120413 h 0.0013 l 0.105124,-1.900149 c -0.01556,-0.04814 -0.05592,-0.08935 -0.10888,-0.112736 -0.04876,-0.0011 -0.09753,-0.002 -0.146288,-0.0031 -7.49e-4,-3.54e-4 -0.0013,-8.3e-4 -0.002,-0.0011 -0.526427,-0.01194 -1.052879,-0.02288 -1.579304,-0.03335 -0.02989,0.0024 -0.05965,0.0055 -0.08905,0.01085 -0.143078,0.05736 -0.111091,0.198756 -0.122664,0.305223 -0.003,0.137114 -0.01855,0.274855 -0.02437,0.412351 l -0.0016,5.99e-4 -0.101443,1.727599 c -0.0021,0.05228 -0.004,0.104556 -0.0068,0.15685 -7.96e-4,1.1e-5 -0.0016,0 -0.0024,0 l -0.01161,0.197456 -0.016,0.289219 h -1.19e-4 c 4.8e-5,0.0013 -6e-6,0.0026 3.8e-5,0.0039 l -3.64e-4,0.09981 h 2.91e-4 c -0.0062,0.20922 -0.05199,0.424045 -0.114851,0.630964 -0.103819,0.257082 -0.218716,0.532863 -0.481867,0.713276 -0.114576,0.08191 -0.262407,0.129314 -0.415727,0.119748 -0.06941,0.0037 -0.133295,-0.02542 -0.196464,-0.04481 -0.224635,-0.100873 -0.305342,-0.314312 -0.348198,-0.506003 -0.05064,-0.271112 -0.03601,-0.535554 -0.01401,-0.808026 0.0046,-0.03954 0.0112,-0.07894 0.01871,-0.118254 5.15e-4,-0.005 0.0019,-0.01798 0.0029,-0.02701 h 3.8e-5 c 0.0029,-0.02722 0.0051,-0.04834 0.0066,-0.06326 10e-6,-7.7e-5 2.9e-5,-2.6e-4 3.7e-5,-3.36e-4 3.64e-4,-0.0036 0.0015,-0.0136 0.0016,-0.01537 l 0.162588,-2.938707 c -0.01555,-0.04814 -0.05593,-0.08936 -0.10888,-0.112737 -0.526417,-0.01194 -1.05285,-0.02289 -1.579268,-0.03335 z" /><path
       style="fill:url(#linearGradient54);fill-opacity:1;stroke:#000000;stroke-width:0.3175;stroke-linecap:round;stroke-linejoin:round;stroke-dasharray:none;stroke-opacity:1"
       d="m 21.014893,33.119814 c -0.581283,0.0084 -1.1249,0.247715 -1.531511,0.574292 -0.335485,0.255623 -0.558727,0.610578 -0.582189,0.986025 -0.06531,0.528613 0.09634,1.051707 0.267549,1.557355 0.08105,0.252422 0.202968,0.497917 0.245671,0.757426 0.0076,0.158544 -0.021,0.32125 -0.08754,0.470435 -0.09208,0.202089 -0.295293,0.383971 -0.566801,0.419577 -0.1906,0.0347 -0.389053,0.01597 -0.573082,-0.03156 -0.15744,-0.02513 -0.286526,0.110491 -0.243293,0.230505 0.05129,0.20705 0.132461,0.408637 0.189754,0.614755 0.06881,0.183516 0.09979,0.376998 0.189646,0.55474 0.108988,0.160803 0.336858,0.224449 0.528496,0.301095 0.223521,0.076 0.465254,0.109963 0.705811,0.119541 0.226626,-0.01601 0.455365,-0.03743 0.66781,-0.104809 0.389634,-0.119897 0.733632,-0.331194 0.982449,-0.602836 0.242564,-0.258889 0.390793,-0.573512 0.449195,-0.894097 0.07428,-0.432606 -0.08692,-0.863637 -0.299637,-1.255641 -0.108745,-0.247167 -0.220604,-0.494508 -0.277596,-0.753905 -0.04972,-0.240489 -0.100046,-0.491104 -0.03453,-0.732559 0.05409,-0.200659 0.292861,-0.36293 0.550322,-0.343592 0.127788,-0.0024 0.263692,0.0091 0.385693,0.05413 0.141165,0.04915 0.314951,-0.03464 0.319963,-0.161158 0.0572,-0.417973 0.108213,-0.835607 0.178599,-1.249384 0.01954,-0.107886 -0.05946,-0.211232 -0.184521,-0.248527 -0.3159,-0.121357 -0.648264,-0.225441 -0.999544,-0.24971 -0.0932,-0.0081 -0.186954,-0.01257 -0.280706,-0.0121 z m -0.977151,6.491888 c -0.03431,0.01463 0.03867,-0.01811 0,0 z m -0.547003,0.06029 c -0.06458,-0.01604 -0.05974,-0.0171 0,0 z"
       id="path33" /></g></svg>
