%YAML 1.1
%TAG !u! tag:unity3d.com,2011:
--- !u!114 &11400000
MonoBehaviour:
  m_ObjectHideFlags: 0
  m_CorrespondingSourceObject: {fileID: 0}
  m_PrefabInstance: {fileID: 0}
  m_PrefabAsset: {fileID: 0}
  m_GameObject: {fileID: 0}
  m_Enabled: 1
  m_EditorHideFlags: 0
  m_Script: {fileID: 11500000, guid: bbb281ee3bf0b054c82ac2347e9e782c, type: 3}
  m_Name: Default Local Group
  m_EditorClassIdentifier: 
  m_GroupName: Default Local Group
  m_Data:
    m_SerializedData: []
  m_GUID: e3854747b69fa54409d612df402bc079
  m_SerializeEntries: []
  m_ReadOnly: 0
  m_Settings: {fileID: 11400000, guid: 710a1c145d989e443b61ba5ae5760faa, type: 2}
  m_SchemaSet:
    m_Schemas:
    - {fileID: 11400000, guid: ab0f415a23961c8499452d23f7f3f902, type: 2}
    - {fileID: 11400000, guid: 15615e9f802b9ed498fcfe1235177064, type: 2}
