# Wavefront OBJ file exported by LightRay3D

mtllib small_house.mtl

v -10.000000 8.357740 -1.857697
v -8.142303 8.357740 -1.857697
v -10.000000 8.357740 2.857696
v -8.142303 8.357740 2.857696
v -10.000000 3.642260 2.857696
v -8.142303 3.642260 2.857696
v -8.142303 3.642260 -1.857697
v -10.000000 3.642260 -1.857697
v -10.000000 2.857740 3.642303
v -8.142303 2.857740 3.642303
v -10.000000 2.857740 8.357697
v -8.142303 2.857740 8.357697
v -10.000000 -1.857745 8.357697
v -8.142303 -1.857745 8.357697
v -8.142303 -1.857745 3.642303
v -10.000000 -1.857745 3.642303
v -10.000000 -2.642255 -1.857697
v -8.142303 -2.642255 -1.857697
v -10.000000 -2.642255 2.857696
v -8.142303 -2.642255 2.857696
v -10.000000 -7.357745 2.857696
v -8.142303 -7.357745 2.857696
v -8.142303 -7.357745 -1.857697
v -10.000000 -7.357745 -1.857697
v -10.000000 2.857740 -1.857697
v -8.142303 2.857740 -1.857697
v -10.000000 2.857740 2.857696
v -8.142303 2.857740 2.857696
v -10.000000 -1.857745 2.857696
v -8.142303 -1.857745 2.857696
v -8.142303 -1.857745 -1.857697
v -10.000000 -1.857745 -1.857697
v -10.000000 -2.642255 3.642303
v -8.142303 -2.642255 3.642303
v -10.000000 -2.642255 8.357697
v -8.142303 -2.642255 8.357697
v -10.000000 -7.357745 8.357697
v -8.142303 -7.357745 8.357697
v -8.142303 -7.357745 3.642303
v -10.000000 -7.357745 3.642303
v 10.000000 8.357740 2.857697
v 8.142303 8.357740 2.857697
v 10.000000 8.357740 -1.857696
v 8.142303 8.357740 -1.857696
v 10.000000 3.642260 -1.857696
v 8.142303 3.642260 -1.857696
v 8.142303 3.642260 2.857697
v 10.000000 3.642260 2.857697
v 10.000000 2.857740 8.357697
v 8.142303 2.857740 8.357697
v 10.000000 2.857740 3.642304
v 8.142303 2.857740 3.642304
v 10.000000 -1.857745 3.642304
v 8.142303 -1.857745 3.642304
v 8.142303 -1.857745 8.357697
v 10.000000 -1.857745 8.357697
v 10.000000 -2.642255 2.857697
v 8.142303 -2.642255 2.857697
v 10.000000 -2.642255 -1.857696
v 8.142303 -2.642255 -1.857696
v 10.000000 -7.357745 -1.857696
v 8.142303 -7.357745 -1.857696
v 8.142303 -7.357745 2.857697
v 10.000000 -7.357745 2.857697
v 10.000000 -2.642255 8.357697
v 8.142303 -2.642255 8.357697
v 10.000000 -2.642255 3.642304
v 8.142303 -2.642255 3.642304
v 10.000000 -7.357745 3.642304
v 8.142303 -7.357745 3.642304
v 8.142303 -7.357745 8.357697
v 10.000000 -7.357745 8.357697
v 10.000000 8.357740 8.357697
v 8.142303 8.357740 8.357697
v 10.000000 8.357740 3.642304
v 8.142303 8.357740 3.642304
v 10.000000 3.642260 3.642304
v 8.142303 3.642260 3.642304
v 8.142303 3.642260 8.357697
v 10.000000 3.642260 8.357697
v 10.000000 2.857740 2.857697
v 8.142303 2.857740 2.857697
v 10.000000 2.857740 -1.857696
v 8.142303 2.857740 -1.857696
v 10.000000 -1.857745 -1.857696
v 8.142303 -1.857745 -1.857696
v 8.142303 -1.857745 2.857697
v 10.000000 -1.857745 2.857697
v -10.000000 8.357740 3.642303
v -8.142303 8.357740 3.642303
v -10.000000 8.357740 8.357697
v -8.142303 8.357740 8.357697
v -10.000000 3.642260 8.357697
v -8.142303 3.642260 8.357697
v -8.142303 3.642260 3.642303
v -10.000000 3.642260 3.642303
v -7.857697 -10.000000 -1.857697
v -7.857697 -7.642255 -1.857697
v -7.857697 -10.000000 2.857696
v -7.857697 -7.642255 2.857696
v -3.142303 -10.000000 2.857697
v -3.142303 -7.642255 2.857697
v -3.142303 -7.642255 -1.857697
v -3.142303 -10.000000 -1.857697
v -2.357697 -10.000000 3.642303
v -2.357697 -7.642255 3.642303
v -2.357697 -10.000000 8.357697
v -2.357697 -7.642255 8.357697
v 2.357696 -10.000000 8.357697
v 2.357696 -7.642255 8.357697
v 2.357696 -7.642255 3.642303
v 2.357696 -10.000000 3.642303
v 3.142303 -10.000000 -1.857696
v 3.142303 -7.642255 -1.857696
v 3.142303 -10.000000 2.857697
v 3.142303 -7.642255 2.857697
v 7.857697 -10.000000 2.857697
v 7.857697 -7.642255 2.857697
v 7.857697 -7.642255 -1.857696
v 7.857697 -10.000000 -1.857696
v -2.357697 -10.000000 -1.857697
v -2.357697 -7.642255 -1.857697
v -2.357697 -10.000000 2.857697
v -2.357697 -7.642255 2.857697
v 2.357697 -10.000000 2.857697
v 2.357697 -7.642255 2.857697
v 2.357697 -7.642255 -1.857696
v 2.357697 -10.000000 -1.857696
v 3.142303 -10.000000 3.642303
v 3.142303 -7.642255 3.642303
v 3.142303 -10.000000 8.357697
v 3.142303 -7.642255 8.357697
v 7.857696 -10.000000 8.357697
v 7.857696 -7.642255 8.357697
v 7.857697 -7.642255 3.642304
v 7.857697 -10.000000 3.642304
v -7.857697 10.000000 2.857696
v -7.857697 8.642260 2.857696
v -7.857697 10.000000 -1.857697
v -7.857697 8.642260 -1.857697
v -3.142303 10.000000 -1.857697
v -3.142303 8.642260 -1.857697
v -3.142303 8.642260 2.857697
v -3.142303 10.000000 2.857697
v -1.154999 10.000000 -2.277901
v -1.154999 8.642260 -2.277901
v -1.154998 10.000000 -8.722099
v -1.154998 8.642260 -8.722099
v 1.154999 10.000000 -8.722099
v 1.154999 8.642260 -8.722099
v 1.154999 8.642260 -2.277901
v 1.154999 10.000000 -2.277901
v -2.357697 10.000000 8.357697
v -2.357697 8.642260 8.357697
v -2.357697 10.000000 3.642303
v -2.357697 8.642260 3.642303
v 2.357696 10.000000 3.642303
v 2.357696 8.642260 3.642303
v 2.357696 8.642260 8.357697
v 2.357696 10.000000 8.357697
v 3.142303 10.000000 2.857697
v 3.142303 8.642260 2.857697
v 3.142303 10.000000 -1.857696
v 3.142303 8.642260 -1.857696
v 7.857697 10.000000 -1.857696
v 7.857697 8.642260 -1.857696
v 7.857697 8.642260 2.857697
v 7.857697 10.000000 2.857697
v -2.357697 10.000000 2.857697
v -2.357697 8.642260 2.857697
v -2.357697 10.000000 -1.857697
v -2.357697 8.642260 -1.857697
v 2.357697 10.000000 -1.857696
v 2.357697 8.642260 -1.857696
v 2.357697 8.642260 2.857697
v 2.357697 10.000000 2.857697
v -7.857697 -10.000000 3.642303
v -7.857697 -7.642255 3.642303
v -7.857697 -10.000000 8.357697
v -7.857697 -7.642255 8.357697
v -3.142304 -10.000000 8.357697
v -3.142304 -7.642255 8.357697
v -3.142304 -7.642255 3.642303
v -3.142304 -10.000000 3.642303
v -7.857697 10.000000 8.357697
v -7.857697 8.642260 8.357697
v -7.857697 10.000000 3.642303
v -7.857697 8.642260 3.642303
v -3.142304 10.000000 3.642303
v -3.142304 8.642260 3.642303
v -3.142304 8.642260 8.357697
v -3.142304 10.000000 8.357697
v 3.142303 10.000000 8.357697
v 3.142303 8.642260 8.357697
v 3.142303 10.000000 3.642303
v 3.142303 8.642260 3.642303
v 7.857697 10.000000 3.642304
v 7.857697 8.642260 3.642304
v 7.857696 8.642260 8.357697
v 7.857696 10.000000 8.357697
v -10.000000 10.000000 10.000000
v -10.000000 10.000000 -10.000000
v 10.000000 10.000000 -10.000000
v 10.000000 10.000000 10.000000
v -10.000000 -10.000000 -10.000000
v -10.000000 -10.000000 10.000000
v 10.000000 -10.000000 10.000000
v 10.000000 -10.000000 -10.000000
# Num Verts: 208

vt 0.222824 0.706522
vt 0.299843 0.823228
vt 0.299843 0.706522
vt 0.222824 0.823228
vt 0.132990 0.842647
vt 0.210010 0.959353
vt 0.210010 0.842647
vt 0.132990 0.959353
vt 0.043157 0.706522
vt 0.120177 0.823228
vt 0.120177 0.706522
vt 0.043157 0.823228
vt 0.043157 0.842647
vt 0.120177 0.959353
vt 0.120177 0.842647
vt 0.043157 0.959353
vt 0.222824 0.842647
vt 0.299843 0.959353
vt 0.299843 0.842647
vt 0.222824 0.959353
vt 0.132990 0.706522
vt 0.210010 0.823228
vt 0.210010 0.706522
vt 0.132990 0.823228
vt 0.000000 0.823228
vt 0.038510 0.706522
vt 0.000000 0.706522
vt 0.038510 0.823228
vt 0.000000 0.959353
vt 0.038510 0.842647
vt 0.000000 0.842647
vt 0.038510 0.959353
vt 0.000000 0.823228
vt 0.038510 0.706522
vt 0.000000 0.706522
vt 0.038510 0.823228
vt 0.000000 0.823228
vt 0.038510 0.706522
vt 0.000000 0.706522
vt 0.038510 0.823228
vt 0.000000 0.959353
vt 0.038510 0.842647
vt 0.000000 0.842647
vt 0.038510 0.959353
vt 0.326667 0.706522
vt 0.304490 0.823228
vt 0.326667 0.823228
vt 0.304490 0.706522
vt 0.326667 0.536628
vt 0.304490 0.696122
vt 0.326667 0.696122
vt 0.304490 0.536628
vt 0.326667 0.842647
vt 0.304490 0.959353
vt 0.326667 0.959353
vt 0.304490 0.842647
vt 0.326667 0.706522
vt 0.304490 0.823228
vt 0.326667 0.823228
vt 0.304490 0.706522
vt 0.326667 0.706522
vt 0.304490 0.823228
vt 0.326667 0.823228
vt 0.304490 0.706522
vt 0.000000 0.959353
vt 0.038510 0.842647
vt 0.000000 0.842647
vt 0.038510 0.959353
vt 0.326667 0.842647
vt 0.304490 0.959353
vt 0.326667 0.959353
vt 0.304490 0.842647
vt 0.326667 0.842647
vt 0.304490 0.959353
vt 0.326667 0.959353
vt 0.304490 0.842647
vt 0.222824 0.706522
vt 0.210010 0.823228
vt 0.222824 0.823228
vt 0.210010 0.842647
vt 0.222824 0.842647
vt 0.299843 0.823228
vt 0.299843 0.842647
vt 0.326667 1.000000
vt 0.222824 0.959353
vt 0.299843 0.959353
vt 0.299843 0.706522
vt 0.326667 0.505000
vt 0.210010 0.706522
vt 0.132990 0.706522
vt 0.000000 0.505000
vt 0.120177 0.706522
vt 0.043157 0.706522
vt 0.000000 1.000000
vt 0.043157 0.823228
vt 0.043157 0.842647
vt 0.043157 0.959353
vt 0.120177 0.959353
vt 0.132990 0.959353
vt 0.210010 0.959353
vt 0.132990 0.842647
vt 0.120177 0.842647
vt 0.120177 0.823228
vt 0.132990 0.823228
vt 0.663333 0.706522
vt 0.632991 0.823228
vt 0.663333 0.823228
vt 0.632991 0.706522
vt 0.663333 0.842647
vt 0.632991 0.959353
vt 0.663333 0.959353
vt 0.632991 0.842647
vt 0.663333 0.706522
vt 0.632991 0.823228
vt 0.663333 0.823228
vt 0.632991 0.706522
vt 0.663333 0.706522
vt 0.632991 0.823228
vt 0.663333 0.823228
vt 0.632991 0.706522
vt 0.663333 0.842647
vt 0.632991 0.959353
vt 0.663333 0.959353
vt 0.632991 0.842647
vt 0.336667 0.823228
vt 0.367009 0.706522
vt 0.336667 0.706522
vt 0.367009 0.823228
vt 0.336667 0.959353
vt 0.367009 0.842647
vt 0.336667 0.842647
vt 0.367009 0.959353
vt 0.336667 0.823228
vt 0.367009 0.706522
vt 0.336667 0.706522
vt 0.367009 0.823228
vt 0.336667 0.959353
vt 0.367009 0.842647
vt 0.336667 0.842647
vt 0.367009 0.959353
vt 0.336667 0.959353
vt 0.367009 0.842647
vt 0.336667 0.842647
vt 0.367009 0.959353
vt 0.336667 0.823228
vt 0.367009 0.706522
vt 0.336667 0.706522
vt 0.367009 0.823228
vt 0.663333 0.842647
vt 0.632991 0.959353
vt 0.663333 0.959353
vt 0.632991 0.842647
vt 0.551324 0.706522
vt 0.628342 0.823228
vt 0.628342 0.706522
vt 0.551324 0.823228
vt 0.481135 0.536628
vt 0.518865 0.696122
vt 0.518865 0.536628
vt 0.481135 0.696122
vt 0.461491 0.842647
vt 0.538509 0.959353
vt 0.538509 0.842647
vt 0.461491 0.959353
vt 0.371658 0.706522
vt 0.448676 0.823228
vt 0.448676 0.706522
vt 0.371658 0.823228
vt 0.461491 0.706522
vt 0.538509 0.823228
vt 0.538509 0.706522
vt 0.461491 0.823228
vt 0.551324 0.842647
vt 0.628342 0.959353
vt 0.628342 0.842647
vt 0.551324 0.959353
vt 0.371658 0.842647
vt 0.448676 0.959353
vt 0.448676 0.842647
vt 0.371658 0.959353
vt 0.551324 0.706522
vt 0.538509 0.706522
vt 0.551324 0.823228
vt 0.538509 0.823228
vt 0.551324 0.842647
vt 0.628342 0.842647
vt 0.628342 0.823228
vt 0.663333 1.000000
vt 0.551324 0.959353
vt 0.628342 0.959353
vt 0.628342 0.706522
vt 0.663333 0.505000
vt 0.518865 0.536628
vt 0.481135 0.536628
vt 0.336667 0.505000
vt 0.448676 0.706522
vt 0.371658 0.706522
vt 0.336667 1.000000
vt 0.371658 0.823228
vt 0.371658 0.842647
vt 0.371658 0.959353
vt 0.448676 0.959353
vt 0.461491 0.959353
vt 0.538509 0.959353
vt 0.538509 0.842647
vt 0.461491 0.823228
vt 0.461491 0.842647
vt 0.448676 0.842647
vt 0.448676 0.823228
vt 0.461491 0.706522
vt 0.518865 0.696122
vt 0.481135 0.696122
vt 0.700157 0.706522
vt 0.777176 0.823228
vt 0.777176 0.706522
vt 0.700157 0.823228
vt 0.789990 0.842647
vt 0.867010 0.959353
vt 0.867010 0.842647
vt 0.789990 0.959353
vt 0.879823 0.706522
vt 0.956843 0.823228
vt 0.956843 0.706522
vt 0.879823 0.823228
vt 0.789990 0.706522
vt 0.867010 0.823228
vt 0.867010 0.706522
vt 0.789990 0.823228
vt 0.879823 0.842647
vt 0.956843 0.959353
vt 0.956843 0.842647
vt 0.879823 0.959353
vt 0.700157 0.842647
vt 0.777176 0.959353
vt 0.777176 0.842647
vt 0.700157 0.959353
vt 1.000000 0.706522
vt 0.961490 0.823228
vt 1.000000 0.823228
vt 0.961490 0.706522
vt 1.000000 0.842647
vt 0.961490 0.959353
vt 1.000000 0.959353
vt 0.961490 0.842647
vt 1.000000 0.706522
vt 0.961490 0.823228
vt 1.000000 0.823228
vt 0.961490 0.706522
vt 1.000000 0.706522
vt 0.961490 0.823228
vt 1.000000 0.823228
vt 0.961490 0.706522
vt 1.000000 0.842647
vt 0.961490 0.959353
vt 1.000000 0.959353
vt 0.961490 0.842647
vt 0.673333 0.823228
vt 0.695510 0.706522
vt 0.673333 0.706522
vt 0.695510 0.823228
vt 0.673333 0.696122
vt 0.695510 0.536628
vt 0.673333 0.536628
vt 0.695510 0.696122
vt 0.673333 0.959353
vt 0.695510 0.842647
vt 0.673333 0.842647
vt 0.695510 0.959353
vt 0.673333 0.823228
vt 0.695510 0.706522
vt 0.673333 0.706522
vt 0.695510 0.823228
vt 0.673333 0.823228
vt 0.695510 0.706522
vt 0.673333 0.706522
vt 0.695510 0.823228
vt 1.000000 0.842647
vt 0.961490 0.959353
vt 1.000000 0.959353
vt 0.961490 0.842647
vt 0.673333 0.959353
vt 0.695510 0.842647
vt 0.673333 0.842647
vt 0.695510 0.959353
vt 0.673333 0.959353
vt 0.695510 0.842647
vt 0.673333 0.842647
vt 0.695510 0.959353
vt 0.777176 0.823228
vt 0.789990 0.706522
vt 0.777176 0.706522
vt 0.673333 0.505000
vt 0.700157 0.706522
vt 0.673333 1.000000
vt 0.700157 0.823228
vt 0.700157 0.842647
vt 0.789990 0.823228
vt 0.777176 0.842647
vt 0.867010 0.823228
vt 0.789990 0.842647
vt 0.879823 0.823228
vt 0.867010 0.842647
vt 0.956843 0.823228
vt 0.879823 0.842647
vt 1.000000 1.000000
vt 0.956843 0.842647
vt 0.879823 0.959353
vt 0.956843 0.959353
vt 0.700157 0.959353
vt 0.777176 0.959353
vt 0.789990 0.959353
vt 0.867010 0.959353
vt 0.956843 0.706522
vt 1.000000 0.505000
vt 0.879823 0.706522
vt 0.867010 0.706522
vt 0.000000 0.318228
vt 0.030342 0.201522
vt 0.000000 0.201522
vt 0.030342 0.318228
vt 0.000000 0.454353
vt 0.030342 0.337647
vt 0.000000 0.337647
vt 0.030342 0.454353
vt 0.000000 0.318228
vt 0.030342 0.201522
vt 0.000000 0.201522
vt 0.030342 0.318228
vt 0.000000 0.318228
vt 0.030342 0.201522
vt 0.000000 0.201522
vt 0.030342 0.318228
vt 0.000000 0.454353
vt 0.030342 0.337647
vt 0.000000 0.337647
vt 0.030342 0.454353
vt 0.326667 0.201522
vt 0.296324 0.318228
vt 0.326667 0.318228
vt 0.296324 0.201522
vt 0.326667 0.337647
vt 0.296324 0.454353
vt 0.326667 0.454353
vt 0.296324 0.337647
vt 0.326667 0.201522
vt 0.296324 0.318228
vt 0.326667 0.318228
vt 0.296324 0.201522
vt 0.326667 0.337647
vt 0.296324 0.454353
vt 0.326667 0.454353
vt 0.296324 0.337647
vt 0.326667 0.337647
vt 0.296324 0.454353
vt 0.326667 0.454353
vt 0.296324 0.337647
vt 0.326667 0.201522
vt 0.296324 0.318228
vt 0.326667 0.318228
vt 0.296324 0.201522
vt 0.000000 0.454353
vt 0.030342 0.337647
vt 0.000000 0.337647
vt 0.030342 0.454353
vt 0.034991 0.201522
vt 0.112009 0.318228
vt 0.112009 0.201522
vt 0.034991 0.318228
vt 0.124824 0.337647
vt 0.201842 0.454353
vt 0.201842 0.337647
vt 0.124824 0.454353
vt 0.214658 0.201522
vt 0.291676 0.318228
vt 0.291676 0.201522
vt 0.214658 0.318228
vt 0.124824 0.201522
vt 0.201842 0.318228
vt 0.201842 0.201522
vt 0.124824 0.318228
vt 0.214658 0.337647
vt 0.291676 0.454353
vt 0.291676 0.337647
vt 0.214658 0.454353
vt 0.034991 0.337647
vt 0.112009 0.454353
vt 0.112009 0.337647
vt 0.034991 0.454353
vt 0.112009 0.318228
vt 0.124824 0.318228
vt 0.112009 0.201522
vt 0.124824 0.201522
vt 0.000000 0.000000
vt 0.034991 0.201522
vt 0.000000 0.495000
vt 0.034991 0.318228
vt 0.112009 0.337647
vt 0.034991 0.337647
vt 0.034991 0.454353
vt 0.112009 0.454353
vt 0.124824 0.454353
vt 0.124824 0.337647
vt 0.201842 0.337647
vt 0.201842 0.318228
vt 0.214658 0.337647
vt 0.214658 0.454353
vt 0.201842 0.454353
vt 0.326667 0.495000
vt 0.291676 0.454353
vt 0.291676 0.337647
vt 0.214658 0.318228
vt 0.291676 0.318228
vt 0.291676 0.201522
vt 0.326667 0.000000
vt 0.214658 0.201522
vt 0.201842 0.201522
vt 0.663333 0.040646
vt 0.632991 0.157354
vt 0.663333 0.157354
vt 0.632991 0.040646
vt 0.663333 0.176771
vt 0.632991 0.293479
vt 0.663333 0.293479
vt 0.632991 0.176771
vt 0.663333 0.312896
vt 0.632991 0.429604
vt 0.663333 0.429604
vt 0.632991 0.312896
vt 0.663333 0.176771
vt 0.632991 0.293479
vt 0.663333 0.293479
vt 0.632991 0.176771
vt 0.663333 0.312896
vt 0.632991 0.429604
vt 0.663333 0.429604
vt 0.632991 0.312896
vt 0.336667 0.157354
vt 0.367009 0.040646
vt 0.336667 0.040646
vt 0.367009 0.157354
vt 0.336667 0.293479
vt 0.367009 0.176771
vt 0.336667 0.176771
vt 0.367009 0.293479
vt 0.336667 0.429604
vt 0.367009 0.312896
vt 0.336667 0.312896
vt 0.367009 0.429604
vt 0.336667 0.429604
vt 0.367009 0.312896
vt 0.336667 0.312896
vt 0.367009 0.429604
vt 0.336667 0.157354
vt 0.367009 0.040646
vt 0.336667 0.040646
vt 0.367009 0.157354
vt 0.336667 0.293479
vt 0.367009 0.176771
vt 0.336667 0.176771
vt 0.367009 0.293479
vt 0.663333 0.040646
vt 0.632991 0.157354
vt 0.663333 0.157354
vt 0.632991 0.040646
vt 0.628342 0.495000
vt 0.551324 0.436646
vt 0.551324 0.495000
vt 0.628342 0.436646
vt 0.538509 0.495000
vt 0.461491 0.436646
vt 0.461491 0.495000
vt 0.538509 0.436646
vt 0.448676 0.495000
vt 0.371658 0.436646
vt 0.371658 0.495000
vt 0.448676 0.436646
vt 0.538509 0.495000
vt 0.461491 0.436646
vt 0.461491 0.495000
vt 0.538509 0.436646
vt 0.448676 0.495000
vt 0.371658 0.436646
vt 0.371658 0.495000
vt 0.448676 0.436646
vt 0.551324 0.000000
vt 0.628342 0.033604
vt 0.628342 0.000000
vt 0.551324 0.033604
vt 0.481135 0.000000
vt 0.518865 0.033604
vt 0.518865 0.000000
vt 0.481135 0.033604
vt 0.461491 0.000000
vt 0.538509 0.033604
vt 0.538509 0.000000
vt 0.461491 0.033604
vt 0.371658 0.000000
vt 0.448676 0.033604
vt 0.448676 0.000000
vt 0.371658 0.033604
vt 0.461491 0.000000
vt 0.538509 0.033604
vt 0.538509 0.000000
vt 0.461491 0.033604
vt 0.628342 0.495000
vt 0.551324 0.436646
vt 0.551324 0.495000
vt 0.628342 0.436646
vt 0.551324 0.000000
vt 0.628342 0.033604
vt 0.628342 0.000000
vt 0.551324 0.033604
vt 0.371658 0.000000
vt 0.448676 0.033604
vt 0.448676 0.000000
vt 0.371658 0.033604
vt 0.336667 0.000000
vt 0.663333 0.495000
vt 0.663333 0.000000
vt 0.336667 0.495000
vt 1.000000 0.337646
vt 0.969658 0.454354
vt 1.000000 0.454354
vt 0.969658 0.337646
vt 1.000000 0.201521
vt 0.969658 0.318229
vt 1.000000 0.318229
vt 0.969658 0.201521
vt 1.000000 0.065396
vt 0.969658 0.182104
vt 1.000000 0.182104
vt 0.969658 0.065396
vt 1.000000 0.201521
vt 0.969658 0.318229
vt 1.000000 0.318229
vt 0.969658 0.201521
vt 1.000000 0.065396
vt 0.969658 0.182104
vt 1.000000 0.182104
vt 0.969658 0.065396
vt 0.673333 0.454354
vt 0.703676 0.337646
vt 0.673333 0.337646
vt 0.703676 0.454354
vt 0.673333 0.318229
vt 0.703676 0.201521
vt 0.673333 0.201521
vt 0.703676 0.318229
vt 0.673333 0.182104
vt 0.703676 0.065396
vt 0.673333 0.065396
vt 0.703676 0.182104
vt 0.673333 0.182104
vt 0.703676 0.065396
vt 0.673333 0.065396
vt 0.703676 0.182104
vt 0.673333 0.454354
vt 0.703676 0.337646
vt 0.673333 0.337646
vt 0.703676 0.454354
vt 0.673333 0.318229
vt 0.703676 0.201521
vt 0.673333 0.201521
vt 0.703676 0.318229
vt 1.000000 0.337646
vt 0.969658 0.454354
vt 1.000000 0.454354
vt 0.969658 0.337646
vt 0.887991 0.000000
vt 0.965009 0.058354
vt 0.965009 0.000000
vt 0.887991 0.058354
vt 0.798158 0.000000
vt 0.875176 0.058354
vt 0.875176 0.000000
vt 0.798158 0.058354
vt 0.708324 0.000000
vt 0.785342 0.058354
vt 0.785342 0.000000
vt 0.708324 0.058354
vt 0.798158 0.000000
vt 0.875176 0.058354
vt 0.875176 0.000000
vt 0.798158 0.058354
vt 0.708324 0.000000
vt 0.785342 0.058354
vt 0.785342 0.000000
vt 0.708324 0.058354
vt 0.965009 0.495000
vt 0.887991 0.461396
vt 0.887991 0.495000
vt 0.965009 0.461396
vt 0.855532 0.495000
vt 0.817802 0.461396
vt 0.817802 0.495000
vt 0.855532 0.461396
vt 0.875176 0.495000
vt 0.798158 0.461396
vt 0.798158 0.495000
vt 0.875176 0.461396
vt 0.785342 0.495000
vt 0.708324 0.461396
vt 0.708324 0.495000
vt 0.785342 0.461396
vt 0.875176 0.495000
vt 0.798158 0.461396
vt 0.798158 0.495000
vt 0.875176 0.461396
vt 0.887991 0.000000
vt 0.965009 0.058354
vt 0.965009 0.000000
vt 0.887991 0.058354
vt 0.965009 0.495000
vt 0.887991 0.461396
vt 0.887991 0.495000
vt 0.965009 0.461396
vt 0.785342 0.495000
vt 0.708324 0.461396
vt 0.708324 0.495000
vt 0.785342 0.461396
vt 1.000000 0.495000
vt 0.673333 0.000000
vt 0.673333 0.495000
vt 1.000000 0.000000
# Num Tex Verts: 624

vn -0.970598 -0.107645 0.215294
vn -0.915160 -0.360534 0.180270
vn -0.544999 -0.749918 -0.374966
vn -0.750368 -0.295613 -0.591237
vn -0.618402 0.351443 -0.702899
vn -0.915160 0.360534 -0.180270
vn -0.750368 0.295613 0.591237
vn -0.927187 0.335050 0.167528
vn -0.618402 -0.351443 0.702899
vn -0.915160 -0.360533 0.180270
vn -0.544992 -0.749922 -0.374968
vn -0.750368 -0.295613 -0.591237
vn -0.929275 0.165193 -0.330392
vn -0.915160 0.360533 -0.180270
vn -0.750368 0.295613 0.591237
vn -0.403194 0.818500 0.409258
vn -0.936212 -0.157164 0.314334
vn -0.915160 -0.360533 0.180270
vn -0.403194 -0.818500 -0.409258
vn -0.750368 -0.295612 -0.591237
vn -0.745843 0.297894 -0.595800
vn -0.915160 0.360533 -0.180270
vn -0.750368 0.295612 0.591237
vn -0.982624 0.166010 0.083007
vn -0.936213 -0.157164 0.314333
vn -0.915160 -0.360533 0.180270
vn -0.403196 -0.818499 -0.409258
vn -0.750368 -0.295613 -0.591237
vn -0.618400 0.351443 -0.702901
vn -0.915160 0.360533 -0.180270
vn -0.750368 0.295613 0.591237
vn -0.995732 0.082548 0.041275
vn -0.618399 -0.351443 0.702901
vn -0.915160 -0.360533 0.180270
vn -0.544990 -0.749923 -0.374969
vn -0.750368 -0.295612 -0.591237
vn -0.717963 0.311292 -0.622596
vn -0.915160 0.360533 -0.180270
vn -0.750368 0.295612 0.591237
vn -0.681330 0.654697 0.327355
vn 0.642695 -0.342615 -0.685243
vn 0.915160 -0.360534 -0.180270
vn 0.970599 -0.215290 0.107647
vn 0.750368 -0.295613 0.591237
vn 0.936213 0.157164 0.314333
vn 0.915160 0.360534 0.180270
vn 0.750368 0.295613 -0.591237
vn 0.403196 0.818499 -0.409257
vn 0.642678 -0.342621 -0.685256
vn 0.915160 -0.360533 -0.180270
vn 0.403196 -0.818499 0.409258
vn 0.750368 -0.295613 0.591237
vn 0.618400 0.351443 0.702901
vn 0.915160 0.360533 0.180270
vn 0.750368 0.295613 -0.591237
vn 0.918750 0.353154 -0.176581
vn 0.618399 -0.351443 -0.702901
vn 0.915160 -0.360533 -0.180270
vn 0.927187 -0.335050 0.167529
vn 0.750368 -0.295612 0.591237
vn 0.982624 0.083005 0.166013
vn 0.915160 0.360533 0.180270
vn 0.750368 0.295612 -0.591237
vn 0.681330 0.654697 -0.327355
vn 0.642676 -0.342622 -0.685258
vn 0.915160 -0.360533 -0.180270
vn 0.403194 -0.818500 0.409258
vn 0.750368 -0.295612 0.591237
vn 0.745843 0.297894 0.595800
vn 0.915160 0.360533 0.180270
vn 0.750368 0.295612 -0.591237
vn 0.717968 0.622587 -0.311300
vn 0.620240 -0.350795 -0.701602
vn 0.915160 -0.360534 -0.180270
vn 0.544999 -0.749918 0.374966
vn 0.750368 -0.295613 0.591237
vn 0.618402 0.351443 0.702899
vn 0.915160 0.360534 0.180270
vn 0.750368 0.295613 -0.591237
vn 0.544991 0.749922 -0.374968
vn 0.618402 -0.351443 -0.702899
vn 0.915160 -0.360533 -0.180270
vn 0.927187 -0.335050 0.167528
vn 0.750368 -0.295613 0.591237
vn 0.995877 0.040570 0.081142
vn 0.915160 0.360533 0.180270
vn 0.750368 0.295613 -0.591237
vn 0.403194 0.818500 -0.409258
vn -0.642695 -0.342615 0.685243
vn -0.915160 -0.360534 0.180270
vn -0.620244 -0.701594 -0.350804
vn -0.750368 -0.295613 -0.591237
vn -0.642678 0.342621 -0.685255
vn -0.915160 0.360534 -0.180270
vn -0.750368 0.295613 0.591237
vn -0.403196 0.818499 0.409257
vn 0.117443 -0.964902 0.234886
vn 0.436443 -0.872867 0.218221
vn 0.708130 -0.610893 -0.354065
vn 0.333336 -0.666659 -0.666673
vn -0.422477 -0.327970 -0.844955
vn -0.436443 -0.872867 -0.218221
vn -0.333336 -0.666659 0.666673
vn -0.384687 -0.902785 0.192343
vn 0.422477 -0.327970 0.844955
vn 0.436443 -0.872867 0.218221
vn 0.402860 -0.892821 -0.201430
vn 0.333336 -0.666659 -0.666673
vn -0.398044 -0.455855 -0.796088
vn -0.436443 -0.872867 -0.218221
vn -0.333336 -0.666659 0.666673
vn -0.760157 -0.526974 0.380079
vn 0.204052 -0.889839 0.408105
vn 0.436443 -0.872867 0.218221
vn 0.760157 -0.526974 -0.380079
vn 0.333336 -0.666659 -0.666673
vn -0.379614 -0.528647 -0.759227
vn -0.436443 -0.872867 -0.218221
vn -0.333336 -0.666659 0.666673
vn -0.234886 -0.964902 0.117443
vn 0.052248 -0.993152 0.104497
vn 0.436443 -0.872867 0.218221
vn 0.760157 -0.526974 -0.380079
vn 0.333336 -0.666659 -0.666673
vn -0.422477 -0.327970 -0.844955
vn -0.436443 -0.872867 -0.218221
vn -0.333336 -0.666659 0.666673
vn -0.384687 -0.902785 0.192343
vn 0.422477 -0.327970 0.844955
vn 0.436443 -0.872867 0.218221
vn 0.746158 -0.551417 -0.373079
vn 0.333336 -0.666659 -0.666673
vn -0.363298 -0.583158 -0.726595
vn -0.436443 -0.872867 -0.218221
vn -0.333336 -0.666659 0.666673
vn -0.708130 -0.610893 0.354065
vn 0.303616 0.734224 -0.607233
vn 0.274085 0.951891 -0.137043
vn 0.082472 0.995740 0.041236
vn 0.242098 0.840799 0.484196
vn -0.145983 0.945222 0.291966
vn -0.274085 0.951891 0.137043
vn -0.242098 0.840799 -0.484196
vn -0.608670 0.732736 -0.304335
vn 0.576370 0.705020 -0.413213
vn 0.504643 0.858577 -0.090448
vn 0.121190 0.992392 0.021721
vn 0.476267 0.810299 0.341447
vn -0.074005 0.995845 0.053056
vn -0.504643 0.858577 0.090448
vn -0.476267 0.810299 -0.341447
vn -0.883711 0.440418 -0.158388
vn 0.134012 0.954046 -0.268024
vn 0.274085 0.951891 -0.137043
vn 0.608670 0.732736 0.304335
vn 0.242098 0.840799 0.484196
vn -0.382996 0.516303 0.765993
vn -0.274085 0.951891 0.137043
vn -0.242098 0.840799 -0.484196
vn -0.587538 0.753989 -0.293769
vn 0.382996 0.516303 -0.765993
vn 0.274085 0.951891 -0.137043
vn 0.270317 0.953237 0.135158
vn 0.242098 0.840799 0.484196
vn -0.041236 0.995740 0.082472
vn -0.274085 0.951891 0.137043
vn -0.242098 0.840799 -0.484196
vn -0.534965 0.801415 -0.267482
vn 0.382996 0.516303 -0.765993
vn 0.274085 0.951891 -0.137043
vn 0.479882 0.843885 0.239941
vn 0.242098 0.840799 0.484196
vn -0.262134 0.810202 0.524269
vn -0.274085 0.951891 0.137043
vn -0.242098 0.840799 -0.484196
vn -0.608670 0.732736 -0.304335
vn 0.379614 -0.528647 0.759227
vn 0.436443 -0.872867 0.218221
vn 0.726595 -0.583158 -0.363298
vn 0.333336 -0.666659 -0.666673
vn -0.398044 -0.455855 -0.796088
vn -0.436443 -0.872867 -0.218221
vn -0.333336 -0.666659 0.666673
vn -0.760157 -0.526974 0.380079
vn 0.279839 0.780032 -0.559678
vn 0.274085 0.951891 -0.137043
vn 0.534965 0.801415 0.267482
vn 0.242098 0.840799 0.484196
vn -0.382996 0.516303 0.765993
vn -0.274085 0.951891 0.137043
vn -0.242098 0.840799 -0.484196
vn -0.587538 0.753989 -0.293769
vn 0.334169 0.664572 -0.668338
vn 0.274085 0.951891 -0.137043
vn 0.608670 0.732736 0.304335
vn 0.242098 0.840799 0.484196
vn -0.303616 0.734224 0.607233
vn -0.274085 0.951891 0.137043
vn -0.242098 0.840799 -0.484196
vn -0.559678 0.780032 -0.279839
vn -0.233136 0.250437 0.939643
vn -0.324898 0.160411 -0.932046
vn 0.549506 0.277123 -0.788192
vn 0.121892 0.140448 0.982556
vn -0.483201 -0.464652 -0.742034
vn -0.149125 -0.130617 0.980154
vn 0.280797 -0.263813 0.922798
vn 0.292817 -0.324738 -0.899335
# Num Normals: 208

# Node group
g ObjMesh
# Num Group Faces: 0

g ObjMesh
usemtl None
f 1/319/1 2/318/2 3/317/3
f 3/317/3 2/318/2 4/320/4
f 3/523/3 4/522/4 5/521/5
f 5/521/5 4/522/4 6/524/6
f 7/215/7 6/214/6 2/213/2
f 2/213/2 6/214/6 4/216/4
f 5/107/5 6/106/6 8/105/8
f 8/105/8 6/106/6 7/108/7
f 8/419/8 7/418/7 1/417/1
f 1/417/1 7/418/7 2/420/2
f 9/323/9 10/322/10 11/321/11
f 11/321/11 10/322/10 12/324/12
f 11/527/11 12/526/12 13/525/13
f 13/525/13 12/526/12 14/528/14
f 15/219/15 14/218/14 10/217/10
f 10/217/10 14/218/14 12/220/12
f 13/111/13 14/110/14 16/109/16
f 16/109/16 14/110/14 15/112/15
f 16/423/16 15/422/15 9/421/9
f 9/421/9 15/422/15 10/424/10
f 17/327/17 18/326/18 19/325/19
f 19/325/19 18/326/18 20/328/20
f 19/531/19 20/530/20 21/529/21
f 21/529/21 20/530/20 22/532/22
f 23/223/23 22/222/22 18/221/18
f 18/221/18 22/222/22 20/224/20
f 21/115/21 22/114/22 24/113/24
f 24/113/24 22/114/22 23/116/23
f 24/427/24 23/426/23 17/425/17
f 17/425/17 23/426/23 18/428/18
f 25/331/25 26/330/26 27/329/27
f 27/329/27 26/330/26 28/332/28
f 27/535/27 28/534/28 29/533/29
f 29/533/29 28/534/28 30/536/30
f 31/227/31 30/226/30 26/225/26
f 26/225/26 30/226/30 28/228/28
f 29/119/29 30/118/30 32/117/32
f 32/117/32 30/118/30 31/120/31
f 32/431/32 31/430/31 25/429/25
f 25/429/25 31/430/31 26/432/26
f 33/335/33 34/334/34 35/333/35
f 35/333/35 34/334/34 36/336/36
f 35/539/35 36/538/36 37/537/37
f 37/537/37 36/538/36 38/540/38
f 39/231/39 38/230/38 34/229/34
f 34/229/34 38/230/38 36/232/36
f 37/123/37 38/122/38 40/121/40
f 40/121/40 38/122/38 39/124/39
f 40/435/40 39/434/39 33/433/33
f 33/433/33 39/434/39 34/436/34
f 41/339/41 42/338/42 43/337/43
f 43/337/43 42/338/42 44/340/44
f 43/439/43 44/438/44 45/437/45
f 45/437/45 44/438/44 46/440/46
f 44/3/44 42/2/42 46/1/46
f 46/1/46 42/2/42 47/4/47
f 45/127/45 46/126/46 48/125/48
f 48/125/48 46/126/46 47/128/47
f 48/543/48 47/542/47 41/541/41
f 41/541/41 47/542/47 42/544/42
f 49/343/49 50/342/50 51/341/51
f 51/341/51 50/342/50 52/344/52
f 51/443/51 52/442/52 53/441/53
f 53/441/53 52/442/52 54/444/54
f 52/7/52 50/6/50 54/5/54
f 54/5/54 50/6/50 55/8/55
f 53/131/53 54/130/54 56/129/56
f 56/129/56 54/130/54 55/132/55
f 56/547/56 55/546/55 49/545/49
f 49/545/49 55/546/55 50/548/50
f 57/347/57 58/346/58 59/345/59
f 59/345/59 58/346/58 60/348/60
f 59/447/59 60/446/60 61/445/61
f 61/445/61 60/446/60 62/448/62
f 60/11/60 58/10/58 62/9/62
f 62/9/62 58/10/58 63/12/63
f 61/135/61 62/134/62 64/133/64
f 64/133/64 62/134/62 63/136/63
f 64/551/64 63/550/63 57/549/57
f 57/549/57 63/550/63 58/552/58
f 65/351/65 66/350/66 67/349/67
f 67/349/67 66/350/66 68/352/68
f 67/451/67 68/450/68 69/449/69
f 69/449/69 68/450/68 70/452/70
f 68/15/68 66/14/66 70/13/70
f 70/13/70 66/14/66 71/16/71
f 69/139/69 70/138/70 72/137/72
f 72/137/72 70/138/70 71/140/71
f 72/555/72 71/554/71 65/553/65
f 65/553/65 71/554/71 66/556/66
f 73/355/73 74/354/74 75/353/75
f 75/353/75 74/354/74 76/356/76
f 75/455/75 76/454/76 77/453/77
f 77/453/77 76/454/76 78/456/78
f 76/19/76 74/18/74 78/17/78
f 78/17/78 74/18/74 79/20/79
f 77/143/77 78/142/78 80/141/80
f 80/141/80 78/142/78 79/144/79
f 80/559/80 79/558/79 73/557/73
f 73/557/73 79/558/79 74/560/74
f 81/359/81 82/358/82 83/357/83
f 83/357/83 82/358/82 84/360/84
f 83/459/83 84/458/84 85/457/85
f 85/457/85 84/458/84 86/460/86
f 84/23/84 82/22/82 86/21/86
f 86/21/86 82/22/82 87/24/87
f 85/147/85 86/146/86 88/145/88
f 88/145/88 86/146/86 87/148/87
f 88/563/88 87/562/87 81/561/81
f 81/561/81 87/562/87 82/564/82
f 89/363/89 90/362/90 91/361/91
f 91/361/91 90/362/90 92/364/92
f 91/567/91 92/566/92 93/565/93
f 93/565/93 92/566/92 94/568/94
f 95/235/95 94/234/94 90/233/90
f 90/233/90 94/234/94 92/236/92
f 93/151/93 94/150/94 96/149/96
f 96/149/96 94/150/94 95/152/95
f 96/463/96 95/462/95 89/461/89
f 89/461/89 95/462/95 90/464/90
f 97/27/97 98/26/98 99/25/99
f 99/25/99 98/26/98 100/28/100
f 99/571/99 100/570/100 101/569/101
f 101/569/101 100/570/100 102/572/102
f 103/367/103 102/366/102 98/365/98
f 98/365/98 102/366/102 100/368/100
f 101/239/101 102/238/102 104/237/104
f 104/237/104 102/238/102 103/240/103
f 104/467/104 103/466/103 97/465/97
f 97/465/97 103/466/103 98/468/98
f 105/31/105 106/30/106 107/29/107
f 107/29/107 106/30/106 108/32/108
f 107/575/107 108/574/108 109/573/109
f 109/573/109 108/574/108 110/576/110
f 111/371/111 110/370/110 106/369/106
f 106/369/106 110/370/110 108/372/108
f 109/243/109 110/242/110 112/241/112
f 112/241/112 110/242/110 111/244/111
f 112/471/112 111/470/111 105/469/105
f 105/469/105 111/470/111 106/472/106
f 113/35/113 114/34/114 115/33/115
f 115/33/115 114/34/114 116/36/116
f 115/579/115 116/578/116 117/577/117
f 117/577/117 116/578/116 118/580/118
f 119/375/119 118/374/118 114/373/114
f 114/373/114 118/374/118 116/376/116
f 117/247/117 118/246/118 120/245/120
f 120/245/120 118/246/118 119/248/119
f 120/475/120 119/474/119 113/473/113
f 113/473/113 119/474/119 114/476/114
f 121/39/121 122/38/122 123/37/123
f 123/37/123 122/38/122 124/40/124
f 123/583/123 124/582/124 125/581/125
f 125/581/125 124/582/124 126/584/126
f 127/379/127 126/378/126 122/377/122
f 122/377/122 126/378/126 124/380/124
f 125/251/125 126/250/126 128/249/128
f 128/249/128 126/250/126 127/252/127
f 128/479/128 127/478/127 121/477/121
f 121/477/121 127/478/127 122/480/122
f 129/43/129 130/42/130 131/41/131
f 131/41/131 130/42/130 132/44/132
f 131/587/131 132/586/132 133/585/133
f 133/585/133 132/586/132 134/588/134
f 135/383/135 134/382/134 130/381/130
f 130/381/130 134/382/134 132/384/132
f 133/255/133 134/254/134 136/253/136
f 136/253/136 134/254/134 135/256/135
f 136/483/136 135/482/135 129/481/129
f 129/481/129 135/482/135 130/484/130
f 137/47/137 138/46/138 139/45/139
f 139/45/139 138/46/138 140/48/140
f 139/487/139 140/486/140 141/485/141
f 141/485/141 140/486/140 142/488/142
f 140/155/140 138/154/138 142/153/142
f 142/153/142 138/154/138 143/156/143
f 141/259/141 142/258/142 144/257/144
f 144/257/144 142/258/142 143/260/143
f 144/591/144 143/590/143 137/589/137
f 137/589/137 143/590/143 138/592/138
f 145/51/145 146/50/146 147/49/147
f 147/49/147 146/50/146 148/52/148
f 147/491/147 148/490/148 149/489/149
f 149/489/149 148/490/148 150/492/150
f 148/159/148 146/158/146 150/157/150
f 150/157/150 146/158/146 151/160/151
f 149/263/149 150/262/150 152/261/152
f 152/261/152 150/262/150 151/264/151
f 152/595/152 151/594/151 145/593/145
f 145/593/145 151/594/151 146/596/146
f 153/55/153 154/54/154 155/53/155
f 155/53/155 154/54/154 156/56/156
f 155/495/155 156/494/156 157/493/157
f 157/493/157 156/494/156 158/496/158
f 156/163/156 154/162/154 158/161/158
f 158/161/158 154/162/154 159/164/159
f 157/267/157 158/266/158 160/265/160
f 160/265/160 158/266/158 159/268/159
f 160/599/160 159/598/159 153/597/153
f 153/597/153 159/598/159 154/600/154
f 161/59/161 162/58/162 163/57/163
f 163/57/163 162/58/162 164/60/164
f 163/499/163 164/498/164 165/497/165
f 165/497/165 164/498/164 166/500/166
f 164/167/164 162/166/162 166/165/166
f 166/165/166 162/166/162 167/168/167
f 165/271/165 166/270/166 168/269/168
f 168/269/168 166/270/166 167/272/167
f 168/603/168 167/602/167 161/601/161
f 161/601/161 167/602/167 162/604/162
f 169/63/169 170/62/170 171/61/171
f 171/61/171 170/62/170 172/64/172
f 171/503/171 172/502/172 173/501/173
f 173/501/173 172/502/172 174/504/174
f 172/171/172 170/170/170 174/169/174
f 174/169/174 170/170/170 175/172/175
f 173/275/173 174/274/174 176/273/176
f 176/273/176 174/274/174 175/276/175
f 176/607/176 175/606/175 169/605/169
f 169/605/169 175/606/175 170/608/170
f 177/67/177 178/66/178 179/65/179
f 179/65/179 178/66/178 180/68/180
f 179/611/179 180/610/180 181/609/181
f 181/609/181 180/610/180 182/612/182
f 183/387/183 182/386/182 178/385/178
f 178/385/178 182/386/182 180/388/180
f 181/279/181 182/278/182 184/277/184
f 184/277/184 182/278/182 183/280/183
f 184/507/184 183/506/183 177/505/177
f 177/505/177 183/506/183 178/508/178
f 185/71/185 186/70/186 187/69/187
f 187/69/187 186/70/186 188/72/188
f 187/511/187 188/510/188 189/509/189
f 189/509/189 188/510/188 190/512/190
f 188/175/188 186/174/186 190/173/190
f 190/173/190 186/174/186 191/176/191
f 189/283/189 190/282/190 192/281/192
f 192/281/192 190/282/190 191/284/191
f 192/615/192 191/614/191 185/613/185
f 185/613/185 191/614/191 186/616/186
f 193/75/193 194/74/194 195/73/195
f 195/73/195 194/74/194 196/76/196
f 195/515/195 196/514/196 197/513/197
f 197/513/197 196/514/196 198/516/198
f 196/179/196 194/178/194 198/177/198
f 198/177/198 194/178/194 199/180/199
f 197/287/197 198/286/198 200/285/200
f 200/285/200 198/286/198 199/288/199
f 200/619/200 199/618/199 193/617/193
f 193/617/193 199/618/199 194/620/194
f 144/183/144 171/182/171 141/181/141
f 144/183/144 169/184/169 171/182/171
f 144/183/144 189/185/189 169/184/169
f 144/183/144 187/186/187 189/185/189
f 144/183/144 137/187/137 187/186/187
f 187/186/187 137/187/137 201/188/201
f 185/190/185 201/188/201 192/189/192
f 185/190/185 187/186/187 201/188/201
f 137/187/137 139/191/139 201/188/201
f 201/188/201 139/191/139 202/192/202
f 202/192/202 139/191/139 147/193/147
f 203/195/203 147/193/147 149/194/149
f 165/197/165 149/194/149 163/196/163
f 165/197/165 203/195/203 149/194/149
f 165/197/165 204/198/204 203/195/203
f 165/197/165 168/199/168 204/198/204
f 204/198/204 168/199/168 197/200/197
f 200/201/200 204/198/204 197/200/197
f 200/201/200 193/202/193 204/198/204
f 204/198/204 193/202/193 160/203/160
f 153/204/153 204/198/204 160/203/160
f 153/204/153 201/188/201 204/198/204
f 153/204/153 192/189/192 201/188/201
f 153/204/153 155/205/155 192/189/192
f 192/189/192 155/205/155 189/185/189
f 189/185/189 155/205/155 169/184/169
f 169/184/169 155/205/155 176/206/176
f 176/206/176 155/205/155 157/207/157
f 161/209/161 157/207/157 195/208/195
f 168/199/168 195/208/195 197/200/197
f 168/199/168 161/209/161 195/208/195
f 139/191/139 141/181/141 147/193/147
f 147/193/147 141/181/141 171/182/171
f 145/211/145 171/182/171 173/210/173
f 152/212/152 173/210/173 149/194/149
f 152/212/152 145/211/145 173/210/173
f 163/196/163 149/194/149 173/210/173
f 176/206/176 163/196/163 173/210/173
f 176/206/176 161/209/161 163/196/163
f 176/206/176 157/207/157 161/209/161
f 145/211/145 147/193/147 171/182/171
f 202/192/202 147/193/147 203/195/203
f 157/207/157 160/203/160 195/208/195
f 195/208/195 160/203/160 193/202/193
f 104/391/104 123/390/123 101/389/101
f 104/391/104 121/392/121 123/390/123
f 104/391/104 205/393/205 121/392/121
f 104/391/104 97/394/97 205/393/205
f 205/393/205 97/394/97 206/395/206
f 206/395/206 97/394/97 99/396/99
f 177/398/177 99/396/99 184/397/184
f 177/398/177 206/395/206 99/396/99
f 177/398/177 179/399/179 206/395/206
f 206/395/206 179/399/179 181/400/181
f 107/401/107 181/400/181 184/397/184
f 105/402/105 184/397/184 101/389/101
f 123/390/123 105/402/105 101/389/101
f 123/390/123 112/403/112 105/402/105
f 123/390/123 125/404/125 112/403/112
f 112/403/112 125/404/125 129/405/129
f 131/406/131 112/403/112 129/405/129
f 131/406/131 109/407/109 112/403/112
f 131/406/131 207/408/207 109/407/109
f 131/406/131 133/409/133 207/408/207
f 207/408/207 133/409/133 136/410/136
f 117/412/117 136/410/136 115/411/115
f 117/412/117 207/408/207 136/410/136
f 117/412/117 120/413/120 207/408/207
f 207/408/207 120/413/120 208/414/208
f 208/414/208 120/413/120 113/415/113
f 128/416/128 113/415/113 115/411/115
f 125/404/125 115/411/115 129/405/129
f 125/404/125 128/416/128 115/411/115
f 99/396/99 101/389/101 184/397/184
f 105/402/105 107/401/107 184/397/184
f 109/407/109 207/408/207 107/401/107
f 107/401/107 207/408/207 206/395/206
f 181/400/181 107/401/107 206/395/206
f 208/414/208 113/415/113 128/416/128
f 121/392/121 208/414/208 128/416/128
f 121/392/121 205/393/205 208/414/208
f 129/405/129 115/411/115 136/410/136
f 48/79/48 81/78/81 45/77/45
f 48/79/48 51/80/51 81/78/81
f 48/79/48 77/81/77 51/80/51
f 48/79/48 41/82/41 77/81/77
f 77/81/77 41/82/41 75/83/75
f 75/83/75 41/82/41 204/84/204
f 73/86/73 204/84/204 80/85/80
f 73/86/73 75/83/75 204/84/204
f 41/82/41 43/87/43 204/84/204
f 204/84/204 43/87/43 203/88/203
f 203/88/203 43/87/43 45/77/45
f 83/89/83 45/77/45 81/78/81
f 83/89/83 203/88/203 45/77/45
f 83/89/83 85/90/85 203/88/203
f 203/88/203 85/90/85 208/91/208
f 208/91/208 85/90/85 59/92/59
f 61/93/61 208/91/208 59/92/59
f 61/93/61 207/94/207 208/91/208
f 61/93/61 64/95/64 207/94/207
f 207/94/207 64/95/64 69/96/69
f 72/97/72 207/94/207 69/96/69
f 72/97/72 65/98/65 207/94/207
f 207/94/207 65/98/65 56/99/56
f 204/84/204 56/99/56 49/100/49
f 80/85/80 49/100/49 77/81/77
f 80/85/80 204/84/204 49/100/49
f 56/99/56 65/98/65 53/101/53
f 53/101/53 65/98/65 67/102/67
f 88/104/88 67/102/67 57/103/57
f 85/90/85 57/103/57 59/92/59
f 85/90/85 88/104/88 57/103/57
f 207/94/207 56/99/56 204/84/204
f 49/100/49 51/80/51 77/81/77
f 51/80/51 53/101/53 81/78/81
f 81/78/81 53/101/53 88/104/88
f 88/104/88 53/101/53 67/102/67
f 64/95/64 57/103/57 69/96/69
f 69/96/69 57/103/57 67/102/67
f 201/519/201 206/518/206 204/517/204
f 204/517/204 206/518/206 207/520/207
f 8/291/8 25/290/25 5/289/5
f 8/291/8 202/292/202 25/290/25
f 8/291/8 1/293/1 202/292/202
f 202/292/202 1/293/1 201/294/201
f 201/294/201 1/293/1 3/295/3
f 89/296/89 3/295/3 5/289/5
f 96/298/96 5/289/5 27/297/27
f 9/300/9 27/297/27 29/299/29
f 16/302/16 29/299/29 19/301/19
f 33/304/33 19/301/19 21/303/21
f 40/306/40 21/303/21 206/305/206
f 37/308/37 206/305/206 35/307/35
f 37/308/37 40/306/40 206/305/206
f 201/294/201 3/295/3 89/296/89
f 91/309/91 201/294/201 89/296/89
f 91/309/91 93/310/93 201/294/201
f 201/294/201 93/310/93 11/311/11
f 13/312/13 201/294/201 11/311/11
f 13/312/13 206/305/206 201/294/201
f 13/312/13 35/307/35 206/305/206
f 13/312/13 33/304/33 35/307/35
f 13/312/13 16/302/16 33/304/33
f 33/304/33 16/302/16 19/301/19
f 16/302/16 9/300/9 29/299/29
f 11/311/11 93/310/93 9/300/9
f 9/300/9 93/310/93 96/298/96
f 27/297/27 9/300/9 96/298/96
f 21/303/21 24/313/24 206/305/206
f 206/305/206 24/313/24 205/314/205
f 205/314/205 24/313/24 17/315/17
f 32/316/32 17/315/17 29/299/29
f 32/316/32 205/314/205 17/315/17
f 32/316/32 202/292/202 205/314/205
f 32/316/32 25/290/25 202/292/202
f 17/315/17 19/301/19 29/299/29
f 25/290/25 27/297/27 5/289/5
f 40/306/40 33/304/33 21/303/21
f 96/298/96 89/296/89 5/289/5
f 203/623/203 208/622/208 202/621/202
f 202/621/202 208/622/208 205/624/205
# Num Group Faces: 412

# Num Total Faces: 412

