{
  "buildFiles": [
    "/home/armin/Android/Sdk/ndk-bundle/build/cmake/platforms.cmake",
    "/home/armin/Android/Sdk/ndk-bundle/build/cmake/android.toolchain.cmake",
    "/home/armin/Desktop/Master Final Project/rent-a-car-system/HelloJNI/app/src/main/cpp/CMakeLists.txt"
  ],
  "cleanCommands": [
    "/usr/bin/cmake --build /home/armin/Desktop/Master Final Project/rent-a-car-system/HelloJNI/app/.externalNativeBuild/cmake/x86Debug/x86 --target clean"
  ],
  "libraries": {
    "hello-jni-Debug-x86": {
      "artifactName": "hello-jni",
      "buildCommand": "/usr/bin/cmake --build /home/armin/Desktop/Master Final Project/rent-a-car-system/HelloJNI/app/.externalNativeBuild/cmake/x86Debug/x86 --target hello-jni",
      "abi": "x86",
      "output": "/home/armin/Desktop/Master Final Project/rent-a-car-system/HelloJNI/app/build/intermediates/cmake/x86/debug/obj/x86/libhello-jni.so"
    }
  }
}