{
  "stringTable": {
    "0": "/home/armin/Desktop/Master Final Project/rent-a-car-system/HelloJNI/app/.externalNativeBuild/cmake/arm8Debug/arm64-v8a",
    "1": "--target=aarch64-none-linux-android23 --gcc-toolchain=/home/armin/Android/Sdk/ndk-bundle/toolchains/llvm/prebuilt/linux-x86_64 --sysroot=/home/armin/Android/Sdk/ndk-bundle/toolchains/llvm/prebuilt/linux-x86_64/sysroot -Dhello_jni_EXPORTS -g -DANDROID -fdata-sections -ffunction-sections -funwind-tables -fstack-protector-strong -no-canonical-prefixes -fno-addrsig -Wa,--noexecstack -Wformat -Werror=format-security -O0 -fno-limit-debug-info -fPIC"
  },
  "buildFiles": [
    "/home/armin/Android/Sdk/ndk-bundle/build/cmake/platforms.cmake",
    "/home/armin/Android/Sdk/ndk-bundle/build/cmake/android.toolchain.cmake",
    "/home/armin/Desktop/Master Final Project/rent-a-car-system/HelloJNI/app/src/main/cpp/CMakeLists.txt"
  ],
  "cleanCommands": [
    "/usr/bin/cmake --build /home/armin/Desktop/Master Final Project/rent-a-car-system/HelloJNI/app/.externalNativeBuild/cmake/arm8Debug/arm64-v8a --target clean"
  ],
  "libraries": {
    "hello-jni-Debug-arm64-v8a": {
      "buildCommand": "/usr/bin/cmake --build /home/armin/Desktop/Master Final Project/rent-a-car-system/HelloJNI/app/.externalNativeBuild/cmake/arm8Debug/arm64-v8a --target hello-jni",
      "buildType": "debug",
      "toolchain": "3124246762",
      "abi": "arm64-v8a",
      "artifactName": "hello-jni",
      "files": [
        {
          "src": "/home/armin/Desktop/Master Final Project/rent-a-car-system/HelloJNI/app/src/main/cpp/hello-jni.c",
          "flagsOrdinal": 1,
          "workingDirectoryOrdinal": 0
        }
      ],
      "headers": [],
      "output": "/home/armin/Desktop/Master Final Project/rent-a-car-system/HelloJNI/app/build/intermediates/cmake/arm8/debug/obj/arm64-v8a/libhello-jni.so"
    }
  },
  "toolchains": {
    "3124246762": {
      "cCompilerExecutable": "/home/armin/Android/Sdk/ndk-bundle/toolchains/llvm/prebuilt/linux-x86_64/bin/clang"
    }
  },
  "cFileExtensions": [
    "c"
  ],
  "cppFileExtensions": []
}