{
  "buildFiles": [
    "/home/armin/Android/Sdk/ndk-bundle/build/cmake/platforms.cmake",
    "/home/armin/Android/Sdk/ndk-bundle/build/cmake/android.toolchain.cmake",
    "/home/armin/Desktop/Master Final Project/rent-a-car-system/HelloJNI/app/src/main/cpp/CMakeLists.txt"
  ],
  "cleanCommands": [
    "/usr/bin/cmake --build /home/armin/Desktop/Master Final Project/rent-a-car-system/HelloJNI/app/.externalNativeBuild/cmake/arm7Release/armeabi-v7a --target clean"
  ],
  "libraries": {
    "hello-jni-Release-armeabi-v7a": {
      "artifactName": "hello-jni",
      "buildCommand": "/usr/bin/cmake --build /home/armin/Desktop/Master Final Project/rent-a-car-system/HelloJNI/app/.externalNativeBuild/cmake/arm7Release/armeabi-v7a --target hello-jni",
      "abi": "armeabi-v7a",
      "output": "/home/armin/Desktop/Master Final Project/rent-a-car-system/HelloJNI/app/build/intermediates/cmake/arm7/release/obj/armeabi-v7a/libhello-jni.so"
    }
  }
}