
{
  "development": {
    "username": "postgres",
    "password": "962603",
    "database": "rent_a_car",
    "host": "127.0.0.1",
    "port": 5432,
    "dialect": "postgres",
    "define": {
      "timestamps": false
    }
  },
  "test": {
    "username": "waiyaki",
    "password": null,
    "database": "todos-test",
    "host": "127.0.0.1",
    "port": 5432,
    "dialect": "postgres"
  }
}