[
{
  "directory": "/home/armin/Desktop/Master Final Project/rent-a-car-system/HelloJNI/app/.externalNativeBuild/cmake/universalDebug/x86",
  "command": "/home/armin/Android/Sdk/ndk-bundle/toolchains/llvm/prebuilt/linux-x86_64/bin/clang --target=i686-none-linux-android23 --gcc-toolchain=/home/armin/Android/Sdk/ndk-bundle/toolchains/llvm/prebuilt/linux-x86_64 --sysroot=/home/armin/Android/Sdk/ndk-bundle/toolchains/llvm/prebuilt/linux-x86_64/sysroot -Dhello_jni_EXPORTS  -g -DANDROID -fdata-sections -ffunction-sections -funwind-tables -fstack-protector-strong -no-canonical-prefixes -mstackrealign -fno-addrsig -Wa,--noexecstack -Wformat -Werror=format-security  -O0 -fno-limit-debug-info  -fPIC   -o CMakeFiles/hello-jni.dir/hello-jni.c.o   -c \"/home/armin/Desktop/Master Final Project/rent-a-car-system/HelloJNI/app/src/main/cpp/hello-jni.c\"",
  "file": "/home/armin/Desktop/Master Final Project/rent-a-car-system/HelloJNI/app/src/main/cpp/hello-jni.c"
}
]