Name,Team,Sex,BodyweightKg,BirthYear,BirthDate,Squat1Kg,Squat2Kg,Squat3Kg,Best3SquatKg,Bench1Kg,Bench2Kg,Bench3Kg,Best3BenchKg,Deadlift1Kg,Deadlift2Kg,Deadlift3Kg,Best3DeadliftKg,TotalKg,Event,Equipment,Division,WeightClassKg,Place
Christian Flueras,Sanssouci Gym e.V.,M,104.9,1996,1996-03-16,270,300,,300,250,265,275,275,270,280,-300,280,855,SBD,Single-ply,Open,105,7
Lukas Markaschke,Sanssouci Gym e.V.,M,72.9,1989,1989-10-06,210,225,-240,225,-100,100,105,105,200,220,227.5,227.5,557.5,SBD,Single-ply,Open,74,7
Ron Kronschwitz,Sanssouci Gym e.V.,M,86.3,1981,1981-01-08,265,280,290,290,180,190,,190,230,245,255,255,735,SBD,Single-ply,Open,93,7
Heiko Grunert,VfB Klötze e.V.,M,83.8,1968,1968-06-18,130,140,150,150,90,100,105,105,145,160,170,170,425,SBD,Single-ply,Open,93,13
Christian Raapke,VfB Klötze e.V.,M,92.65,1982,1982-10-02,200,-210,215,215,135,-145,145,145,200,220,230,230,590,SBD,Single-ply,Open,93,13
Martin Preuß,VfB Klötze e.V.,M,90.4,1983,1983-04-26,170,180,190,190,135,145,-150,145,190,205,220,220,555,SBD,Single-ply,Open,93,13
Timon Ranneberg,VfB Klötze e.V.,M,95.7,2004,2004-10-22,200,210,-220,210,110,120,-125,120,240,-255,270,270,600,SBD,Single-ply,Open,105,13
Sascha Stern,SAV Erfurt e.V.,M,89.85,1979,1979-04-04,245,260,270,270,200,210,-217.5,210,245,255,,255,735,SBD,Single-ply,Open,93,4
Marie Hauschild,SAV Erfurt e.V.,F,70.1,1995,1995-06-13,190,197.5,205,205,100,107.5,115,115,165,177.5,182.5,182.5,502.5,SBD,Single-ply,Open,76,4
Celine Hein,SAV Erfurt e.V.,F,52,2000,2000-03-08,140,147.5,155,155,67.5,70,-75,70,130,140,-150,140,365,SBD,Single-ply,Open,52,4
Valérie von Gleichen,Powerlifting Würzburg e.V,F,86.02,1992,,230,242.5,247.5,247.5,125,132.5,137.5,137.5,195,207.5,215,215,600,SBD,Single-ply,Open,84+,1
Lisa Schlagbauer,Powerlifting Würzburg e.V,F,68.02,1996,,-205,205,212.5,212.5,125,-132.5,-135,125,187.5,197.5,202.5,202.5,540,SBD,Single-ply,Open,69,1
Thorsten Thenhart,Powerlifting Würzburg e.V,M,105.12,1975,,300,-307.5,-307.5,300,215,222.5,-230,222.5,230,240,-250,240,762.5,SBD,Single-ply,Open,120,1
Jonas Bausewein,Powerlifting Würzburg e.V,M,104.78,1997,,267.5,272.5,277.5,277.5,160,167.5,172.5,172.5,250,265,272.5,272.5,722.5,SBD,Single-ply,Open,105,1
Helena Mariella Decker,Kraftsport Colonia e.V.,F,58.2,2001,,140,150,160,160,85,90,95,95,162.5,175,185,185,440,SBD,Raw,Open,63,8
Julian Sieveke,Kraftsport Colonia e.V.,M,85.58,1998,,227.5,240,245,245,140,145,150,150,265,275,282.5,282.5,677.5,SBD,Raw,Open,93,8
Ira Neitzel,Kraftsport Colonia e.V.,F,53.7,1981,,135,140,145,145,-80,80,82.5,82.5,120,127.5,132.5,132.5,360,SBD,Single-ply,Open,57,8
Dominic Rittig,Kraftsport Colonia e.V.,M,139.78,1989,,240,255,265,265,157.5,170,-185,170,300,-310,-310,300,735,SBD,Raw,Open,120+,8
Sonja Stefanie Krüger,KSV Mainz e.V.,F,72.56,1999,,235,245,255,255,167.5,172.5,177.5,177.5,180,190,-192.5,190,622.5,SBD,Single-ply,Open,76,2
Cindy Neumann,KSV Mainz e.V.,F,67.52,1994,,120,125,130,130,65,67.5,-70,67.5,145,150,155,155,352.5,SBD,Single-ply,Open,69,2
Martin Braun,KSV Mainz e.V.,M,72.72,1998,,180,190,200,200,120,127.5,-135,127.5,240,260,-275,260,587.5,SBD,Single-ply,Open,74,2
Timo Jakobi,KSV Mainz e.V.,M,104.06,1999,,275,290,300,300,160,167.5,175,175,310,325,-327.5,325,800,SBD,Single-ply,Open,105,2
Jonas Diefenbach,KSV Essen e.V.,M,86.48,1998,,270,280,-287.5,280,-185,187.5,195,195,225,237.5,-242.5,237.5,712.5,SBD,Single-ply,Open,93,6
Jan-Philipp Rexing,KSV Essen e.V.,M,91.88,1997,,225,237.5,242.5,242.5,180,190,200,200,210,227.5,232.5,232.5,675,SBD,Single-ply,Open,93,6
Timo Gröning,KSV Essen e.V.,M,102.04,1991,,220,230,237.5,237.5,155,162.5,165,165,260,270,277.5,277.5,680,SBD,Single-ply,Open,105,6
Malte Fleissner,KSV Essen e.V.,M,115.78,1989,,310,-330,-330,310,245,-255,-255,245,300,310,320,320,875,SBD,Single-ply,Open,120,6
Miriam Kersel,KG Forchheim/ München,F,64.3,1999,,-197.5,202.5,-212.5,202.5,-107.5,112.5,-117.5,112.5,152.5,162.5,170,170,485,SBD,Single-ply,Open,69,5
Thomas Starklauf,KG Forchheim/ München,M,104.1,1989,,-295,302.5,310,310,180,185,192.5,192.5,275,297.5,302.5,302.5,805,SBD,Single-ply,Open,105,5
René Schertel,KG Forchheim/ München,M,126.2,1994,,270,-295,,270,200,212.5,215,215,245,260,-270,260,745,SBD,Single-ply,Open,120+,5
Jakob Maxl,KG Forchheim/ München,M,118.6,1998,,-270,-275,-280,,-175,,,,,,,,,SBD,Single-ply,Open,120,DQ
Anja Schreiner,SC Oberölsbach,F,47.8,1993,,145,152.5,160,160,95,100,-105,100,125,132.5,-140,132.5,392.5,SBD,Single-ply,Open,52,3
Ludwig Galetzka,SC Oberölsbach,M,81.9,2000,,260,275,285,285,-205,205,-212.5,205,225,-240,-240,225,715,SBD,Single-ply,Open,83,3
Sofia Walter,SC Oberölsbach,F,72.6,1996,,200,-210,,200,110,115,120,120,155,165,-170,165,485,SBD,Single-ply,Open,76,3
Florian Heissler,SC Oberölsbach,M,91.3,1994,,235,250,260,260,170,177.5,182.5,182.5,235,247.5,260,260,702.5,SBD,Single-ply,Open,93,3
Marc James,SG Randersacker,M,103.8,1993,,275,292.5,302.5,302.5,175,182.5,-190,182.5,240,260,280,280,765,SBD,Single-ply,Open,105,10
Christian Henneberger,SG Randersacker,M,74,1973,,205,215,-225,215,-125,-125,125,125,215,225,-232.5,225,565,SBD,Single-ply,Open,74,10
Dirk Motzkus,SG Randersacker,M,110.5,1977,,220,242.5,-247.5,242.5,195,205,210,210,220,225,,225,677.5,SBD,Single-ply,Open,120,10
János Geerhardt,SG Randersacker,M,82.7,1967,,195,205,212.5,212.5,125,130,132.5,132.5,225,237.5,242.5,242.5,587.5,SBD,Single-ply,Open,83,10
Roman Reinbold,TSV Katzwang,M,117.1,1972,,235,250,260,260,170,185,200,200,245,260,265,265,725,SBD,Single-ply,Open,120,11
Armin Seynstahl,TSV Katzwang,M,79.8,1991,,200,210,215,215,130,135,140,140,210,230,245,245,600,SBD,Single-ply,Open,83,11
Ricardo Schunk,TSV Katzwang,M,82.1,1970,,210,215,220,220,140,150,160,160,190,200,210,210,590,SBD,Single-ply,Open,83,11
André Weißmann,TSV Katzwang,M,82.3,1991,,155,165,-170,165,117.5,125,130,130,200,210,220,220,515,SBD,Single-ply,Open,83,11
Sebastian Kienast,SV Motor Barth e.V.,M,75.35,,,230,237.5,,237.5,115,120,,120,215,227.5,237.5,237.5,595,SBD,Single-ply,Open,83,14
Sven Neuendorf,SV Motor Barth e.V.,M,144.3,,,305,-317.5,-317.5,305,-240,-250,-260,,-225,,,,,SBD,Single-ply,Open,120+,DQ
Eduard Tepper,SV Motor Barth e.V.,M,84.8,,,165,185,195,195,135,150,157.5,157.5,197.5,222.5,-247.5,222.5,575,SBD,Single-ply,Open,93,14
Mirko Vahl,Greifenpower e.V.,M,104.35,,,220,230,235,235,237.5,-247.5,-255,237.5,210,220,-225,220,692.5,SBD,Single-ply,Open,105,9
René Ullerich,Greifenpower e.V.,M,94.45,,,250,275,,275,170,190,200,200,260,275,,275,750,SBD,Single-ply,Open,105,9
Joshua Wright #1,Greifenpower e.V.,M,76.5,,,215,,,215,172.5,,,172.5,-280,280,,280,667.5,SBD,Single-ply,Open,83,9
Martin Grobel,KG SA Hamburg/Herrnbuger AV,M,113.55,,,195,-205,205,205,135,-140,-140,135,195,205,210,210,550,SBD,Single-ply,Open,120,12
Sascha Krause,KG SA Hamburg/Herrnbuger AV,M,101.3,,,260,267.5,275,275,180,187.5,192.5,192.5,235,250,262.5,262.5,730,SBD,Single-ply,Open,105,12
Damian Szwast,KG SA Hamburg/Herrnbuger AV,M,108.55,,,220,235,250,250,160,170,180,180,260,280,,280,710,SBD,Single-ply,Open,120,12
