Division,WeightClassKg,Place,Name,Team,BodyweightKg,Best3SquatKg,Best3BenchKg,Best3DeadliftKg,TotalKg,Equipment,Event,Sex,BirthDate
Boys,51.71,1,Alex Le,Palacios,50.39,158.76,92.99,165.56,417.3,Single-ply,SBD,M,
Boys,51.71,2,Carlos Gamez,Hitchcock,51.35,154.22,86.18,140.61,381.02,Single-ply,SBD,M,
Boys,51.71,3,Cam Graves,Palacios,49.58,113.4,74.84,127.01,315.25,Single-ply,SBD,M,
Boys,51.71,4,Charles Mack,Boling,47.04,127.01,65.77,120.2,312.98,Single-ply,SBD,M,
Boys,51.71,5,Aiden Flores,Nixon Smiley,51.48,117.93,74.84,120.2,312.98,Single-ply,SBD,M,
Boys,51.71,6,Jarrell Smith,Winnie East Chambers,51.26,124.74,70.31,115.67,310.71,Single-ply,SBD,M,
Boys,51.71,7,Tye Warncke,East Bernard,49.4,113.4,52.16,122.47,288.03,Single-ply,SBD,M,
Boys,51.71,8,Cesar Vasquez,Nixon Smiley,50.58,102.06,56.7,124.74,283.5,Single-ply,SBD,M,
Boys,51.71,9,Bryant Adams,Altair Rice,49.53,104.33,56.7,120.2,281.23,Single-ply,SBD,M,
Boys,51.71,10,Kristopher Manning,Boling,41.55,95.25,54.43,104.33,254.01,Single-ply,SBD,M,
Boys,51.71,NS,Jase Stevens,Kirbyville,,,,,,Single-ply,SBD,M,
Boys,51.71,DQ,Korey Newkirk,Hardin,51.57,,,,,Single-ply,SBD,M,
Boys,55.79,1,Bryan Maldonado,Wallis Brazos,53.25,163.29,90.72,156.49,410.5,Single-ply,SBD,M,
Boys,55.79,2,Jaden Thibodeaux,Winnie East Chambers,54.84,151.95,92.99,163.29,408.23,Single-ply,SBD,M,
Boys,55.79,3,Noah Whittley,Edna,55.52,145.15,86.18,161.03,392.36,Single-ply,SBD,M,
Boys,55.79,4,Tyler Barrientez,Nixon Smiley,55.66,151.95,90.72,149.69,392.36,Single-ply,SBD,M,
Boys,55.79,5,Alex Henriquez,East Bernard,54.7,142.88,74.84,151.95,369.68,Single-ply,SBD,M,
Boys,55.79,6,Cade Janecek,East Bernard,53.57,136.08,70.31,147.42,353.8,Single-ply,SBD,M,
Boys,55.79,7,Kiysean Sykes,Coldspring-Oakhurst,54.79,124.74,83.91,145.15,353.8,Single-ply,SBD,M,
Boys,55.79,8,Rock Page,Cleveland Tarkington,55.7,131.54,86.18,127.01,344.73,Single-ply,SBD,M,
Boys,55.79,9,Chris McCarty,Hardin,54.39,131.54,70.31,136.08,337.93,Single-ply,SBD,M,
Boys,55.79,NS,Aiden Aguillard,Buna,,,,,,Single-ply,SBD,M,
Boys,55.79,NS,Jack King,Coldspring-Oakhurst,,,,,,Single-ply,SBD,M,
Boys,55.79,DQ,Ryan Rodriguez,Boling,53.43,,,,,Single-ply,SBD,M,
Boys,59.87,1,Jason Adams,Nixon Smiley,58.2,170.1,111.13,185.97,467.2,Single-ply,SBD,M,
Boys,59.87,2,Noah Almaraz,Danbury,58.33,154.22,102.06,183.7,439.98,Single-ply,SBD,M,
Boys,59.87,3,Ty Maxwell,Hitchcock,59.87,165.56,95.25,179.17,439.98,Single-ply,SBD,M,
Boys,59.87,4,Kierstin Danna,Kirbyville,57.74,158.76,104.33,165.56,428.64,Single-ply,SBD,M,
Boys,59.87,5,John Mendoza #2,Altair Rice,59.87,163.29,104.33,154.22,421.84,Single-ply,SBD,M,
Boys,59.87,6,Jordan Garcia #7,El Maton Tidehaven,57.88,156.49,86.18,174.63,417.3,Single-ply,SBD,M,
Boys,59.87,7,Emanuel Covarrubias,Boling,58.83,156.49,92.99,165.56,415.04,Single-ply,SBD,M,
Boys,59.87,8,Sergio Martinez,Wallis Brazos,56.74,147.42,77.11,158.76,383.29,Single-ply,SBD,M,
Boys,59.87,9,Aiden Weeks,Woodville,58.6,136.08,95.25,142.88,374.21,Single-ply,SBD,M,
Boys,59.87,10,Illirian Haxhijaj,East Bernard,58.92,138.35,70.31,156.49,365.14,Single-ply,SBD,M,
Boys,59.87,11,John Garza,Nixon Smiley,57.97,124.74,65.77,151.95,342.46,Single-ply,SBD,M,
Boys,59.87,DQ,Chad Faas,El Maton Tidehaven,57.11,,,,,Single-ply,SBD,M,
Boys,67.13,1,Johnny Martinez,East Bernard,62.96,215.46,124.74,197.31,537.51,Single-ply,SBD,M,
Boys,67.13,2,Jason Duran,Victoria St. Joseph,65.36,188.24,106.59,208.65,503.49,Single-ply,SBD,M,
Boys,67.13,3,Noah Hysten,Van Vleck,66.72,192.78,120.2,190.51,503.49,Single-ply,SBD,M,
Boys,67.13,4,Kaleb Rivera,East Bernard,64.05,199.58,117.93,183.7,501.22,Single-ply,SBD,M,
Boys,67.13,5,Oscar Acosta,Nixon Smiley,65.32,185.97,111.13,188.24,485.34,Single-ply,SBD,M,
Boys,67.13,6,Kaiden Garza,Van Vleck,66.27,183.7,115.67,183.7,483.08,Single-ply,SBD,M,
Boys,67.13,7,Bryce Duke,Palacios,65.27,181.44,99.79,192.78,474,Single-ply,SBD,M,
Boys,67.13,8,Dylan Errington,Cleveland Tarkington,66.81,158.76,120.2,185.97,464.93,Single-ply,SBD,M,
Boys,67.13,9,Armando Medel,Nixon Smiley,63.96,165.56,102.06,188.24,455.86,Single-ply,SBD,M,
Boys,67.13,10,Cole Fisher,Hitchcock,65.05,181.44,88.45,183.7,453.59,Single-ply,SBD,M,
Boys,67.13,11,Alerique Medrano,Boling,65.82,154.22,95.25,158.76,408.23,Single-ply,SBD,M,
Boys,67.13,DQ,Jared Dotson,Hitchcock,67,,,,,Single-ply,SBD,M,
Boys,74.84,1,Joseph Townsend,Wallis Brazos,72.48,249.48,127.01,254.01,630.49,Single-ply,SBD,M,
Boys,74.84,2,Martin Moreno,Nixon Smiley,71.76,247.21,136.08,244.94,628.23,Single-ply,SBD,M,
Boys,74.84,3,Tyler Milstead,Buna,73.75,226.8,124.74,238.14,589.67,Single-ply,SBD,M,
Boys,74.84,4,Jesse Reip,Columbus,69.04,206.38,124.74,204.12,535.24,Single-ply,SBD,M,
Boys,74.84,5,Eddy Brown,Coldspring-Oakhurst,70.62,204.12,142.88,188.24,535.24,Single-ply,SBD,M,
Boys,74.84,6,John Sample,Edna,73.44,226.8,122.47,183.7,532.97,Single-ply,SBD,M,
Boys,74.84,7,Matthew Hughes #4,Hardin,73.3,192.78,136.08,185.97,514.83,Single-ply,SBD,M,
Boys,74.84,8,Antonio Cano,Boling,71.99,204.12,111.13,195.04,510.29,Single-ply,SBD,M,
Boys,74.84,9,Jack Broughton,Buna,72.71,190.51,124.74,195.04,510.29,Single-ply,SBD,M,
Boys,74.84,10,Chance McRae,Palacios,72.62,188.24,131.54,165.56,485.34,Single-ply,SBD,M,
Boys,74.84,NS,Maxium Olivier,The Woodlands Christian Academy,,,,,,Single-ply,SBD,M,
Boys,74.84,DQ,Aiden Garcia,Edna,73.26,,,,,Single-ply,SBD,M,
Boys,74.84,DQ,Clayton Johnson,Danbury,74.16,,,,,Single-ply,SBD,M,
Boys,82.1,1,Blake Jedlicka,East Bernard,79.65,233.6,131.54,233.6,598.74,Single-ply,SBD,M,
Boys,82.1,2,Fidel Chavez,Palacios,80.65,238.14,136.08,215.46,589.67,Single-ply,SBD,M,
Boys,82.1,3,Dj Losak,East Bernard,79.79,226.8,147.42,199.58,573.79,Single-ply,SBD,M,
Boys,82.1,4,Jacob Rosales,Edna,81.83,215.46,138.35,210.92,564.72,Single-ply,SBD,M,
Boys,82.1,5,Matt Fleming,Hitchcock,80.24,235.87,122.47,204.12,562.45,Single-ply,SBD,M,
Boys,82.1,6,Ronnie Douglas,Woodville,78.29,215.46,120.2,222.26,557.92,Single-ply,SBD,M,
Boys,82.1,7,Carlo Lewis,Hitchcock,80.2,226.8,113.4,217.72,557.92,Single-ply,SBD,M,
Boys,82.1,8,Omar Morales Navarro,Nixon Smiley,79.97,217.72,129.27,204.12,551.11,Single-ply,SBD,M,
Boys,82.1,9,Justin Maze,Beaumont Monsignor Kelly,77.66,204.12,129.27,204.12,537.51,Single-ply,SBD,M,
Boys,82.1,DQ,Nhan Pham,Anahuac,80.69,217.72,,,,Single-ply,SBD,M,
Boys,82.1,DQ,Brandon Pitty,Cleveland Tarkington,79.83,231.33,122.47,,,Single-ply,SBD,M,
Boys,82.1,DQ,Joseph Tate,El Maton Tidehaven,80.56,204.12,,,,Single-ply,SBD,M,
Boys,89.81,1,J Galvan,East Bernard,83.87,274.42,185.97,217.72,678.12,Single-ply,SBD,M,
Boys,89.81,2,Taylon Alfred,Kirbyville,82.15,233.6,145.15,265.35,644.1,Single-ply,SBD,M,
Boys,89.81,3,Jesse Arrington,Boling,88.5,263.08,136.08,235.87,635.03,Single-ply,SBD,M,
Boys,89.81,4,Chris Turley,Buna,87.77,217.72,133.81,247.21,598.74,Single-ply,SBD,M,
Boys,89.81,5,Lance Heimann,East Bernard,87.41,206.38,113.4,233.6,553.38,Single-ply,SBD,M,
Boys,89.81,6,Jesse Cornish,Vanderbilt Industrial,88.45,231.33,122.47,188.24,542.04,Single-ply,SBD,M,
Boys,89.81,7,Preston Lee,Boling,87.5,181.44,120.2,226.8,528.44,Single-ply,SBD,M,
Boys,89.81,8,Timmy Watson,New Waverly,88.5,192.78,124.74,204.12,521.63,Single-ply,SBD,M,
Boys,89.81,9,Mason Totzer,Anahuac,87.68,192.78,113.4,201.85,508.02,Single-ply,SBD,M,
Boys,89.81,NS,Korbyn Hudgins,East Bernard,,,,,,Single-ply,SBD,M,
Boys,89.81,DQ,Robert Perez,Kountze,89.36,,,,,Single-ply,SBD,M,
Boys,89.81,DQ,Michael Flores #8,Altair Rice,84.14,183.7,127.01,,,Single-ply,SBD,M,
Boys,99.79,1,Shane Holst,Hardin,98.11,256.28,165.56,281.23,703.07,Single-ply,SBD,M,
Boys,99.79,2,Kasey Zientek,Wallis Brazos,99.06,272.16,151.95,233.6,657.71,Single-ply,SBD,M,
Boys,99.79,3,Jonathan Kennebrew,Newton,91.4,226.8,127.01,263.08,616.89,Single-ply,SBD,M,
Boys,99.79,4,Max Kroschel,Danbury,97.07,219.99,149.69,226.8,596.47,Single-ply,SBD,M,
Boys,99.79,5,Ricky Lewis,Coldspring-Oakhurst,94.98,219.99,136.08,226.8,582.87,Single-ply,SBD,M,
Boys,99.79,6,Morgan Machac,Altair Rice,98.66,222.26,140.61,176.9,539.77,Single-ply,SBD,M,
Boys,99.79,7,Ethan Pham,Beaumont Monsignor Kelly,99.06,195.04,138.35,204.12,537.51,Single-ply,SBD,M,
Boys,99.79,8,Thomas Lopez,Victoria St. Joseph,96.21,213.19,104.33,215.46,532.97,Single-ply,SBD,M,
Boys,99.79,9,Shawn Sneath,El Maton Tidehaven,94.3,192.78,120.2,213.19,526.17,Single-ply,SBD,M,
Boys,99.79,10,Joey Brown,Coldspring-Oakhurst,94.8,224.53,124.74,176.9,526.17,Single-ply,SBD,M,
Boys,99.79,11,Kevin Zavala,Nixon Smiley,95.89,226.8,131.54,158.76,517.1,Single-ply,SBD,M,
Boys,99.79,12,Walsh Wesley,Woodville,95.3,181.44,127.01,181.44,489.88,Single-ply,SBD,M,
Boys,99.79,NS,Mark Glover,Altair Rice,,,,,,Single-ply,SBD,M,
Boys,109.77,1,Xavier Perez #1,Palacios,103.06,278.96,161.03,244.94,684.92,Single-ply,SBD,M,
Boys,109.77,2,Mauricio Pecina,Yoakum,105.19,260.82,156.49,240.4,657.71,Single-ply,SBD,M,
Boys,109.77,3,Wyatt Lee,El Maton Tidehaven,106.23,226.8,167.83,204.12,598.74,Single-ply,SBD,M,
Boys,109.77,4,Austin Cummins,Columbus,108,233.6,158.76,204.12,596.47,Single-ply,SBD,M,
Boys,109.77,5,Hayden Land,Victoria St. Joseph,108.41,240.4,124.74,229.06,594.21,Single-ply,SBD,M,
Boys,109.77,6,Hunter Mangum,Columbus,109.13,233.6,136.08,222.26,591.94,Single-ply,SBD,M,
Boys,109.77,7,Oscar Ramirez,Columbus,102.19,235.87,122.47,219.99,578.33,Single-ply,SBD,M,
Boys,109.77,8,Hector Martinez,Winnie East Chambers,105.23,224.53,129.27,213.19,566.99,Single-ply,SBD,M,
Boys,109.77,DQ,Jace Kitchens,Vanderbilt Industrial,109.77,,,,,Single-ply,SBD,M,
Boys,109.77,DQ,Cody Mendenhall,Hardin,106.64,183.7,129.27,,,Single-ply,SBD,M,
Boys,109.77,DQ,Devin Johnson,Edna,103.37,242.67,163.29,,,Single-ply,SBD,M,
Boys,109.77,DQ,Martin Arriaga,Boling,100.74,,,,,Single-ply,SBD,M,
Boys,124.74,1,Andrew Galvan,El Maton Tidehaven,119.88,269.89,172.37,201.85,644.1,Single-ply,SBD,M,
Boys,124.74,2,Jesse Huddleston,Boling,123.33,260.82,124.74,226.8,612.35,Single-ply,SBD,M,
Boys,124.74,3,Sam Hermes,Hallettsville,115.39,244.94,138.35,224.53,607.81,Single-ply,SBD,M,
Boys,124.74,4,Alex Aguilar #3,Marion,119.34,244.94,133.81,226.8,605.55,Single-ply,SBD,M,
Boys,124.74,5,Ethan Luna,Altair Rice,115.39,240.4,138.35,204.12,582.87,Single-ply,SBD,M,
Boys,124.74,6,Erskin Hill,Hitchcock,121.38,231.33,140.61,199.58,571.53,Single-ply,SBD,M,
Boys,124.74,7,Kohl Powell,Vanderbilt Industrial,116.71,226.8,117.93,213.19,557.92,Single-ply,SBD,M,
Boys,124.74,8,Noah Nava,Newton,117.12,183.7,158.76,213.19,555.65,Single-ply,SBD,M,
Boys,124.74,9,Albert Ruben,Hitchcock,118.21,233.6,120.2,185.97,539.77,Single-ply,SBD,M,
Boys,124.74,10,Ronnie Cathey,Van Vleck,117.75,226.8,120.2,188.24,535.24,Single-ply,SBD,M,
Boys,124.74,NS,Connor Colbert,Cleveland Tarkington,,,,,,Single-ply,SBD,M,
Boys,124.74,DQ,Slade Parnell,Winnie East Chambers,115.58,233.6,,,,Single-ply,SBD,M,
Boys,139.71,1,Jerry Johnson,El Maton Tidehaven,128.68,317.51,199.58,260.82,777.91,Single-ply,SBD,M,
Boys,139.71,2,Bode Walters,Marion,133.4,317.51,176.9,238.14,732.55,Single-ply,SBD,M,
Boys,139.71,3,Raybert Williamson,Boling,134.67,294.84,154.22,226.8,675.85,Single-ply,SBD,M,
Boys,139.71,4,Emmanuel Hernandez #4,Newton,126.78,249.48,145.15,260.82,655.44,Single-ply,SBD,M,
Boys,139.71,5,Bart Sylestine,Woodville,129.73,258.55,138.35,249.48,646.37,Single-ply,SBD,M,
Boys,139.71,6,Seth Bear,Boling,134.13,260.82,158.76,226.8,646.37,Single-ply,SBD,M,
Boys,139.71,7,Bryson Mansfield,Newton,127.87,249.48,127.01,251.74,628.23,Single-ply,SBD,M,
Boys,139.71,8,Hunter Williams,Newton,129.77,204.12,136.08,219.99,560.19,Single-ply,SBD,M,
Boys,139.71,9,Tristan Tousha,Warren,128.91,242.67,127.01,183.7,553.38,Single-ply,SBD,M,
Boys,139.71,10,Gabe Medina,Victoria St. Joseph,128,199.58,106.59,192.78,498.95,Single-ply,SBD,M,
Boys,139.71,NS,Malachi Piles,Coldspring-Oakhurst,,,,,,Single-ply,SBD,M,
Boys,139.71,DQ,Jacob Perez #9,Van Vleck,136.12,,,,,Single-ply,SBD,M,
Boys,139.71+,1,J'Kwon Brumley,Kirbyville,149.23,267.62,176.9,235.87,680.39,Single-ply,SBD,M,
Boys,139.71+,2,Hayden Richardson,Coldspring-Oakhurst,143.97,269.89,158.76,226.8,655.44,Single-ply,SBD,M,
Boys,139.71+,3,Wade Springfield,Van Vleck,141.61,258.55,154.22,206.38,619.15,Single-ply,SBD,M,
Boys,139.71+,4,Trevor Strother,Hitchcock,143.7,219.99,129.27,204.12,553.38,Single-ply,SBD,M,
Boys,139.71+,5,Devin Anderson,Hitchcock,149.73,226.8,113.4,183.7,523.9,Single-ply,SBD,M,
Boys,139.71+,DQ,Jose Perez #26,Nixon Smiley,141.61,,,,,Single-ply,SBD,M,
