Title,Description,Issue ID,URL,State,Author,Author Username,Assignee,Assignee Username,Confidential,Locked,Due Date,Created At (UTC),Updated At (UTC),Closed At (UTC),Milestone,Weight,Labels,Time Estimate,Time Spent,Epic ID,Epic Title
Assignment 1 : Project management and documentation,"## Assignment :

* work through a git tutorial
* use git to build a personal site in the class archive describing you.
* test and apply project management principles all along the class.
* document your learning path for this module.

## Learning outcome :

* Explore and use website development tools
* Identify and utilize version control protocols

## Checklist :

Have you
* [ ] made a website and describe how you did it
* [ ] introduced yourself
* [ ] documented steps for uploading files to the archive
* [ ] documented steps for compressing images and keeping storage space low
* [ ] documented how you are going to use project management principles
* [ ] pushed to the class archive

## What have you learned ?

(A few lines)",1,https://gitlab.com/fablab-ulb/enseignements/2022-2023/fabzero-experiments/students/template/-/issues/1,Open,Denis Terwagne,dtwg,Denis Terwagne,dtwg,No,No,,2023-02-16 08:30:14,2023-03-08 16:55:27,,,,Assignment not started,0,0,,
Assignment 2 : Computer-Aided Design (CAD),"## Assignment

* Design, model, and document a parametric [FlexLinks](https://www.compliantmechanisms.byu.edu/flexlinks) construction kit that you will fabricate next week using 3D printers.
* Make it parametric, so you will be able to make adjustments accounting for the material properties and the machine characteristics.
* Read about [Creative Commons open-source Licence](https://creativecommons.org/about/cclicenses/) and add a CC license to your work.
* Complete your FlexLinks kit that you made by fetching the code of at least 1 part made by another classmate during this week. Acknowledge its work. Modify its code and get the parts ready to print.

## Learning outcome

* Learn about compliant mechanism and flexures
* Evaluate and select 3D softwares
* Demonstrate and describe processes used in modelling with 3D software
* Learn about code licenses and how to use them.
* Build on other people's code and give proper credits.

## Checklist :

Have you
* [ ] parametrically modelled some FlexLinks using 3D CAD software
* [ ] shown how you did it with words/images screenshots
* [ ] included your original design files
* [ ] included the CC license to your work
* [ ] documented how you used other people's work and gave proper credit to complete your kit.

## What have you learned ?

(A few lines to complete)",2,https://gitlab.com/fablab-ulb/enseignements/2022-2023/fabzero-experiments/students/template/-/issues/2,Open,Denis Terwagne,dtwg,Denis Terwagne,dtwg,No,No,,2023-02-21 12:14:17,2023-03-08 17:09:52,,,,Assignment not started,0,0,,
Assignment 3 : 3D printing,"## Assignment

* In group, test the design rules, comment on the choice of materials and good practices for your 3D printer(s) regarding the [kit parts](https://fablab-ulb.gitlab.io/enseignements/2022-2023/fabzero-experiments/class-website/fabzero-modules/computer-aided-design/) you are going to make.
* In group, test and set the parameters of your flexible part, so they can be combined with other classmate parts.
* Individually, 3D print your flexible construction kit you made.
* In group, make a compliant mechanism out of it with several hinges that do something.

## Learning outcome

* Identify the advantages and limitations of 3D printing.
* Apply design methods and production processes to show your understanding of 3D printing.

## Checklist :

Have you

* [ ] Explained what you learned from testing the 3D printers
* [ ] Explained how you have identified your design parts parameters
* [ ] Shown how you made your kit with words/images/screenshots
* [ ] Included your original design files for 3D printing (both CAD and generic (STL, OBJ or 3MF) files)
* [ ] Included images and description of your working mechanism.

## What have you learned ?

(A few lines to complete)",3,https://gitlab.com/fablab-ulb/enseignements/2022-2023/fabzero-experiments/students/template/-/issues/3,Open,Denis Terwagne,dtwg,Denis Terwagne,dtwg,No,No,,2023-02-21 12:25:11,2023-03-08 17:17:17,,,,Assignment not started,0,0,,
