Title,Description,Issue ID,URL,State,Author,Author Username,Assignee,Assignee Username,Confidential,Locked,Due Date,Created At (UTC),Updated At (UTC),Closed At (UTC),Milestone,Weight,Labels,Time Estimate,Time Spent,Epic ID,Epic Title
Assigment 4 : Computer controlled machining,"## Assignment

Day 1

* Summarize the safety rules to be followed when using the CNC milling machine.
* Summarize important steps that you need to set up the CNC milling machine and to mill a part
* Assist to a demo

Day 2

* Using a CAD tool, design a part that you would like to mill using the CNC. The part should take no longer than 15 minutes to be milled.
* Prepare and simulate milling your part using a CAM tool.
* Set up the CNC milling machine tool.
* Mill your part !
* Using text, screenshots and photos show how you did the job.
* Show a hero shot of your milled part !

## Learning outcome

* Demonstrate workflows used in sensing something with input device(s) and MCU board

## checklist

Have you

* [ ] documented how you designed your object
* [ ] documented how you made your CAM-toolpath
* [ ] documented how you manufactured your object (setting up the machine, using fixings, testing joints, adjusting feeds and speeds, depth of cut...)
* [ ] described problems and how you fixed them
* [ ] included your design files and ""hero shot"" photos of final object

## What have you learned ?

(A few lines to complete)Assigment 4 :",7,https://gitlab.com/fablab-ulb/enseignements/2022-2023/fabzero-experiments/students/template/-/issues/7,Open,Denis Terwagne,dtwg,Denis Terwagne,dtwg,No,No,,2023-04-04 12:42:57,2023-04-04 12:42:57,,,,Assignment not started,0,0,,
