Title,Description,Issue ID,URL,State,Author,Author Username,Assignee,Assignee Username,Confidential,Locked,Due Date,Created At (UTC),Updated At (UTC),Closed At (UTC),Milestone,Weight,Labels,Time Estimate,Time Spent,Epic ID,Epic Title
Assigment 4 : Electronic prototyping,"## Assignment

Individual assignment : 

DHT20 - Temperature & RH sensor

- Read the [sensor's datasheet](https://cdn.sparkfun.com/assets/8/a/1/5/0/DHT20.pdf) and identify relevant characteristics
- Connect the sensor to your development board
- Write a program to read data and send it to your computer over usb
- Write a program to process data and display some information using the onboard LED

Group assignment :

- Choose an advanced sensor you would like to learn about
- Measure something: add the sensor to a development board and read it. 
- Read the datasheet of the sensor and explain how the physical property relates to the measured results.
- (optional) Make your board do something : add an output device to a development board and program it to do something

## Learning outcome

* Demonstrate workflows used in sensing something with input device(s) and MCU board

## checklist

Have you

* [ ] documented what you have learned from interfacing input devices to a micro controller and how the physical property relates to the measured results
* [ ] (optional) documented what you have learned from interfacing an output device to a micro controller and controlling the device
* [ ] programmed your board
* [ ] described your programming process
* [ ] outlined problems and how you fixed them
* [ ] included original design files and source code
* [ ] included a ""hero shot/video"" of your board in operation

## What have you learned ?

(A few lines to complete)",6,https://gitlab.com/fablab-ulb/enseignements/2022-2023/fabzero-experiments/students/template/-/issues/6,Open,Denis Terwagne,dtwg,Denis Terwagne,dtwg,No,No,,2023-04-04 12:34:15,2023-04-04 12:34:39,,,,Assignment not started,0,0,,
