Title,Description,Issue ID,URL,State,Author,Author Username,Assignee,Assignee Username,Confidential,Locked,Due Date,Created At (UTC),Updated At (UTC),Closed At (UTC),Milestone,Weight,Labels,Time Estimate,Time Spent,Epic ID,Epic Title
Assignment 4 : 3D printing for repair,"## Assignment

- Disassemble your object to access the broken part and its related parts
- Analyse the broken part of your object to define if it is suitable for 3D printing or not
- (re)Design the part, using a CAD software, to fit the requirements and constraints of its new manufacturing method (3D printing) 
- Manufacture your part and post-process it 
- Test your part to evaluate its quality and performance
- Put it back in the device, make it work and be proud ! 
- Document your process with text and images on your website and include your original design files with an appropriate license.

## checklist

Have you

* [ ] Described the object you have chosen and the part that is broken with text, images...
* [ ] Described your analysis of the broken part
* [ ] Explained how you designed your CAD files
* [ ] Documented how you manufactured the replacement part
* [ ] Documented your quality tests and its result
* [ ] Included your original design files
* [ ] Included an appropriate license to the part
* [ ] Included your hero shots

## What have you learned ?

(A few lines to complete)",5,https://gitlab.com/fablab-ulb/enseignements/2022-2023/fabzero-experiments/students/template/-/issues/5,Open,Denis Terwagne,dtwg,Denis Terwagne,dtwg,No,No,,2023-04-04 12:26:00,2023-04-04 12:26:00,,,,Assignment not started,0,0,,
