<svg width="101" height="101" viewBox="0 0 101 101" fill="none" xmlns="http://www.w3.org/2000/svg">
<path d="M51.6379 4.16984C51.0611 3.29387 49.6053 3.2925 49.0285 4.1714L37.7051 21.3589L40.3143 23.0777L50.3332 7.87004L65.9689 31.5929H40.9582V34.7179H68.0285L79.3566 51.9054H44.0832V55.0304H81.4166L92.7447 72.2179H39.3957V75.3429H95.6457C95.9279 75.343 96.2049 75.2666 96.4472 75.1219C96.6896 74.9773 96.8882 74.7696 97.022 74.5212C97.1558 74.2727 97.2198 73.9926 97.2072 73.7106C97.1946 73.4287 97.1058 73.1554 96.9504 72.9198L51.6379 4.16984Z" fill="white"/>
<path d="M8.86136 65.1085L3.71605 72.921C3.56093 73.1566 3.47245 73.4297 3.46002 73.7115C3.44758 73.9933 3.51164 74.2731 3.6454 74.5214C3.77917 74.7697 3.97765 74.9772 4.21979 75.1218C4.46193 75.2665 4.7387 75.3428 5.02074 75.3429H14.3957V72.2179H7.92152L11.4705 66.8273L8.86136 65.1085Z" fill="white"/>
<path d="M49.028 15.5283L47.4663 17.9L50.0756 19.6181L51.6373 17.2465L49.028 15.5283Z" fill="white"/>
<path d="M45.8808 20.3003L41.0679 27.6096L43.6772 29.3278L48.4902 22.0185L45.8808 20.3003Z" fill="white"/>
<path d="M44.5867 84.7374C42.0236 83.0119 39.9245 80.6823 38.4742 77.954C37.024 75.2258 36.2672 72.1826 36.2706 69.0929V65.9679C37.8773 65.9742 39.4243 65.3599 40.589 64.2531C41.7536 63.1464 42.446 61.6327 42.5216 60.0278C42.5971 58.4229 42.0501 56.8508 40.9946 55.6395C39.9391 54.4282 38.4567 53.6712 36.8566 53.5265L39.3156 46.1491C39.3941 45.9143 39.4157 45.6641 39.3785 45.4192C39.3413 45.1744 39.2463 44.9419 39.1015 44.741C38.9566 44.5401 38.7661 44.3765 38.5455 44.2638C38.325 44.1511 38.0808 44.0926 37.8331 44.0929H36.2706V39.4054C36.2706 38.991 36.106 38.5936 35.813 38.3005C35.52 38.0075 35.1225 37.8429 34.7081 37.8429H32.8025L32.1675 35.3023L35.8921 36.2331C36.1222 36.2925 36.3629 36.2978 36.5954 36.2485C36.8278 36.1993 37.0457 36.0969 37.232 35.9493C37.4192 35.8033 37.5707 35.6165 37.6749 35.4031C37.779 35.1897 37.8332 34.9554 37.8331 34.7179V25.3429C37.833 25.1055 37.7789 24.8713 37.6747 24.6581C37.5706 24.4448 37.4192 24.258 37.2321 24.112C37.045 23.9659 36.8271 23.8644 36.5949 23.8151C36.3628 23.7659 36.1224 23.7702 35.8921 23.8277L32.1675 24.7585L33.0984 21.0339C33.1559 20.8036 33.1602 20.5633 33.1109 20.3311C33.0616 20.0989 32.9601 19.881 32.8141 19.6939C32.668 19.5068 32.4813 19.3555 32.268 19.2513C32.0547 19.1472 31.8205 19.093 31.5831 19.0929H22.2081C21.9708 19.093 21.7366 19.1472 21.5233 19.2513C21.31 19.3555 21.1233 19.5068 20.9772 19.6939C20.8312 19.881 20.7297 20.0989 20.6804 20.3311C20.6311 20.5633 20.6354 20.8036 20.6929 21.0339L21.6238 24.7585L17.8992 23.8277C17.6689 23.7702 17.4285 23.7659 17.1963 23.8151C16.9642 23.8644 16.7463 23.9659 16.5592 24.112C16.3721 24.258 16.2207 24.4448 16.1166 24.6581C16.0124 24.8713 15.9583 25.1055 15.9581 25.3429V34.7179C15.9583 34.9552 16.0124 35.1894 16.1166 35.4027C16.2207 35.616 16.3721 35.8028 16.5592 35.9488C16.7463 36.0949 16.9642 36.1964 17.1963 36.2456C17.4285 36.2949 17.6689 36.2906 17.8992 36.2331L21.6238 35.3023L20.9888 37.8429H19.0831C18.6687 37.8429 18.2713 38.0075 17.9783 38.3005C17.6853 38.5936 17.5206 38.991 17.5206 39.4054V44.0929H15.9581C15.7105 44.0926 15.4663 44.1513 15.2458 44.2641C15.0253 44.3769 14.8348 44.5405 14.69 44.7415C14.5453 44.9424 14.4504 45.175 14.4133 45.4198C14.3761 45.6647 14.3978 45.9149 14.4765 46.1497L16.9347 53.5265C15.3346 53.6712 13.8521 54.4282 12.7966 55.6395C11.7412 56.8508 11.1941 58.4229 11.2697 60.0278C11.3453 61.6327 12.0376 63.1464 13.2023 64.2531C14.367 65.3599 15.914 65.9742 17.5206 65.9679V69.0929C17.5241 72.1826 16.7673 75.2258 15.317 77.954C13.8668 80.6823 11.7677 83.0119 9.20463 84.7374C7.59398 84.865 6.09533 85.6114 5.02305 86.82C3.95078 88.0286 3.3882 89.6055 3.45333 91.2198C3.51846 92.8342 4.20624 94.3607 5.37239 95.4789C6.53854 96.5972 8.09245 97.2205 9.70814 97.2179H44.0831C45.6988 97.2205 47.2527 96.5972 48.4189 95.4789C49.585 94.3607 50.2728 92.8342 50.338 91.2198C50.4031 89.6055 49.8405 88.0286 48.7682 86.82C47.6959 85.6114 46.1973 84.865 44.5867 84.7374ZM18.1261 47.2179H35.6652L33.5824 53.4679H20.2093L18.1261 47.2179ZM24.8749 32.0507C24.6844 31.8597 24.4475 31.7215 24.1875 31.6496C23.9275 31.5777 23.6533 31.5746 23.3917 31.6406L19.0831 32.7159V27.3448L23.3921 28.4206C23.6539 28.4863 23.9282 28.4831 24.1883 28.4112C24.4485 28.3393 24.6855 28.2012 24.8764 28.0103C25.0672 27.8195 25.2053 27.5824 25.2772 27.3223C25.3491 27.0622 25.3524 26.7879 25.2867 26.5261L24.2101 22.2179H29.5812L28.5054 26.5269C28.4397 26.7886 28.4429 27.063 28.5149 27.3231C28.5868 27.5832 28.7249 27.8203 28.9157 28.0111C29.1065 28.2019 29.3436 28.3401 29.6037 28.412C29.8638 28.4839 30.1382 28.4871 30.3999 28.4214L34.7081 27.3448V32.7159L30.3992 31.6402C30.1374 31.5744 29.8631 31.5777 29.6029 31.6496C29.3428 31.7215 29.1058 31.8596 28.9149 32.0505C28.7241 32.2413 28.586 32.4783 28.5141 32.7385C28.4422 32.9986 28.4389 33.2729 28.5046 33.5347L29.5812 37.8429H24.2101L25.2859 33.5339C25.3516 33.2723 25.3483 32.9981 25.2764 32.7381C25.2044 32.4781 25.0662 32.2413 24.8753 32.0507H24.8749ZM20.6456 40.9679H33.1456V44.0929H20.6456V40.9679ZM14.3956 59.7179C14.3967 58.8894 14.7263 58.0952 15.3121 57.5094C15.8979 56.9236 16.6922 56.594 17.5206 56.5929H36.2706C37.0994 56.5929 37.8943 56.9221 38.4803 57.5082C39.0664 58.0942 39.3956 58.8891 39.3956 59.7179C39.3956 60.5467 39.0664 61.3416 38.4803 61.9276C37.8943 62.5137 37.0994 62.8429 36.2706 62.8429H17.5206C16.6922 62.8418 15.8979 62.5122 15.3121 61.9264C14.7263 61.3406 14.3967 60.5464 14.3956 59.7179ZM44.0831 94.0929H9.70814C8.87934 94.0929 8.08448 93.7637 7.49843 93.1776C6.91238 92.5916 6.58314 91.7967 6.58314 90.9679C6.58314 90.1391 6.91238 89.3442 7.49843 88.7582C8.08448 88.1721 8.87934 87.8429 9.70814 87.8429C10.0166 87.8428 10.3182 87.7514 10.5749 87.5804L10.8495 87.3974C13.8658 85.3913 16.3387 82.6701 18.048 79.4762C19.7572 76.2824 20.6496 72.7153 20.6456 69.0929V65.9679H33.1456V69.0929C33.1482 72.003 33.7303 74.8834 34.858 77.566C35.9856 80.2487 37.6363 82.68 39.7136 84.7179H17.5206V87.8429H44.0831C44.9119 87.8429 45.7068 88.1721 46.2928 88.7582C46.8789 89.3442 47.2081 90.1391 47.2081 90.9679C47.2081 91.7967 46.8789 92.5916 46.2928 93.1776C45.7068 93.7637 44.9119 94.0929 44.0831 94.0929Z" fill="white"/>
</svg>
