<svg width="219" height="62" viewBox="0 0 219 62" fill="none" xmlns="http://www.w3.org/2000/svg">
<g clip-path="url(#clip0)">
<path d="M2.47559 16.3151C7.93199 11.8848 14.1208 8.44685 20.8223 5.93043C31.0027 2.13809 41.586 0.188758 52.4988 0.543182C67.2933 1.03938 81.1358 4.76083 93.4768 13.0189C97.3951 15.6417 97.7613 16.8113 96.5162 21.277C66.268 -0.271994 34.9943 -1.8669 2.47559 16.3151Z" fill="white"/>
<path d="M112.519 43.5348C112.373 42.8969 112.263 42.3298 112.08 41.5146C108.857 44.7399 105.159 45.0588 101.533 43.2513C97.3587 41.1602 96.2234 37.1552 96.3333 32.9375C96.5164 26.6997 100.691 22.482 106.221 23.0491C108.162 23.2618 109.993 24.325 112.08 25.0693C112.08 23.7934 112.08 22.2339 112.08 20.6745C112.08 19.115 112.08 17.5201 112.08 15.8188C113.984 15.8188 115.669 15.8188 117.536 15.8188C117.536 25.0693 117.536 34.2489 117.536 43.6057C115.888 43.5348 114.35 43.5348 112.519 43.5348ZM112.446 33.6464C112.153 32.4059 111.97 31.0945 111.567 29.8895C110.908 27.9756 109.37 27.0187 107.319 26.9478C105.159 26.8769 103.547 27.9402 102.778 29.8186C102.302 30.9882 102.046 32.335 102.009 33.6109C101.936 37.5096 104.133 40.2387 107.173 40.2741C110.359 40.3096 112.226 37.864 112.446 33.6464Z" fill="white"/>
<path d="M78.6092 34.9222C78.4627 37.3323 79.2683 38.8563 81.136 39.7069C83.1867 40.6284 85.4572 40.6284 86.9586 39.0335C88.753 37.1196 90.7671 37.6513 93.6235 37.6867C92.2319 39.4943 91.353 41.0538 90.0347 42.1879C87.0685 44.7043 81.0627 44.917 77.6204 42.8259C73.8852 40.593 71.9443 35.6311 73.0429 31.0236C74.3246 25.53 79.012 22.3402 84.7614 22.9427C89.8882 23.5098 93.6235 27.8337 93.7333 33.1855C93.77 34.5324 93.2573 34.9222 91.9023 34.8868C87.5079 34.8868 83.1135 34.9222 78.6092 34.9222ZM87.7276 31.378C87.3248 28.2945 85.4572 26.6641 82.7839 26.9122C80.2571 27.1603 78.6458 28.897 78.7557 31.378C81.7219 31.378 84.7248 31.378 87.7276 31.378Z" fill="white"/>
<path d="M14.3406 23.6516C16.2448 23.6516 17.9294 23.6516 19.797 23.6516C19.797 30.2084 19.797 36.7652 19.797 43.4993C18.1857 43.4993 16.5378 43.4993 14.78 43.4993C14.7068 42.8968 14.6335 42.2588 14.4871 41.1247C12.4363 43.4284 10.056 44.3854 7.12641 44.2082C3.20805 43.9601 0.974216 42.436 0.681255 38.6791C0.315053 33.7526 0.608014 28.7553 0.608014 23.5098C1.81648 23.5098 3.06157 23.5807 4.30665 23.5098C5.58836 23.4389 5.99118 23.9705 5.99118 25.1756C5.95456 28.7198 5.88132 32.2641 6.0278 35.8083C6.17428 39.2108 8.59122 40.912 11.5575 39.8133C13.5716 39.069 14.2673 37.4032 14.304 35.4893C14.3772 32.3704 14.3406 29.2869 14.3406 26.168C14.3406 25.3528 14.3406 24.5731 14.3406 23.6516Z" fill="white"/>
<path d="M30.2339 43.6767C28.9155 43.6767 27.9268 43.6767 26.9747 43.6767C26.3155 43.6767 25.6563 43.6767 24.631 43.6767C24.631 42.2235 24.631 40.8767 24.631 39.5299C24.631 34.9933 24.7408 30.4212 24.5944 25.8846C24.5211 23.9707 25.107 23.2264 27.0845 23.4745C27.8902 23.5808 28.6958 23.5099 29.6479 23.5099C29.7578 24.3251 29.8677 24.9985 30.0141 25.8846C30.417 25.6365 30.8198 25.4947 31.0761 25.2466C33.786 22.5175 37.0086 22.4821 40.3777 23.6162C43.527 24.6795 44.1129 27.4086 44.1862 30.1377C44.3326 34.6034 44.2228 39.0337 44.2228 43.6058C42.3185 43.6058 40.634 43.6058 38.6565 43.6058C38.6565 41.5856 38.6931 39.6362 38.6565 37.7223C38.6199 35.2768 38.5833 32.7958 38.4002 30.3858C38.2537 28.6136 37.1917 27.444 35.2875 27.2668C33.2367 27.0542 31.5156 27.6921 30.8564 29.7478C30.4902 30.8819 30.3437 32.1579 30.3071 33.3629C30.1606 36.6591 30.2339 40.0261 30.2339 43.6767Z" fill="white"/>
<path d="M218.498 46.8311C214.14 49.2766 209.929 51.9702 205.461 54.0968C188.287 62.2485 170.306 63.8434 151.703 59.7676C150.311 59.4486 148.993 59.0233 147.601 58.6689C143.17 57.4638 143.17 57.4638 143.976 52.7854C169.683 61.5042 194.475 60.6536 217.985 46.1931C218.169 46.3703 218.315 46.583 218.498 46.8311Z" fill="white"/>
<path d="M70.7358 39.8488C70.7358 41.1247 70.7358 42.2589 70.7358 43.9601C68.3189 43.7475 65.9752 43.8183 63.7414 43.3222C61.5808 42.826 60.885 40.983 60.885 38.9273C60.885 35.8438 60.885 32.7249 60.885 29.6414C60.885 28.8616 60.885 28.0819 60.885 27.1958C59.7131 27.0541 58.761 26.9832 57.8455 26.8769C56.93 24.006 57.0399 23.8643 60.8484 23.2972C60.8484 21.4542 60.8484 19.5403 60.8484 17.4846C62.7892 17.4846 64.4738 17.4846 66.4513 17.4846C66.4513 19.3631 66.4513 21.2415 66.4513 23.3326C67.9893 23.4744 69.3076 23.5807 70.6992 23.7225C70.6992 24.7503 70.6992 25.6364 70.6992 26.806C69.4541 26.9123 68.1724 27.0541 66.5977 27.1958C66.5977 30.8464 66.4513 34.4261 66.6344 37.9703C66.8175 40.2741 69.0513 39.4944 70.7358 39.8488Z" fill="white"/>
<path d="M122.443 45.2361C123.981 46.7955 125.153 48.8157 126.874 49.5246C128.779 50.2689 131.232 50.1271 133.356 49.8081C135.737 49.4183 137.201 47.5398 137.604 45.2715C137.97 43.1804 137.861 41.0539 137.714 38.821C135.187 42.4007 131.818 43.4994 127.753 42.5779C122.627 41.4083 120.21 36.5172 121.491 30.2085C122.663 24.5022 127.863 21.5605 133.429 23.7225C135.004 24.325 136.286 25.6364 137.897 26.806C137.897 26.2389 137.824 25.4237 137.934 24.6794C138.007 24.325 138.446 24.006 138.703 23.6516C138.886 23.9706 139.252 24.325 139.252 24.644C139.325 25.8845 139.289 27.0895 139.289 28.33C139.289 33.0084 139.325 37.7223 139.289 42.4007C139.179 50.0562 132.111 53.9549 125.153 50.2334C123.322 49.2765 122.48 47.8234 122.443 45.2361ZM137.824 32.654C137.787 32.2641 137.824 31.4844 137.641 30.7047C136.945 27.7275 135.48 25.282 132.258 24.4313C129.584 23.7225 127.058 24.1478 125.08 26.168C121.857 29.4287 121.491 35.7375 124.567 39.1045C125.739 40.3804 127.717 41.4437 129.438 41.6564C134.345 42.2943 137.787 38.6083 137.824 32.654Z" fill="white"/>
<path d="M49.1299 23.8642C49.4228 23.687 49.4961 23.6161 49.5693 23.6161C54.6961 23.0845 54.6961 23.0845 54.6961 28.0464C54.6961 33.1501 54.6961 38.2538 54.6961 43.5348C52.7553 43.5348 51.0341 43.5348 49.1665 43.5348C49.1299 36.907 49.1299 30.3856 49.1299 23.8642Z" fill="white"/>
<path d="M172.833 33.7173C166.974 33.7173 161.481 33.7173 155.914 33.7173C155.695 36.8362 156.573 39.3881 158.807 41.302C161.078 43.2513 163.971 43.7829 166.498 42.4007C168.695 41.1956 170.343 38.9982 172.247 37.2261C172.43 37.3324 172.613 37.4033 172.796 37.5096C171.881 38.9628 171.258 40.6994 170.05 41.8336C165.545 46.1221 157.489 44.2791 155.328 38.5375C153.937 34.8869 154.23 31.2718 155.841 27.7984C157.416 24.3605 161.078 22.5884 165.069 23.12C169.061 23.6516 171.881 26.2744 172.54 30.1022C172.65 31.1654 172.686 32.2287 172.833 33.7173ZM156.097 32.4059C161.114 32.4059 166.131 32.4059 171.148 32.4059C171.441 27.7275 168.145 24.1478 163.678 24.1478C159.503 24.1124 155.878 28.0465 156.097 32.4059Z" fill="white"/>
<path d="M193.669 33.6818C188.25 33.6818 182.793 33.6818 177.337 33.6818C176.787 37.1197 178.142 40.5931 180.852 41.9045C186.675 44.7044 190.52 42.188 193.083 36.4818C193.706 39.5653 191.545 42.5424 188.579 43.5348C182.134 45.6968 176.348 42.2943 175.909 35.7375C175.725 33.0439 176.238 30.0667 177.3 27.5857C179.095 23.439 183.855 22.0567 188.506 23.7225C192.205 25.0339 194.548 29.3933 193.669 33.6818ZM192.534 32.4059C192.681 27.692 189.055 24.1478 185.027 24.1478C180.779 24.1478 177.373 27.692 177.3 32.4059C182.317 32.4059 187.334 32.4059 192.534 32.4059Z" fill="white"/>
<path d="M198.137 43.5703C198.137 36.9425 198.137 30.3148 198.137 23.6871C198.394 23.6516 198.65 23.6162 198.906 23.6162C199.053 24.7503 199.199 25.8845 199.419 27.4085C201.616 24.0769 204.546 22.7301 208.281 23.1909C211.65 23.6162 213.701 25.1048 213.92 28.3655C214.287 33.3274 214.067 38.3248 214.104 43.2867C214.104 43.393 213.92 43.4639 213.444 43.8892C213.261 43.0032 212.968 42.3652 212.968 41.6918C212.932 38.1476 212.968 34.6033 212.932 31.0591C212.895 26.6642 211.101 24.4314 207.512 24.1478C203.411 23.8288 199.895 26.3452 199.492 30.3857C199.126 34.0363 199.309 37.7577 199.199 41.4437C199.199 42.1526 199.053 42.8969 198.979 43.6057C198.687 43.5703 198.43 43.5703 198.137 43.5703Z" fill="white"/>
<path d="M145.148 23.3682C145.258 24.9276 145.331 26.0972 145.404 27.3732C149.945 23.4745 151.74 22.8011 153.717 24.2542C153.204 24.396 152.838 24.5732 152.472 24.6441C147.968 25.3529 145.404 28.1529 145.331 32.5832C145.294 35.7376 145.331 38.9274 145.294 42.0818C145.294 42.5425 145.148 43.0033 144.562 43.6412C144.379 43.2159 144.049 42.8261 144.013 42.4007C143.427 36.1274 143.939 24.5378 145.148 23.3682Z" fill="white"/>
<path d="M54.513 20.072C52.7187 20.072 51.0341 20.072 49.1665 20.072C49.1665 18.6189 49.1665 17.2366 49.1665 15.748C50.9609 15.748 52.6454 15.748 54.513 15.748C54.513 17.1657 54.513 18.548 54.513 20.072Z" fill="white"/>
</g>
<defs>
<clipPath id="clip0">
<rect width="218" height="61.3863" fill="white" transform="translate(0.498047 0.50769)"/>
</clipPath>
</defs>
</svg>
