<?xml version="1.0" encoding="utf-8"?>
<!-- Generator: Adobe Illustrator 24.0.2, SVG Export Plug-In . SVG Version: 6.00 Build 0)  -->
<svg version="1.1" id="Layer_1" xmlns="http://www.w3.org/2000/svg" xmlns:xlink="http://www.w3.org/1999/xlink" x="0px" y="0px"
	 viewBox="0 0 1920 909" style="enable-background:new 0 0 1920 909;" xml:space="preserve">
<style type="text/css">
	.st0{fill-rule:evenodd;clip-rule:evenodd;fill:#0060BA;stroke:#FFFFFF;stroke-width:2;stroke-miterlimit:10;}
	.st1{fill:#0060BA;}
	.st2{fill:#FFFFFF;}
</style>
<g>
	<g>
		<path class="st0" d="M575.4,615.7l4.9-7l13.3-5l34.2-41.3l11.9-10.9l14-1.7l1.9-20.7l8,2.1l18.5,0.1l16.8-35.8l30.1-2l7.8,7.4
			l7,11l6.6,0.3l8.9,9.9l2,10.7l8.8,2.9l0,0l17-10.7l45.3-29.6l1.6-4.3l-6.3-4.3l-3.8-4.4l-3.4-7.2l0,0l-5.8-5.9l-1.8-3.9
			c-2.7-3.2-3.4-8.3-6.3-11.6c-3.2-3.6-9.1-0.7-11.7-4.7c-2-3.2-1.6-4.7-6.1-6.1c-2.7-1.4-6.9-2.3-8.7-4.6c-2.7-3.5,2.3-6,1.3-8.4
			c-0.6-1.4-3.4-2.5-4.5-3.8c-1.8-2-7.4,1.9-9.4,2.6c-3.7,1.2-7.3-4.1-9-6.5c-3-4.1-5.2-11.7-10.4-13.9c-2.9-1.3-3.8-4.4,0.3-4.4
			c6.8,0,1.9-2.4,1.2-5.7c-1.1-2.6-10.5-10.9-1.8-10.7c8.2,0.2-0.7-6.6,5.4-11.1c4.1-3,1-5.1,3.2-7.6c1.1-1.2,7.7-5.1,9.4-4.4
			c9.7,4.1,4.5-9.4,1.6-12.7c-6-4.2-3.8-10.1-9.5-14.4c-5.7-4.3-9.3-11-10.6-17.4c-1.3-6.3-9.8,1.2-10.3-3.8
			c-0.4-3.2,3.7-3.9,4.3-5.6c1.2-0.3,5.8-2.6,5.4-3.9c-2.3-1.6-5.6-3.4-7.4-5.4c-3.1-3.5,2.1-5.8-0.3-8.8c-1.5-1.8-2-3.4-4.9-2.4
			c-3.6,1.1-5.3,5.6-8.4,0.9c-1.9-2.9-1.3-11.1-6.9-9.2l-5,1.9l0,0l-4.6,1.6l-5.3,27.3l-29.7,9.8l-23.6-1.5l-7.5-7.5l0.9-3l-6.7-0.9
			l-2.4,4.9c-0.3,2.2,0.9,3.9,0.5,6c-0.2,1-4.3,3-5.3,3.9c-3.7,3.4-3.4,7.2-9.8,5.1c-1.1-0.4-7,1.2-7.3,2c-0.7-0.2-0.5-1-0.7-1.5
			c-0.3-0.9-1.5-1-2.4-1.5c1.4-1.6,6.7-1.6,3.6-3.3c-2.3-1.3-5.3-2.6-8.4-2.6c-5.2,0-14.7-1.3-19.9-3.3c-4.5-1.7-5.8-7.1-9.8-6.9
			c-4.9,0.3-1.1-2.5-1.7-4.6c-3.3,0-3.6,1.6-4.7-1.8c-0.5-1.5,0.2-3.7,1.1-4.5c5-4.3-8.5-6.2-10.2-6.7l-2.1-6.1
			c-1.3,1.1-2.2,2.4-4,2.4c-1.7,0-2.8,2.1-3.2,3.2c-0.9,2.2-3.6,3.6-5,0.8c-2.3-4.9-2.9-1-7.7-2.2c-3.2-0.8-2.9-0.6-5.6-1.6
			c-0.5-0.2-1.1-0.2-1.8-0.1l-0.6,13.7l-5.5-0.3c-6.3-4.1-6.1,10-15.2-1.7c-4.1-5.3-2.4-8.3-11.1-7.6l-10.3,0.8
			c-1.1,0.1-5.9-1.9-6.5-1.3c-2.3,2.5,2.5,4.6,1.4,6.4c-3.4,5.4-10.9-9.3-14.7-4c-0.7,1,0.8,2.4,0.7,3.7c-0.2,1.6-3.2,1.9-3,2.5
			c2.9,6.5-8.4,1.5-9.7,1.5c0,3.7-1.9,11.4-4.7,12.8c-5.9,3.1-8.6,6.4-15.1,8.7c-6.4,5.5-2.7,1.4-8.8-0.7c-0.8-0.3-5.5-8.3-8.1-3.9
			c-0.8,1.5-5.9-2.9-6.7-3.7c-2.1-2.1-10.9-5.2-8-8c7.6-7.1-5.4-3.3-6.8-4.4l-6-4.6c-3.6-2.8-4.6-2.5-9.1-2.8
			c-2.7-0.2-3.3,5.6-2.5,6.3c1.6,1.3,3.6,0.7,5.1,1.5c0.2,0.1,3.6,28.8-5.3,23.1c-0.5,1.3-1.5,1.2-2.5,0.5l0,0l-3,5.7
			c0,1.3-2,2.2-2.4,3.6c-0.7,2.5,3.6,3.1,2.1,6.5c-1.9,4.4,0.6,7.2,4,10.2c4.4,3.8,1.7,6.6,0.2,11.2c-0.3,2.9-3.3,5.6-4.2,8.5
			c-0.7,2.2,3,5.6,1,7l-6.2,4.4c-2.6,1.8-4.1-1-6.1-2.5c-1.6-1.2-9.1,0.9-11.7,0.9c-5.6,0-5.4,0.2-9.2,2.9c-0.7,0.5-3.5-1.3-4.7,2.2
			c-2,5.9-6.3,12.7-6.3,19.1l0,0c1.5-0.1,2.4,1.1,3.9,1.4c2.6,0.5,5.8-1.6,8,0.3c1.3,1.1,0.7,3.2,3.5,2.5c6-1.5,5.9-2.1,5.9,3.3
			c0,2.5,2.3,4.3,2.4,6.6c0.1,1.5-1.6,2.5-1.3,3.8c0.2,1.3,1.8,7.3,2.8,8c0.7,0.5,3.8,0.8,4.9,1c2,0.5,2.9,1.8,4.6,2.7
			c2.4,0.9,11.8,5.2,13.4,2.8c1.1-1.6,2.7-11.4,7.4-9.6c0,3.5,7.2,4.4,10.2,4.7c3.1,0.3-0.9,15.7-1.7,18c-2.2,6.3,7.9,8.9,5.3,16.3
			c-1.2,3.6,0.3,4.1,1.5,7c7.5,4.6,4.8,29.3,2.5,35.7c0.1,5.9-8.4,13-4.4,19.1c0.9,1.4,2.3,2.4,2.9,4c1.1,3.1,0.9,5.5,3.4,8.3
			l6.9,7.8c8.3,11.1,21.5,14,35.7,16.9c10.1,2.1,8.1,2.1,10.1,10.1c1.4,5.4,6.5,5.8,6.5,12l-0.3,3.1l0,0l6.7,9.4l8.5,50l0,0
			l90.3-24.9l0,0c0.4-1.5,0.9-3,1.3-4.4C571.5,624.5,574.5,616.5,575.4,615.7L575.4,615.7z"/>
		<path class="st0" d="M377.7,329.7l-3,5.7c0,1.3-2,2.2-2.4,3.6c-0.7,2.5,3.6,3.1,2.1,6.5c-1.9,4.4,0.6,7.2,4,10.2
			c4.4,3.8,1.7,6.6,0.2,11.2c-0.3,2.9-3.3,5.6-4.2,8.5c-0.7,2.2,3,5.6,1,7l-6.2,4.4c-2.6,1.8-4.1-1-6.1-2.5
			c-1.6-1.2-9.1,0.9-11.7,0.9c-5.6,0-5.4,0.2-9.2,2.9c-0.7,0.5-3.5-1.3-4.7,2.2c-2,5.9-6.3,12.7-6.3,19.1l0,0
			c-4.1,2.5-6.3,12.4-9.6,14.4c-2.2,1.3-11.9,2.5-14.9,2.6c-2.6,0.1-9.9-2.6-11.7-1.3c-4.2,2.9-3,8.9-4.4,13
			c-1.7,5.1-8.4,10.2-7.3,14.8c1.8,7.8-11.6,3.9-17,3.1c-3.9-2.7-4.5-0.2-8,0.3c-2.4,0.3-5.5-2.5-8-3.3c-7.5-2.1,2.4-7.9-10.2-8.4
			c-17.9-0.7-33.9,8.1-48.1,17.3c0.1,0,0.1,0,0.1-0.1c-10,4.9-15.5,9.2-23.7,15.9c-6.6,5.4-14.2,4.6-22.4,6.8c-4.7,1.3-10-1.1-11,4
			l-41.2-8.7l-41.8-5.2l-23.5-1.2l0,0l0.8-2.3l-17.5-5.2l-2.3-2.1l-3,0.1l-6.4-3l13.2-30.5c5.5-2.2,12.5-7.7,12.5-13.4
			c0-4.9-8.5-9.2-12.5-12.2l5.8-32.2l14.2-4.5l7.7-9.9l-4-6.3c0.1-0.2,0.8-0.7,0.8-0.8c3.9,0,0.1-4.6,0.7-5.8
			c1.3-2.5,3.7-1.5,5.5-3.9c1.6-2.2,7.6-9.6,10.9-4.8c1.1,1.6,4.7,5.8,6.8,6.4c5.4,1.5,7.8,7.9,10.4,12c1.2,1.9,4.6,4.4,4.8,6.2
			c0.3,2.9,0.8,4.4,3.3,6.6c0.5,1.1,1.4,3.8,2.2,4.5c1.4,1.3,3.5-1,4.6,1.5c0.5,1.2,1.5,0,2.4,0.3c0.9,0.3,1.4,1.5,2.5,1.5
			c2.7-7,24.2-4.3,21.1-15.3c0.1-1.9-6.9-2.6-5.5-3.8c2.7-2.3-1.1-9.6-1.6-12.7c-0.8-5.1-3.5-10-4.1-15.1l-0.2-2.7
			c-1.4-0.4-1.3-2.2-1.3-3.4c0.1,0,0.3-0.3,0.3-0.3c1.6,0,2.4,2.7,4,3.3c1.5,0.5,3.1-1.1,4.6,0.2c3.7,3.2,13.8-10.4,16.3-12
			c6.5-4.1,13.6-0.6,13.6-9.9c-3.9-1.1-2.9-3.9-2.2-6.7c2.9-8.9,13.5,1.1,20.6-6.5c4.3-4.6,10.1-6.3,16.2-7.9c2.5-0.7,5.6-1.7,7.7-3
			c3.5-2.2,0-2.5,0.5-4.2c4.6,0,0.4-6.2,5.1-3.7c4.6,2.5,3.7-9.6,4.6-10.6c1.4-1.6,3.5-3.8,5.1-2.2c0.8,0.8,2.8-0.7,3.3-0.1
			c0.4,0.5-0.8,2.3-1.1,2.7c3.3,3.8,4.4-2.1,5.2-3.3c-1.7-2.1-2.1-5.9-2.1-8.6c6,1.3,3,1.8,5.9,5.2c2.5,3,15.6-1.1,17.8,0.8
			c2.1,1.8,6.3,2.7,4.4,5.8c-0.4,0.7-2.8,0.7-3.6,1c-5.2,1.6,1.9,7.6,6.9,6.5c3.6-0.8,5.3-3.4,8.3-4.2c3.3-0.9,0.2,4.4,2.1,5.6
			c0.7-1.7,5.2-1.3,6.2-2.7c1.1-1.6-1.8-3.2-0.9-4.9c6.5-12.5,9.6-1.6,17.1-6.8c0.8-0.6,0.7-3.9,2.5-3.1c4,1.7,7.8-4.8,8.4-2.9
			l2.3,7.7c0.2,1.4,1.7,2.8,2.2,4.2c0.8,2.1,1.8,4.5,2.7,6.5c0.8,1.7,4.1,1.9,5.7,1c1.5-0.9,3-1.7,5-2.1c3.7-0.7,9.4,0.9,14,0
			c2.3-0.5,4.2-1,5.8-1.5l4.5,1.4c2.9,1.3,6-0.3,7.3,2.8c1,2.5,9.2,1,9.2,7.5c0,7.4,6.1,8.9,13.1,10.1c3.6,0.6,7,2.7,9.8,5
			c2.5,2.1,2,4.3,4.1,6.7c-0.3,0.3-0.2,1.2-0.5,1.6l2.2,2.3c2.8,0.7,1.7,3.2,3.8,3.4c4.4,0.3,5,2.3,8.6,3.1
			c2.2,0.5-2.8,7.5-3.1,10.8c-0.3,3.6-1.6,3.5,1.5,6.6C375.7,327.9,376.7,329.1,377.7,329.7L377.7,329.7z"/>
		<path class="st0" d="M331,409.4c1.5-0.1,2.4,1.1,3.9,1.4c2.6,0.5,5.8-1.6,8,0.3c1.3,1.1,0.7,3.2,3.5,2.5c6-1.5,5.9-2.1,5.9,3.3
			c0,2.5,2.3,4.3,2.4,6.6c0.1,1.5-1.6,2.5-1.3,3.8c0.2,1.3,1.8,7.3,2.8,8c0.7,0.5,3.8,0.8,4.9,1c2,0.5,2.9,1.8,4.6,2.7
			c2.4,0.9,11.8,5.2,13.4,2.8c1.1-1.6,2.7-11.4,7.4-9.6c0,3.5,7.2,4.4,10.2,4.7c3.1,0.3-0.9,15.7-1.7,18c-2.2,6.3,7.9,8.9,5.3,16.3
			c-1.2,3.6,0.3,4.1,1.5,7c7.5,4.6,4.8,29.3,2.5,35.7c0.1,5.9-8.4,13-4.4,19.1c0.9,1.4,2.3,2.4,2.9,4c1.1,3.1,0.9,5.5,3.4,8.3
			l6.9,7.8c8.3,11.1,21.5,14,35.7,16.9c10.1,2.1,8.1,2.1,10.1,10.1c1.4,5.4,6.5,5.8,6.5,12l-0.3,3.1l0,0c-3.1,0-3,0.2-6,0.4
			c-5.7,0.4-2.7-1.4-5.4-3c-1.5-0.8-3.5,0.3-4.6-1.1c-1.9-2.3-2.5-3.5-6.3-3.5c-7.3,0-4.7-2.5-7.2-7.1c-2.6-4.8-10.8-1.4-13.1-7.6
			c-1.2-3.2-7,2-8,3.4c-2.6,1.8-3.9,4.3-7.6,4.3c-3.6,0-6.4-1.5-10-0.7c-7.6,1.6-17,3-24.8,3c-5.5,0-8.5-4.2-14.8-2.6
			c-5.5,1.4-7.5,6.5-11.6,9.5l-28.3-1.4l-9.3,1l-5.4-2.3l0,0c1.4-2.2,4-5.9,4-7.2c0-1.6-1.8-4.2-0.5-5.5c3-5.9-1.1-7.6-6.9-6.2
			c-6.3,1.5-3.2-6-8-6c-4.9,0-4.4-1-8-2.6c-5.8-2.5-6.5,0.5-10.3,2.8c-4.4,2.6-11.7-3.4-16.2-3.1c-4.1,0.2-7.2,0-8.8,4.1
			c-3.1-2-0.2-5.9-6.3-6.4c-3.1,0-6.7,2.7-4.2-2c1.5-3-1-2.5-3.8-3.7c-6.1-2.6-15,3.9-19.1,2.7c-4-1.2-6.9-4.1-11.1-1.2
			c-0.9,0.6-4.8,4.3-5.5,3.5c-0.4-0.6-0.1-2.2-0.7-2.4c-2.3-0.5-3.6,5.4-4.4,6.3c-3.4,3.6-1.8-1-4.4-1c-0.3-1.1,0-1.2-1.2-1.2
			c-1.3,4.6-5.5,1.5-6.5,4.2c-0.3,0.8-3.9,10.7-5.7,6.8c-0.3-0.8-0.1-5.9-0.9-5.5c-1.8,1-4.2,4.8-5.1,6.7c-1.4,5-7.1-0.3-7.1,5.9
			c0,2.3,2.6,6.1-2.2,7.5c0,1.4,1.6,2,1.1,3.7l-1.3,4.4c-1.2,4.2-1.5,5.1-5.5,2.3c-0.9-0.6-4.9-1.4-6.3-1.8c-0.1-0.1-0.3,0-0.5,0
			c-0.1,0.2-2.2,5.4-2.4,4.8c-0.8,0-5.3-2.1-6.1-2.6l0,0c0-0.6,0.2-1.2-0.1-1.7c-1.5-2.7-4.6-2.6-6-5.3c-1.5-2.9-8.1-2.4-11.3-3.3
			c-2.1-0.6-4.7-2.7-7.3-3.1l-4.3-4.1c-1-2.8-4.3-4-7.5-4c-1,0-4.6,0.4-5.1-0.4c-0.1-0.3,1.2-1.4,1.4-1.7c0.6-0.7-0.1-0.8-0.2-1.2
			c-1.2,0-3.7-2.2-3.2-3.3c0.8-1.9,2.6-6.4,6-5.2c3,1,2.6,4.8,6.7,4.8l7.1-0.6l3.9-4.3l-4-6.5L103.5,539l-7.7-16.7l-4.7-0.1
			l-6.2-9.3l-4-5.9l-8.1-5l-4,0.6l-14-0.5l-11.3-4.6l0.1,5.1l-1.5,4.3l-8.5-4.8l-3.8-4.5l2.4-1.4l-5.3-8.7l3.8-2l0.7-1.7l2.1,0.1
			l0.2-1.5l-4.9-1.3l1.1-2.8l-1.5-4.8l0,0l23.5,1.2l41.8,5.2l41.2,8.7c1-5.1,6.3-2.7,11-4c8.1-2.2,15.8-1.4,22.4-6.8
			c8.1-6.7,13.7-11,23.7-15.9c-0.1,0-0.1,0.1-0.1,0.1c14.2-9.2,30.2-17.9,48.1-17.3c12.6,0.5,2.8,6.2,10.2,8.4
			c2.5,0.7,5.6,3.6,8,3.3c3.5-0.5,4.1-3,8-0.3c5.4,0.8,18.9,4.7,17-3.1c-1.1-4.6,5.6-9.8,7.3-14.8c1.3-4.1,0.2-10.1,4.4-13
			c1.8-1.2,9,1.4,11.7,1.3c3-0.1,12.7-1.2,14.9-2.6C324.7,421.8,326.9,411.9,331,409.4L331,409.4z"/>
		<path class="st0" d="M301.4,623c0-0.7,0.1-1.4,0.1-2c-0.1,0-0.3-0.2-0.5-0.2c-0.1-0.2-1.2-0.3-1.5-0.3c-1.3-0.3-2.5,0.5-3.2,1.3
			c-0.5,0.5,0.2,1.5,0.9,1.6c0,0.2,1.6,1.9,1.8,2c1.8,1,1.9,0.5,3.2-0.9L301.4,623L301.4,623z M199.2,667.3c-0.6-0.2-1.1-0.4-1.7,0
			c-0.4,0.3-0.5,0.9-0.3,1.3c0.2,0.5,0.8,1.3,1.6,1.5c0.8,0.2,2.1-1.1,1.4-1.6L199.2,667.3L199.2,667.3z M194.5,674.6
			c-0.2-0.5-0.4-1.9-1.2-2c-0.6,0-1,0.3-1.1,0.8c-0.2,0.7-0.6,2-0.2,2.7c0.4,0.7,1.3,1.6,2.2,0.6L194.5,674.6L194.5,674.6z
			 M176.9,665.4c0-0.1,0-0.2,0-0.2c0-0.7-0.7-3.9,0.2-4c0-0.2,2.2-0.9,2.6-1c5-2.3,3.7,6,1.6,7.3c-0.8,0.5-1.8,2-2.2,2.8
			c-1.4,2.7-1.9-1.2-2.3-1.6L176.9,665.4L176.9,665.4z M167.3,671.2c-1.8-1.8-1.8-3.8-1.8-6.1c0-0.9,0.1-2,0.6-2.8
			c2-2.7,2.7-1.1,2,1.1c-0.7,2.4-0.9,6.3,1.4,8.1c1,0.8,1.7,1,3.1,0.7c1.2-0.2,2.9-0.1,2.5,1.2c-2.1,0.5-2.9,1.2-5.4-0.2
			L167.3,671.2L167.3,671.2z M480.1,654.7l-32.9,9.1l-0.1,204.5l0,0c-2.1,0-4.6-0.1-6.4,0.6c-2.3,0.9-1.4,1.6-4.3,0.9
			c-2.3-0.6-7.8,3.3-8.8,0.9c-1,0-2.6,0.4-2.8,1.6c-2.9,0.4-6.8-4.1-8.2-6.1l-11.9-15.8l-6.9-9.1l-0.4-4.9l-6.5-7l-27.4-18.3
			l-28.3,3.8l-30.2,9.9l-24.5,18.9l0,0c-0.4-0.9,0.8-1.6,0.8-3.5c1-0.3,0.9-4.2,0.9-4.9c0.2-2.8-1.3-2.4-2.2-4.5
			c-0.5-1.2,0.5-2.5,0-3.5c-2.5-4.9,1-8,5.7-11c2-5.1,5.7-8.3,5.7-13.8c0-3.7-5.9-7.5-5.9-10.5c2.3,0.7,9,13,9,4.5
			c0-6.2-5-6.7-9.6-10.3c-3.9-3-12.9,1.4-13.3,0.9c-6.5-7.2-8.3-2.1-16.4-2.1c-1.8,0-3.1-4.6-4.4-6.3c-1.3-1.7-7.6-7.6-7.6-8.8
			c0-1.1,0.4-1.9,0.4-2.9c-2.7-0.8-6-0.7-9.4-0.3c-2.1,0.3-9.4,2.4-9.2,0.3c0.1-0.6,0.8-4.2,1.2-4.6c-0.7-0.8,1.4-12.4,2-12.6
			c0-2-3.7-4.8-4.2-6.2h-0.1c0-0.1-3.4-0.8-3.9-1c-1-0.6-1.7-3.7-2.5-4.9c-2.8-4-3.8-7.2-5.3-11.6c-0.3-1.8-0.2-3.7-1.7-5.1
			c-1.1-1.1-3.5-0.9-4-1.9c-1.3-2.7,0.2-6.1-1.7-9c-4-6.2-13.7-5.7-20.8-7.2c-7.2-1.5-6.2-3.8-7.4-9.3c-0.3-1.1-0.5-2.8-0.5-3.9
			c3.1,0,2-6.6,7.3-5.4c3.4,0.8,7.6,0.9,11.2,1.3c3.5,0.4,3.8,1.3,7.3-0.3c3.3-1.5,4.7,2.2,7.6,3.3c3.8,1.3,3.5,3.5,7.1,4.8
			c1.5-0.7,4.1-0.1,6.3-1c2.6-1.1,2.6-2.6,5.5-2c0.6,2.8,2.1,1.2,4.3,1.2c0,0.1,0.1,0.1,0.2,0.1c0.4,1,4.6,0.8,5.6,0.4
			c4.7-2-6.2-4.8-8.4-4.7c-10,0.6-3.4-7.5-9.8-9.6c-1.4-0.5-2.6,0.1-3.8-1.3c-2.8-3.4-10.4-0.3-10.4-3.4l0.1-0.1
			c5.4,0,3.8-5.8,8.1-8.5c1.9-1.2,11.3-4.3,8.6-7.2c0-4.5,0.7-5.3,4-8.4c1.7-1.6,3.2-3.8,4.4-5.5c0.7-0.9,5.4,1.5,8.6,0.6
			c2.7-0.7,7.6-6.3,7.7-6.3c0.8,2,19.6,4.3,21.6,3c0.8,0.5,6.8-1.1,7.7-1.3c0.9,0.5,3.7,0.9,4.8,0.9c1.7,0,0-3.1-0.3-3.8
			c-0.6-1.3,4.9-3.5,5.3-4.6c0.9,0.6,3.3,1.8,3.8,2.3c1.2,1.3,1.1,3.1,3.2,2.6c1.9-0.5-0.7-7.4-0.7-8.3c0-0.6,3.5-2.3,4-2.6
			c0.1,0.3,1.6,1,2,0.8c0.6,1.5,0,2.6,1.3,3.9c0.9,1,3.4,0.1,3.9-0.8c1.7-3-2.1-7.7,0.2-10c0.8-3.4,3.8-1.2,1.8-5.8
			c-0.2-0.4,3.1-6.4,3.6-6.9c1.2-1.3-3.8-0.6-3.8-0.6c-1.9,0.8-0.8,0.9-0.9,2.8c-0.1,1.3-2.9-0.4-3.5-0.6c-5.2-2.3-5.4-0.4-10.2-0.4
			c-1.1-4,2.3-3,3.3-5.3c1.1-2.5,4.1-1.6,3.3-4.4c-0.3-1.1,0-3.2,0.1-4.3c0.3-3,2.5-3.4,3.6-5.6c0.1-0.3,0.4-0.6,0.6-1.1l0,0
			l5.4,2.3l9.3-1l28.3,1.4c4.1-3,6.1-8.1,11.6-9.5c6.3-1.6,9.3,2.6,14.8,2.6c7.8,0,17.2-1.5,24.8-3c3.6-0.8,6.5,0.7,10,0.7
			c3.8,0,5-2.5,7.6-4.3c0.9-1.4,6.7-6.6,8-3.4c2.4,6.2,10.6,2.8,13.1,7.6c2.5,4.7-0.1,7.1,7.2,7.1c3.8,0,4.4,1.3,6.3,3.5
			c1.2,1.4,3.2,0.3,4.6,1.1c2.7,1.6-0.3,3.4,5.4,3c3-0.2,2.9-0.4,6-0.4l0,0l6.7,9.4L480.1,654.7L480.1,654.7z"/>
		<path class="st0" d="M918.8,187.5c3.7,1.4,3.7,5.1,6.8,6.4c2.6,1.1,17.9-5.2,17.9-1.1c0,9,4.4,2.8,11.5,4.9
			c1.8,0.5,2.3,2.3,4.5,2.6c3.4,0.5,6.7-1.2,10.3-0.6c2.6,0.4,7.6,3.5,7.7-1c0.2-3.7-2.7-7.8,2.3-9.6c10.3,0.8,10.5,6,18.3,9.1
			c2.7,1.1,12-3.7,14.4-5.8c3.1-2.6-5.1-8.8,0.6-8.7c3.8,0.1,14-4.9,15.3-8.3c1.8-4.6,2.2-1.2,5.7-3.8c3.2-2.4,2.5-4.5,8-4.5
			c7.1,0-0.7-5.1,0.1-7.5c0.3-0.8,3.3-3,4.1-4c1.3-1.5,3-3.3,3-5.3c1.3-7.3-4.1-11.8-9.3-16.7c-4.8-4.5,2.1-8.8,5.4-12.4
			c3-3.3,4.5-5.8,8.5-3.3c3.6,2.3,15.9-8.1,18,0.2c0.3,1.4,1,7.7,4.1,5.3c3-2.2,0.8-5.1,5.6-8c1.8-0.4,12.8,1.8,14.2,2.6
			c3.9,2.3,1.7,6.4,3.9,9.5c1.9,2.6,5.7,1.4,8.8,1.5c6.9,0.2,8.3,16.8,17,10.2c2.9-1.4,5.4-3.5,8.6-4.7c2.4-0.8,3.6-1.5,6.3-1
			c2.4,0.4,9.5-2.5,10.8,0.2c1.1,2.2,1.6,4.8,5.1,4.8c4.6,0,5.6,1.4,10.8-0.1c21.6-6.2,11.7,16.4,17.9,24.3c4,5.2,9.8,4.4,16.2,4.4
			c7.3,0,10.6-5,17.5-6.3c2.9-0.5,3.2,2.7,5.7,2.4c5.1-0.8,11.2-4.3,13.9,1.8c3.1,6.8,3,14.1,12.6,15.4c1.8,0.2,3.1,1.8,4.9,2.2
			c2.7,0.6,5.5-0.8,8.4,0.1c2.3,0.7,2.4,3.3,5.1,3.4l23,5.8l0,0c0-2.1,0-3.4-1.8-4.8c-2.7-2.1-7.1,0.3-9.6-2.3
			c-1.5-1.6-0.4-4.5,2.2-4.5c2.4,0,5,1.1,6.7,2.5c4,3.2,4.4-3.6,5.1-5.5c1.2-2.7-0.1-9.1-4.8-7.8c-5.1,1.4-5,7.3-10.2,8.3
			c-3.2,0.6-3.4-4.4-3.4-6c0.1-3.1,4.1-6.6-2.1-6.6c-5.1,0,6.1-6,6.9-7.1c1.3-1.6-0.2-5.4-2.2-6c-3.1-1-6.9,4.2-9.1,2.2
			c-2.5-2.2-3-5.1-0.3-7.3c2.5-2,5.8,0,2.8-5l-3.6-4.8l0,0c-1.7,1.3-2.9,1.8-3.3,0.6c-0.3-0.1-0.3-0.4-0.5-0.5
			c0-5.8-7.5-6.5-7.3-9.2c0.1-1.3,1.8-2,1.2-3.1c-1.2-2.3-0.3-2.2,2.2-2.7c0.8-2.6,3.7-2.3,2-6.1c-1.5-3.4,3.4-1.5,3.8-3
			c2.7-0.6-2.3-4.7,3.2-4.2c3.3,0.3,5.3,1,8.5,0.4c0-2,1.1-4.3,1.8-6.2c0.3-0.8,2-6.2,1.5-6.3v-0.1c0,0-0.4-0.1-0.4-0.2
			c-0.1,0-0.2,0-0.2-0.1c-2.2,0-2.8-0.7-5.1-0.1c0,1-0.8,5.4-3.3,3.8c-2.4,1.5-1.7,5.3-5.9,2.6c-1.9-1.2-4.8,1.3-7.7,1
			c-5.5-0.7-12.5-4.7-13.5-8.9c-0.3-1.1-8.3-2.8-10.1-2.8c-4.9,0-10.5-2.7-10.5,4.2c3.2,0.9,8.4,2.3,8.4,6.4l-0.5,0.5
			c-5.8,0-9.5-3.8-12.3,3.4c-7.9,0,0.1-8.9-0.9-10.5c-0.6-0.9-4-2.3-1.8-3.1c1.9-0.7,3.8-0.8,5.7-1.3c0-1.5-6.3-2.9-7.7-3.7
			c-3.4-1.8,1.4-4.5-2.4-5.5c0-2.3-2.7-4.9-5.1-5.9c-4.9-2.1-5.5-3.6-6.5,1c0.4,0.7,3,2,3.6,2.2c0,5-4.7,2,1.1,7
			c5.4,4.6-2.4,4.5-2.5,3.5c-0.5-3.5-0.2-1.7-2.8-4c-3.3-2.8-3.6-3.2-8.7-3c-5.2,0.3-7.7,1-5.6,6.6c1.7,4.4-8.8,3-11.5,3
			c0,0-0.4-0.3-0.5-0.3c-1-4.1-1-4.8-7.1-4.8c-3,0-4.8,5.7-8.3,4.7v-0.1c-1.2-0.3-1.6-1.7-1.7-2.8c-0.2-2.3-1.8-1.9-2.7-3.4
			c0.2-1.5,1.7-4.3-0.3-4.9c-1.9-0.7-4.6-0.3-2.2-3.3c1.8-2.3,7.8,0.8,8.8-0.2c1.8-1.7,0.1-5,1.1-6.2c-4-4.6-3.4-13.9,3.4-15.9
			c0-1.4-4.5-4.7-6-4.8c-5.7-0.3-4.5-0.9-5.9-5.1c-1-3.2-0.9-3.8-3.4-6.5c-1.9-2,4.6-15.1,1.6-16.3c-2.7-1.1-2.1-2.4-4.2-4
			c-2.2-1.7-4.6-5.6-4.4-8.1c0.2-3.5-10.4,1.2-10.4,1.2c-2.2-0.2-4.7-2.8-6.9-1.8c-3,1.3-0.9,4.3-4.2,5.6c-1.7,0.7-7.8,3.9-7.7,3.6
			c-0.8-0.2-1-0.8-2.1-1c-3.3-0.3-4.7-4.2-7.8-3.2c-2.8,0.9-4.9-4.5-6-6.6c-3.3-6.4-18-0.1-21-5.2c-1.8-3.1-7.3,6.1-10.7,1
			c-2.2-3.2-11.7-8.3-11.7-2.4c0,2.8-1.6,3,3,4.2c0,6.2-1.7,1.1-5.1,0.6c-5.5-0.8-3.7-4.7-8.4,0.6c-0.5,2.3-2.5,2.2-3.6,4
			c-1,1.5,2.7,2.1,1,3.5c-0.3,0.2-8.8,0.5-9.6,0.3c-0.4-0.1-2.8-0.3-2.6,0.3c-3.9,1.9-0.5,0.1-4.8,0.4l-4.8,0.3c0,0.7,0.9,2,1.5,2.2
			c0,2.1-1.8,0.7,0.1,3.3c0.6,0.9,1.5,2.6,2.6,3c0,1.2-1.7,2.6-2.9,2.9c0,1.6,2.3,4.1-0.9,4.6l-7.7,1.3c-5.1,0.9-6.4-6.9-10.6,0.4
			c-2.1,3.6-2.5,4.8-7.1,5.9c-4.6,1-16.6-2.2-17.7,1.7c-1.2,4.3-18.8,2.3-23.7,5.6c-3.4,2.4-14.8,2.6-20.4,4.4
			c-4.4,1.5-8.2,3.4-11.1,4.3l0,0l0.6,6.4c-1.3,3.9,5,8.4,3.6,11.7c-0.8,1.9-5.5,6.2,0.9,6.2c4.3,0,3.1,1.4,4.9,4.1
			c3.4,4.9-4,3.3-7.6,5.3c-4.1,2.3-8.8,0-6.7,6.2c1.1,1.8,1,7.4,3,7.4c4.9,0.2,3.8,8.4,2.4,11.1c-0.8,1.6-0.3,5-0.3,6.9
			c0,3.4,3.3,0.7,5.3,2.2c-0.3,0.5,1.6,9.2,1.5,11c-1.3,5.9,2.8,4.8,5.1,8.5c2.4,3.9-9.7,3.7-12.9,5.8c-1.9,1.3-2.2,5.1,0,6.2
			c3.7,1.9,9,0.4,13.3,2c4.6,1.6-3.2,3.1-4.6,3.1c-3.1,0-4.4,0.1-6.1,2.4c-1.8,2.5-7.8,0.6-6.8,5.5c0.6,3.1,0.9,7.2,0.9,10.3
			L918.8,187.5L918.8,187.5z"/>
		<path class="st0" d="M922.8,56.6l0.6,6.4c-1.3,3.9,5,8.4,3.6,11.7c-0.8,1.9-5.5,6.2,0.9,6.2c4.3,0,3.1,1.4,4.9,4.1
			c3.4,4.9-4,3.3-7.6,5.3c-4.1,2.3-8.8,0-6.7,6.2c1.1,1.8,1,7.4,3,7.4c4.9,0.2,3.8,8.4,2.4,11.1c-0.8,1.6-0.3,5-0.3,6.9
			c0,3.4,3.3,0.7,5.3,2.2c-0.3,0.5,1.6,9.2,1.5,11c-1.3,5.9,2.8,4.8,5.1,8.5c2.4,3.9-9.7,3.7-12.9,5.8c-1.9,1.3-2.2,5.1,0,6.2
			c3.7,1.9,9,0.4,13.3,2c4.6,1.6-3.2,3.1-4.6,3.1c-3.1,0-4.4,0.1-6.1,2.4c-1.8,2.5-7.8,0.6-6.8,5.5c0.6,3.1,0.9,7.2,0.9,10.3
			l-0.5,8.7l0,0l-9.2,3.3c3.2,5,3,12.5-2.2,15.7c-7.9,4.9,0.6,15.9-13.1,19.1c-2.2,0.5-12.9,0.9-12,4.4c0.8,3.2,9.6,4.8,9.6,8.7
			c1.7,2.4,1.2,9.7-0.4,12.2c-1.3,2.1,1.8,7.1-2,7.3c-2.3,0.2-4.6,3.3-3.9,5.2c0.8,2.1,2.3,2.3,2.3,5c0,5.6,0,3.6,3.8,6.6
			c2.1,1.6,1.6,4.7,0.9,7.1c0.3,3.2-0.8,6,0,9c4.8,1,4.9,7.1,9.4,0.9c3.1-4.2,6.2-5.7,10.2-2.2c3.3,2.9,6.7,2.6,10.4,4.4
			c9.1,4.5,4.9,7.6,17.5,9.1c9,1.1,7.8,1.9,17.3,0.1c14.6-2.8,8.4,7.9,12.8,13.6c3.1,4,8.2,0.7,11.6-1c5.5-2.9,6.8-0.3,11.7-0.3
			l4.9,1.5l7.5-1.9l0,0l2.8,7.4c-3.5,8-5.5,9.1-14,12.6c-10.6,4.3-6.7,11.8-15.5,14.6c-6.5,2.1-8.2,4.8-11.5,10.1
			c-3.7,6.1-7.3,10.5-12.8,15.6c-3.5,3.3-2.2,9-6.4,11.5c-4.2,2.9-7.7,4.3-10.2,8.8c-1.4,2.5-2.6,8.3-4.9,9.9
			c-2,1.4-4.9,1.4-7.1,3.3c-2.7,2.2-5.3,5.2-6.7,8.1c-3.8,7.8-5.1,1.9-10,3.5c-6.3,0-6.5,1.6-8.4,5.8c-1.7,3.7-9.2,2.3-12.9,4.1
			c-7.4,3.6-24.3-3.7-32.3-4.8c-6-0.9-3.8,6.2-5.3,9.4c-1,1,0.3,3.8-0.9,5.6c-1,1.5-3.1,2.4-5.1,2.3c-5.9-0.2-6.4,1-3.3,5.6
			c7,10.6-11,2.8-13.3,8c-1.4,3.1,2.8,8,0.9,12.1l-8.7,6.7l0,0l-5.8-5.9l-1.8-3.9c-2.7-3.2-3.4-8.3-6.3-11.6
			c-3.2-3.6-9.1-0.7-11.7-4.7c-2-3.2-1.6-4.7-6.1-6.1c-2.7-1.4-6.9-2.3-8.7-4.6c-2.7-3.5,2.3-6,1.3-8.4c-0.6-1.4-3.4-2.5-4.5-3.8
			c-1.8-2-7.4,1.9-9.4,2.6c-3.7,1.2-7.3-4.1-9-6.5c-3-4.1-5.2-11.7-10.4-13.9c-2.9-1.3-3.8-4.4,0.3-4.4c6.8,0,1.9-2.4,1.2-5.7
			c-1.1-2.6-10.5-10.9-1.8-10.7c8.2,0.2-0.7-6.6,5.4-11.1c4.1-3,1-5.1,3.2-7.6c1.1-1.2,7.7-5.1,9.4-4.4c9.7,4.1,4.5-9.4,1.6-12.7
			c-6-4.2-3.8-10.1-9.5-14.4c-5.7-4.3-9.3-11-10.6-17.4c-1.3-6.3-9.8,1.2-10.3-3.8c-0.4-3.2,3.7-3.9,4.3-5.6
			c1.2-0.3,5.8-2.6,5.4-3.9c-2.3-1.6-5.6-3.4-7.4-5.4c-3.1-3.5,2.1-5.8-0.3-8.8c-1.5-1.8-2-3.4-4.9-2.4c-3.6,1.1-5.3,5.6-8.4,0.9
			c-1.9-2.9-1.3-11.1-6.9-9.2l-5,1.9l0,0l-5.1-4l-2.3-4.8l-0.5-1.6c-1.1-0.9-3.6-0.6-5-0.3c-2,0.4-2.6-0.3-4.3-0.8
			c-2.5-0.8-6.7,0.7-8.4-1c-1.3-1.3-3.4-0.5-5.1-1c-1.4-0.4-1.7-1.8-2.8-2.5c-2.7-2.4-1.6-4.4-0.9-7c-7.4-2.1-20.6,1.7-26-4.2
			c-2.2-2.4,1.4-2.5,2.9-4.6c1.9-2.7,7.2-1.3,2.4-3.6c-3.3-1.6-12.8-3.4-14.6-6.1c-0.4-0.7-2.6,3.6-4.7,0.2c-1.1-1.7-5.1-4.7-3.8-7
			l9.7-0.2l12.9-10.3l9.9-0.1l4-4.2c3.6-0.4,11.2-4.2,12.1-7.2c0.4-1.2-2.7-10.6-3.2-12c-0.2,0-0.3-0.1-0.5-0.1
			c-0.1-0.3-3.7-1.1-4.4-1.1c-0.1-0.2-1.3,0.1-1.5-0.3c-0.8-2,2-6.9-1.9-6.9c-4.2,0-6-7.2-3.3-8.3c2.2-0.8,4.5,1.1,5.6-1.4
			c1.5-3.4,3.8-3.3,5.8-6.2c7.2-3.6,2.4-2.3,2.4-6.7c0.1,0,0.5-0.1,0.6-0.1c2.8,1.8,5-0.8,6.9-2.3c2.2-1.8,3.5-2.1,5,0
			c2.3,3.2,7.1-3.6,12-0.3c7.8,5.2,2.9-0.2,9.4,0.6c3.5,0.5,6.5-0.2,8.6,2.5c3.9,4.9,11.2-3.1,10.4-7.7c-0.7-4-8.1-3.6-11.7-4.6
			c-3.5-1-5.1-3.2-7.5-5.6c-4.8-4.9-5.8,4.2-12.7-1.1c-4.4-3.4-13.5,0-13.5-6.3c-0.3-1.5-1.6-4.2,0.1-5.1c2.2-1.2,4.1-8.5,7.1-5.9
			c2.3,2,2.5,4.5,6.7,2.5c5.3-2.5,8-7.2,0.5-8.9c-5.4-1.2-6.8,3-12.2,2.7c-3.5-0.2-4.1-3.6-6.8-4.5c-0.8-0.3-12.3,0.2-8.5-3.1
			c2-1.7,4.4,1.7,6.2,0.8c2.1-1-0.3-4.6,2.8-5.3c0.2,0.6,2.1-0.1,2.4-0.4c4.3-3.7,5.6-4.7,1.5-8.8c-1.7-4.1-3.2-1.8-6.7-3.3
			c-0.9-0.4-2.9,1-3.2-0.8c-0.2-1.8,4-3.2,5.7-3.7c4.9-1.4,2.1,5,6.7,3.9c4.9-1.2,0.2-5.1,0.2-7.6c2.7-0.8,4.4-2.9,7.7-3.7
			c4.3-1,3.6,0.4,3.6,3.2c0,0.7,4.1,5,5.4,3.8c1.4-1.3,1.5-2.5,3.7-2.7c1.3-0.2,3.9,0.4,3.2,2c1.1,1,3.4-1.9,5.3-1.9
			c2.6,0,1.2,1.7,0.9,2.9c-0.3,1.3,4.3,2.5,5.5,2.5c1.7,0,2-0.7,2-2c0-3.2-2.7-3.2,2.3-5.1c6.6,2,12.2-0.5,18.5,1.3
			c0,0.6-4.8,1.2-3.8,3c3.4,5.8,7.6,6.8,9.6,0.1c2.2-7.4-0.4-5.6,9.4-8.3c4.9-1.3,8.7,0.2,13.5,0.2c4.9,0,2.2-3.3,3.2-5.1
			c1.6-2.8,11.4-1,14.3-1.7c5.1-1.2,10-4.5,15-5.3c4.5-1.1,4.6,6.9,9,5c4.1-1.8-2.7-4.5,3.9-6.7c4.2-1.4,7.4-0.9,12.2-2.2
			c2.6-0.7,4.5,0.3,6.3-0.2c7.6-2,13.8-5.6,22.7-5.6c5.4,0,5.5,6.7,10,5.7c4-0.9,2.9-13.9,6.2-16.2c1.8-1.2,8.2-1.3,10.2-0.6
			c2.5,1,0.6-4.2,1.4-6.3c1.6,0,5.2,1.9,7.6,2.2c10.1,4,4.4-6.3,14.6-6.3c0,0.1,0,0.1,0.1,0.1C916.7,57,919,57.8,922.8,56.6
			L922.8,56.6z"/>
		<path class="st0" d="M617,594.4c-1.3-1.3-2.3-2.9-3.2-4.4c-1.6-2.7-0.5-3.1,1.9-1.7c3.5,1.9,7.3-3.6,10.2,3.2
			c1,2.4,2.1,6.3-0.9,7.6c-1.8,0.8-1.6,5.4-0.1,5.1c3-0.6,6.3-2.5,9.6-3.2c5.4-1.2,11.9,0.7,17.4-0.4c4.3-0.9,5.6,2.1,8.6,2.1
			c1.8,0,5.7,0.1,7.2,0.9c2.4,1.3-6.7,3.8-7.5,4.5c-0.4,0.4-3.5,2.4-3.3,0.6c0.1-0.8,0.2-5-1.6-4.2c-0.1-0.2-1.9,0.3-2.2,0.3
			l-10,0.8c-1.2,0.1-5.2,0.5-4.9,2c1,5,6.8-2.3,9.6,2.1c2.6,4.1,12.6-0.9,9.6,3.7c-2.9,4.5-22.5-3.5-27.1-5.1
			c-3.2-1.1-8.7,1.6-8.4-3c0.3-3.5,1.3-6-2.4-8.4L617,594.4L617,594.4z M691.5,592.3l1.3-1.3c3-1.6,2.5-5.7,2.2-8.5
			c-0.5-5.9,3.8-4.8,7.1-8.8c1.7-2.1,4.6-4.6,4.6-7.2c-0.9-0.3-3.9,0.1-4.8,0.7c-2.4-1.6-9.1,5.3-8,8.1c2,5.3-8.6,2.7-11.7,3.8
			c-4.6-1.5-8.1-1.9-9.6-6.5c-0.7-2.3,1.5-10,0.3-10.2c-2.2-0.4-5.2-1.4-7.4-1.5c-4.9-0.3-6.4,0-2.4,3.4c1,0.9,3.3,1.7,4.6,2.3
			c1.1,0.5,4.3,3.1,1.6,3.7c0,0.2-2.7,1.5-3.3,1.8c-0.7,0.4-3.4,2.3-4.2,1.8c-1,0.6-3.6-2.1-4.2-2.6c-1.7-1.3-1.2,1.1-1.5,2.4
			c-0.7,3.1-2.9,5.7-2.9,0.9c0-2.1-0.6-4.7-1.7-6.5c-1.3-0.9-1.7-3.3-3.6-3.1c-0.2,0-6.5,4.3-8.4,4.9c-5,1.5-6.6,10.3-2.2,13.1
			c6.6,4.1,6.2,0,13-0.4c8.3-0.5,6.5,9.9,18.3,2.6c1-0.6,3.6,5.4,4.3,6.7c2.3,4.3-1.3,4.6-1.3,7.8c5.1,1.5,4.6-1.4,10.4-3.6
			L691.5,592.3L691.5,592.3z M575.4,615.7L575.4,615.7c0.9-0.8,2-0.1,3-1.1c2.5-2.5,2.5-4.5,6.7-4.2c3.3,0.2,6.1-2.1,8.7-1.5
			c2.6,0.7,3.9,0.6,6.1-1.1c6.3-5.1,0.3,4.7-0.9,6.4c-2.7,4-5.2-0.8-6.5,2.1c-0.5,1.1-0.3,2.5-1,3.4c-0.8,1.1-2.2-2.7-4.2-0.3
			c-2,2.4-0.1,6.1-2.6,8.8c-1.9,2-4.1,3.6-6.7,5c-0.3,0.2-0.6,0.4-0.8,0.7l0,0l33.7,17l0,0c0.1-1,0.1-2-0.4-2.7
			c-2.7-3.2,3.9-4.8,5.1-6.9c0.7-1.3,0.2-5-2.2-4.8c-2.6,0.2-2.3,6.8-4.6,6.6c-2.9-0.3-2.2-8.1-1.1-9.6c-0.2-0.7-0.5-1.8-0.5-2.5
			c0,0-0.5-0.2-0.6-0.3c-0.9,0.6-2.4-0.5-2.6-1.2c-0.2-0.7,3-6,3.6-5.8c3.7,1.7,3.1,0.5,5.7-1.9c2.6-2.4,2.9-2.4,4.5-0.2
			c0.9,1.3,2.6-1.1,3.3,1.3c0.8,3-2.1,6.1,1.1,8.9c3.6,3.1,10.5-0.8,10.5,5.5c0,2.4,0.7,4.6,0.7,7c0,2.6-1.6,4.6-1.6,7.4
			c1.9,4.5,3.2,8.1,3.3,12l0,0l52.5,36.3l1.8,8.1l40.3,40.2l23.3-1.2l36.7-7.3l33.6,3.8l25.3,1l18.6-9.3l3.8,0.7l8.5,13l16.6,9.6
			l13.9,25.2l12.9-4.5l-0.8,29.2l0,0l77.1-47.2c-1.3-1.2-7-4.5-3.9-6.5c0.5,0.3,0.7-0.1,1.1,0.2c3.4-1.9,2.2-7,5.3-9.6
			c3.2-2.8,2.3-5.3,2.3-9c0-3.3,13.7,1.3,6.6-8.6c-4.1-5.8,3.4-5.2,3.4-10.6c0-3.2-3.8-4-6.6-5.2c-4-1.7-1.8-9.4-7.7-12
			c-7.8-3.3-10.6,1-10.1-9.4v-35.8c-5.1-3.7-15.5-3.8-19.3-10.2c-2.4-4.1,6.2-10.1,3.1-15.2c-1.5-2.5,1.6-7.8,2.3-10.6
			c0.9-3.8-2.9-5.7-5.9-8.3l0.7-5.9l0,0l-0.3-3.1l-1.8-2l0.9-1.4l-1.6-2.6l-66.6-2.4l-19.1-12l-4.9-6.5l-8.5,0.2l-34-15l-18.7-6
			l-1.8,0.3l-18.5-5.8l-12.9-9.6l-19,2.5l6.8-5.6l0,0l-8.8-2.9l-2-10.7l-8.9-9.9l-6.6-0.3l-7-11l-7.8-7.4l-30.1,2l-16.8,35.8
			l-18.5-0.1l-8-2.1l-1.9,20.7l-14,1.7l-11.9,10.9l-34.2,41.3l-13.3,5L575.4,615.7z"/>
		<path class="st0" d="M1058.4,605.7l236.3-1.7l0,0l-1.8,7.1l-4.9,21l6.6,15.2l0.8,5.6l5,11.6c0,0.2,0,0.4,0.2,0.5
			c0.5,1.8,5.1,1.9,6.7,1.9c2.9,0.1,10.6,3.8,12.1,5.9c1.2,1.6,0.4,6.4,0.7,8.5c0.4,3.1,3.8,10.7,8,11.2c2.7,0.3,4.6-1.3,7.3,0.4
			c2.1,1.3,4.7,3,6.5,4.6c1.9,1.2,3.3,3.3,5.1,4.8c3.2,2.9,9.2,3.4,8.5,7.8c-0.9,5.7,1.1,14.3-3,18.6c-3.9,4-17,8.3-5.3,13.3
			c2,1,4.8-1.1,6,0.4c3.1,3.7,11.2-0.4,6.9,7c-3.5,6-8.6,19.1,2.6,21.8c4.1,1,7.3,0,6.9,4.4c-0.2,3.2,6.7,4.5,8.8,6.2l0,0
			c-0.5,0.4-0.8,0.7-0.8,0.8l-1.5,5c-0.9-0.3-1.8-0.5-2.8-0.8c-2.8-0.8-5.4,0.8-8.4-0.6c-1.9-0.9-4.3-1.9-6.5-1.9
			c-4.6,0-5.2,0.3-9.6-1.4c-4.5-1.7-11.1-5.8-15.2-6.5c-6.6-1.2-8-3.8-12.6-7.8c-2.5-2.1-6.8-0.6-10-3.3c-1.3-1.1-3.7-2.3-6.3-3.2
			l-0.8,2.9c-0.5,2.4-7.2,1.7-8.7,0.4c-3.4-2.9-3.2,3.4-4.3,4.1c-1.4,0.9-3.5,0.4-5.1,0.5c-2.6,0.2-4.8,2.5-7.4,3
			c-4.2,2.1-5.9,7.1-9.1,8c0,6.8,1.3,5.6-1.5,12.3c-2.1,5,0.4,11,3.6,14.7c-0.1,0.1-0.1,0.1,0,0.2c-1,1.4-9.4-0.4-9.4-2.3
			c0-4.6-9.7-3.4-13.5-3.4c-11.3,0-12.8-8.2-23-7.7c-2.6,0.1-4.1-1.7-6.3-2.8c-7.6-4.1-11.8-0.4-19.6-4c-1.5-0.2-3-1.8-4.6-2.2
			c-1.6-0.4-4.1,0.3-6,0.2c-4.6-0.3-5.2,1.4-10.1,1.6l-6.6,0.3c-1.7,0.1-1.8,1.7-3,2c-1.2,0.4-1.8-1.5-3.2-0.3
			c-1.3,1.1-1,2.9-2.5,4.2c-3.3,2.9-1.3-0.2-2.8,3.5c-0.8,1.9-4.1,1.7-6.1,2.2c-3.7,0.8,1.3,3.4,1.3,5.3c-1.9,0.5-5.9-0.9-5.3,1.9
			c0.4,1.9-0.9,3.8-2.3,5.5l0,0c-3-2.1-3.2-4.1-4-6.7c-0.8-2.8-6.3-2.1-6.3-5.4c0-3.5-1.5-2.7-4.5-4.1c-1.3-0.6-2-1.7-2.8-2.7
			c-1.7-1.5-2.7-4.1-5.2-4.8c-2.5-0.7-5.4-0.3-6.5-2.7c-1.9-4.2,2.1-9.1-1.1-13.7c-1.6-2.4-1.7-5.7-4-7.1c-5.1-3.3-1.9-6.9-11-7.2
			c-3.8-0.1-3.4-2.5-6.1-3c-5-1-4-0.4-8.2-3c-2.1-1.8-1.6-1.7-1.6-4.1c0-2.2-2.2-1-3.6-2.1c-3.1-2.4,2.8-10,4.2-12.4
			c3.4-5.8,8.8-12.6,8.8-19.5l-1.6-13.4l-9.6-34.2l-18.5-43.2l1.9-7l-6.1-2.9L1058.4,605.7L1058.4,605.7z"/>
		<path class="st0" d="M921.7,808.8l77.1-47.2c-1.3-1.2-7-4.5-3.9-6.5c0.5,0.3,0.7-0.1,1.1,0.2c3.4-1.9,2.2-7,5.3-9.6
			c3.2-2.8,2.3-5.3,2.3-9c0-3.3,13.7,1.3,6.6-8.6c-4.1-5.8,3.4-5.2,3.4-10.6c0-3.2-3.8-4-6.6-5.2c-4-1.7-1.8-9.4-7.7-12
			c-7.8-3.3-10.6,1-10.1-9.4v-35.8c-5.1-3.7-15.5-3.8-19.3-10.2c-2.4-4.1,6.2-10.1,3.1-15.2c-1.5-2.5,1.6-7.8,2.3-10.6
			c0.9-3.8-2.9-5.7-5.9-8.3l0.7-5.9l0,0l88.4,0.8l0,0l4.2,7.4l6.1,2.9l-1.9,7l18.5,43.2l9.6,34.2l1.6,13.4c0,6.9-5.4,13.6-8.8,19.5
			c-1.4,2.4-7.3,10-4.2,12.4c1.4,1.1,3.6-0.1,3.6,2.1c0,2.5-0.4,2.3,1.6,4.1c4.2,2.6,3.2,2,8.2,3c2.7,0.6,2.3,2.9,6.1,3
			c9.1,0.3,5.9,3.9,11,7.2c2.3,1.5,2.3,4.8,4,7.1c3.2,4.6-0.8,9.5,1.1,13.7c1.1,2.4,4.1,2,6.5,2.7c2.5,0.7,3.5,3.3,5.2,4.8
			c0.9,1,1.5,2.1,2.8,2.7c3,1.4,4.5,0.6,4.5,4.1c0,3.3,5.4,2.6,6.3,5.4c0.8,2.6,1,4.6,4,6.7l0,0c-0.5,0.7-1.1,1.3-1.5,2l3,2.6l0,0
			c-0.6,0.2-1.3,2.6-2.6,3c-1.2,0.4-2.7,0.3-3.8,0.7c-3.2,1-4.8,3.7-5.7,6.3c-2.5,7-9.7-3.8-16.3,2.4c-1.3,1.2-0.5,3.6-2.1,4.5
			c-2.1,1.3-2.9,1.5-4.3,3.5c-1.6,2.2-0.3,2.2-3.6,3c-0.8,0.2-2.4,2.1-3.3,2.6c-2.6,0.3-3.4,3.4-5.1,4c-2.4,0.8-4.3-0.9-6.5-0.5
			c-3.3,0.7-9.9,4-11.3,7c-1.4,3.3-4.1,1.1-5.2,4.8c-1.6,5.2-6,2.1-10.3,2.8c-3.3,0.6-2.4,2.9-4.4,3.4c-3.7,0.9-3,0.6-4.2,3.6
			c-0.4,1-2.2,1.3-2.2,1.7c0,3.3-4,5.3-4,6.2c-2,1.1-6.5,3.9-8.1,5.4c-2.5,2.3,2,4.2-0.7,5.5c-0.4,0.2-3.8,1-4,0.9
			c-0.1,0.1-0.4,0-0.6,0c-0.4-1-2.8-5.1-4.8-4c-2.8,1.5-1,6.3,1.5,7c0,1.9-0.2,3,0.7,4.8c1.2,2.2-0.3,2.8,0.2,4.6
			c0.7,2.2,6.7,5.8,2.6,8c-0.3,0.2-2.6,0.9-2.7,0.6c-0.2,0-1.3-0.4-1.3-0.5c-3,0-3.9-0.9-6.5-1.6c-7.8-3.4-12.9-8.6-21-11.2
			c-2.9-0.9,1.6-2.5,2.4-3.3c2.9-2.5,3.1-2.4,2.6-6.2c-0.3-2,1.7-2.4,1.7-3.7c0-1.9-5.6-0.1-5.9,0.8c-1.4-0.3,0.3-4.8-0.2-5.8
			c-0.8-1.4-6.1,0.2-7.7,0.2c-1.5,0-3.8-2-5.3-2.5l-16.4,4l-30.3-0.9l-8.1-40.1l-25.1-2.9l-0.5-23.5l4.3,0.8L921.7,808.8
			L921.7,808.8z"/>
		<path class="st0" d="M1469.2,346.9c-1,1.5-2.9,2.1-3.6,4c-1.4,3.9-4.2,3.4-7.1,6.2c-3.6,3.3-9.6,7.3-14.9,8.3
			c-5.9,1-2.6,6.7-2.6,10.6c-0.7,4.1,0.2,10.7-6,11.9c-2.2,0.4-4.2,1.6-5.9,2.8c-2.2,1.5-5.4,1.9-8,2.7c-2.3,1.5-10.2,1.7-11.3,3.8
			c-1.5,2.8,9.4,12.2,11.7,14.1c4,3.3,9,6.2,12.3,10c-4.5,5.2-15.2,3.1-8.9,11.3c6.3,6.7,3.9,1.5,10.8,2.2c3.8,0.3,8.9,0.4,12.2,1.3
			c0.7,3.2-3.3,11.8-6.1,14.2c-3.9,3.3-9.5,1.6-12.4,4.7c-1.4,1.5-6,4.6-4.2,6.5c1.6,1.6,4.2,2.8,6.1,4.8c1.3,1.3,11.2-0.3,6.2,3.4
			c-4.8,3.5,0.4,6.2,3.8,7.8c1.6-0.1,7.8,0.7,4.4,2.8c-3.5,2.3-3.4,2.3-5.3,5.6c-1,1.8-3.3,2.1-4.8,4c-4.5,5.7-2.5,15-2.5,21.5
			c0,2.3,0.9,7.1-2.4,8c-3.5,1-6.3-1.4-4.9,4.6c0.4,3.5-3.1,5.3-0.5,9.3c1.3,2,4.4,2.9,5.8,4.9c1.3,1.9,4,3,6.3,1.6
			c1.9-1.2,2.8-7.3,6.1-6.3c1,0.3,1.9,1.5,2.8,2.1c1.6,1.1,3.2,0.9,5.1,1l4.4-1.2l0,0c2.7-1.9,7.1,0.7,9.3,1.5
			c3,1.1,5.9-1.8,7.2-3.8c3.6-5.5,4.5,5.1,10.2,1.9c1.8-1,6.8-7.9,9.3-5.9c3.7,2.9,11.1,7.9,16.2,8.1c6.6,0.2,3.5,6,12.9,6l14.4-2
			l13.3,18.4l21-5.3c4-1,7-1.5,11-1.2c5,0.4,3.4,2.4,5.9,4.9c5.1,5,21.9,8,29.6,11.3l16.8,9.9c4.9,2.9,8.4-1.9,13.1-3.1
			c4.1-1.1,7.3-2.9,4.9,2.1c-5.1,10.8,6,20.7,12.2,29.6c-0.1,2.1,5,6.5,6.7,8.1c2.4,2.4,9.1,5.9,7.3,9.5c-1.2,2.4,0.7,7.5,5.3,7.5
			l0,0c-1.9-3.1,1.6-10.5,2.3-13c1-3.4,0.4-7.2,1.4-10.7c1.8-0.4,5.6-1.5,5.2-3.5c2.9-3.9,5.3-13,6.9-17.6c1.8-5.1,4.3-11.5,7-16.3
			c1-1.8,3-8,3.2-9.9c2.8-6.3,3.7-12.3,7.7-17.7c4.2-5.8-3-12.3,9.4-9.4l8.8,2c2.3,0.5,0.5,3.6,4,3.6c3,0,8.3,5.3,11.8,6.2
			c6.1,1.5,12.2,1.2,17.3,3.4c0,0-0.1,0.1,0.9-0.3c1.8-0.4,3.2-1.7,5.1-2.2c0.9-0.2,8.9-0.7,9.4-0.6c1.8,0.4,3.8,2.4,5.5,2
			c8.5-1.7,10.8-1.4,16.9,3.9c-1.1,1.9,4.6,3.7,6.3-0.7c4.7,0,5.2-4.8,8.8-6.6l4.6,0.3c4.4,0.3,5.8-0.6,7.5-3.8
			c2.4-4.6,9.8-3.7,10.4-10.5c0.2-2.6,1.7-4-0.1-6.6c-1.5-2.1-3.3-3.3-4.3-5.9l2.2-6.2l-2.8-18.9c-1.7-5.8-4.3-13.3,0.7-18.4
			c4.3-4.3,4.9-10.8,10.7-13.9c5.4-1.6,11-0.6,16.6-0.6c4.3,0,7.3-4.6,10.4-3.1c2.9,1.4,16.4-11.8,17.9-13.9
			c1.2-1.7-1.5-4.3-0.2-5.7c3.9-4.4-7.2-8.5,0.1-13.4c2.5-1.7,2.6-6.5,4.9-6.5h9.8c1.1-3.8,7.4,1.6,9.4,0.9l0,0
			c0.2-0.3,0.7-2.6,0.1-2.7c0-0.1,0-0.4,0.1-0.4c0-1.3,1.3-2.4,1.3-4c-1.8-0.5-3.4-0.6-5.6-0.8c-1.9-0.1-2.9-1.2-5-1.2
			c-1.4,0-2.3,0.4-3.5-0.4c-1.9-1.3-2.7-2.8-3.1-4.8c-0.5-1.6-0.6-4.6-2.8-5.2c-4.3-1.2-1.2-2.4-2.2-4.8c-1.9-4.3-15.4-1.6-10.5-7.3
			c1.3-1.5,7.2-4.7,7.2-5.7c0-4.8-1.9-6.8-8.2-5.5c0,5.6-8.2,13.2-15.7,13.9c-1.4,0.1-0.7,5.6-3.6,6.6c-1.5,0.5-5.7-5.6-8.4-2.4
			c-3.3,4-2.2-4.5-8.1-2.6c-3.2,1-2.2-1.7-5.1-1.2c-5.8,1.1-3.2-1.4-6.4-2.4c-1.6-0.5-9,2.8-10.2-1.3c-2.1,0-4.1,3.2-5.6,2.5
			c-0.5-0.2-2.5-4.2-2.4-5c0-5-4.6-5.8-4.6-9.7c0-5-5.4-2.3-6.2-7.9c-0.5-3.4,2.8-2.4,2.8-5c-1.2-0.3-3.3-3.4-4.6-4
			c-2.7-1.3-3.3,0-5.7-2.3c-1.4-1.4-9-5.1-11.6-4.8c-3.3,0.5-5.7-3.9-7.5-2c-2.5,2.6-6.9-0.9-7.7-3.6c-0.5-1.9,0-4.7-0.6-7.2
			c-1-0.8-2.1-5.3-0.2-5.8c0-2.5-5.5-4.6-6.3-7.1c-0.4-1.2-0.2-2.5-1.1-3.6c-1.1-1.5-3.4-2.7-5.1-3.8c-2.3-1.6,0.7-4.5-0.7-5.1
			c-2.3-1-6.4-5.8-7.7-5.8c-2,0-4.7,0-5.6-1.7c-1.3-2.7-4.1-1.6-6.8-2.4l-6.7-2.5c-3.2-1.2-3.2,0.2-6,0.4c-4,0.3-7.9,0.6-10,4.9
			c-1,1.9-7.4,0.9-9.7,0.5c-8.5-1.4-2.1,3-7.1,6.9c-7.9,6.1-12.7,0.4-18.3,3.1c-7.1,3.4-5.9-1.2-11.7-1.2c-3.6,0-10.4,1.5-12-2.7
			c-1.6,0-2.5,3.8-4.3,4.1c-3.8,0-7,0.4-10.6-0.3c-2.6-0.5,0.8-3.8,0.1-5.2c-0.5-1.1-2.9-1.7-2.7-2.2c4.3-9.5-9-4.8-15-4.8
			c-2.9,0,2.2-9.7,2.7-11.2c3.3-9.2-6.2-0.5-9.8-6.7c-1.7-3-4.5-3.7-8.6-4.6c-4.8-1.1-5.3,1.1-5.3,4.5c0,4.1-10.7-1.8-9.8,3.9
			c0.2,1.6-0.8,3.8,1.3,4.6c-1.2,2.1,3.4,9.6-2,9.6c-4.7,0-10.8,3.4-11.7,7.6l-4.7-0.1l-0.7,5.5l-21.4-39.4l-10.7-19.8l0,0
			c-1.1,0.5-6.9,4.5-6.3,5.8c-1.8,3.4-6.4,3-8.2,7.1c-1.9,4.4-6.8,1.2-9.3,4.4c-1.6,2.1-1.9,5-4.7,6.2c-3.8,1.6-8,1.3-10.8,4.8
			c-3.7,1.6-5.8-0.7-8,0.3c-2.6,1.3-3.4,4.9-6.2,5.2c-2.1,0.2-2.3-0.4-3.8,1.3c-3.3,3.6,3.3,13.7,7,15.9c4.9,2.8,7.1,1.6,10.6,6.7
			c1.5,2.2,4.3,1.6,6.1,3.1c2.3,2,2.4,5.3,2.9,7.9c0,3.1-0.7,5.6,0,8.4c2.2,0.6,5,8.9,4.7,10.8c-0.8,4.9-6.6,8.5-11.4,10.6
			c-5.3,2.4-32-2.9-34.9-7C1473.4,347.4,1471.6,344.6,1469.2,346.9L1469.2,346.9z"/>
		<path class="st0" d="M1275.6,270.8l15.9,5.6c1.9,2.9-0.6,5.6,1.3,8c1.9,2.5-0.5,4.1-0.5,6.7c0,2.1,1.5,3.7,1.3,5.8
			c-0.1,2.5-5.9,3.2-5.7,8c0.3,7.7-2.2,9.5,9,8.2c3.7-0.4,6.5-0.3,10.1-1.3c3.7-1.1,6.3-0.7,9.8,0.3c1.6,0.7,4.9,2.1,5.1,3.8
			c0.2,1.5-2.2,2.7-2.4,4.5c-0.2,2.3,1.9,9.6,5.4,5.4c4-4.8,4.5,1.1,8.9,2.2c2.3,0.5,5.2,0.7,6.8,2.4c0.7,0.7-0.3,3.1-0.3,4
			c-0.8,3.1,5.8,2.6,3.8,5.8c-2.4,3.8-8.7,2.2-10.2,8.7c-1.7,7.6,6.6,4.4,10.1,2c3.6-2.4,7.1-1.4,10.3-3.7c2-1.4,4.4-4.4,7.3-3.6
			c5.9,1.6,6.4-2.7,10.3-2.1c2,0.3,2.7,1.8,5.3,1.8c2.3,0,4.7-2,6.7-2.9c5.2,0.3,13.8,7.7,17.3,2.8c5-7.1,10.5,0.3,16.2-1.1
			c3.6-0.9,6.1-15.2,7.9-18.2c3.8-6.2,13.5-5.9,18.5-1c2.6,2.8,6.2,2.5,9.9,2.7c4.2,0.3,12.3,2.8,12.3,7.2c0,4.9-2.4,6.8,0.7,11.7
			l2.3,2.4l0,0c-1,1.5-2.9,2.1-3.6,4c-1.4,3.9-4.2,3.4-7.1,6.2c-3.6,3.3-9.6,7.3-14.9,8.3c-5.9,1-2.6,6.7-2.6,10.6
			c-0.7,4.1,0.2,10.7-6,11.9c-2.2,0.4-4.2,1.6-5.9,2.8c-2.2,1.5-5.4,1.9-8,2.7c-2.3,1.5-10.2,1.7-11.3,3.8
			c-1.5,2.8,9.4,12.2,11.7,14.1c4,3.3,9,6.2,12.3,10c-4.5,5.2-15.2,3.1-8.9,11.3c6.3,6.7,3.9,1.5,10.8,2.2c3.8,0.3,8.9,0.4,12.2,1.3
			c0.7,3.2-3.3,11.8-6.1,14.2c-3.9,3.3-9.5,1.6-12.4,4.7c-1.4,1.5-6,4.6-4.2,6.5c1.6,1.6,4.2,2.8,6.1,4.8c1.3,1.3,11.2-0.3,6.2,3.4
			c-4.8,3.5,0.4,6.2,3.8,7.8c1.6-0.1,7.8,0.7,4.4,2.8c-3.5,2.3-3.4,2.3-5.3,5.6c-1,1.8-3.3,2.1-4.8,4c-4.5,5.7-2.5,15-2.5,21.5
			c0,2.3,0.9,7.1-2.4,8c-3.5,1-6.3-1.4-4.9,4.6c0.4,3.5-3.1,5.3-0.5,9.3c1.3,2,4.4,2.9,5.8,4.9c1.3,1.9,4,3,6.3,1.6
			c1.9-1.2,2.8-7.3,6.1-6.3c1,0.3,1.9,1.5,2.8,2.1c1.6,1.1,3.2,0.9,5.1,1l4.4-1.2l0,0l0.3,25.2c1.4,5.9-10.6,10.9-15.8,11.9
			c-2,0.4-4.4,0.7-6.2,1.5c-7.4,0-13.3,0-20.4-1.7c-2.7-0.6-17.6-4.1-18.6-5.9c-8-1.1-28.2-4.7-35.1-1.3c-15.8,0-29.6,7.8-42.3,15.5
			c-4.4,2.7-11,11.8-14.7,13c-0.1,0.4-0.1,0-0.1,0.8l-8.6,9.7l0,0l-236.3,1.7l0,0l-88.4-0.8l0,0l-0.3-3.1l-1.8-2l0.9-1.4l-1.6-2.6
			l-66.6-2.4l-19.1-12l-4.9-6.5l-8.5,0.2l-34-15l-18.7-6l-1.8,0.3l-18.5-5.8l-12.9-9.6l-19,2.5l6.8-5.6l0,0l17-10.7l45.3-29.6
			l1.6-4.3l-6.3-4.3l-3.8-4.4l-3.4-7.2l0,0l8.7-6.7c1.9-4-2.2-9-0.9-12.1c2.3-5.1,20.2,2.6,13.3-8c-3.1-4.7-2.6-5.8,3.3-5.6
			c2,0.1,4-0.8,5.1-2.3c1.2-1.7-0.1-4.5,0.9-5.6c1.6-3.1-0.7-10.2,5.3-9.4c8,1.1,24.9,8.5,32.3,4.8c3.7-1.8,11.2-0.4,12.9-4.1
			c2-4.2,2.1-5.8,8.4-5.8c5-1.6,6.3,4.3,10-3.5c1.4-3,4.1-5.9,6.7-8.1c2.2-1.9,5.2-1.9,7.1-3.3c2.3-1.6,3.5-7.3,4.9-9.9
			c2.4-4.4,5.9-5.9,10.2-8.8c4.2-2.6,2.9-8.2,6.4-11.5c5.5-5,9.1-9.5,12.8-15.6c3.2-5.3,5-8,11.5-10.1c8.8-2.9,4.9-10.3,15.5-14.6
			c8.6-3.5,10.5-4.6,14-12.6l-2.8-7.4l0,0l1-4.6c5.5,0.7,5.2,8.5,11.4,6.7c5.2-1.5,26.2-15,29-6.6c1.7,5.3,3,12.1,3,17.7
			c0,13.8,3.6,15.1,18.7,8c15.4-7.2,9.9,14.1,27.2,8.4c13.3-7.4,10.6-6.1,13.6,5.6c2.1,7.9,7.7,5.4,13.3,2c9.6-5.9,15-2.4,14.4-14.1
			c-0.3-5.6,0.7-6.8,6.7-7.6c7.6-0.9,5.2-3,8.9-7.2c-0.7-0.5,1.3-1.3,2-1.3c8.2,0,9.3-7.9,16.8-10.2c5.3-1.6,9.3-0.2,14.2,1.4
			c4,1.3,0.5,10.5-1.3,12.9c-3.6,4.8-0.9,6.2,4.3,4c6.3-2.7,4.8-0.5,9.7-0.5c6.3-4.3,8.6,1.4,10.9-7.8c1-3.8,12.4,1,12.4-4.6
			c0.3-0.1,0.2-0.9,1.1-1c0.7-2.4,4.2-1.2,1.2-4.6c-4.7-5.5,0.8-3.3,4.7-5.1c9.2-4.2-3-8.6,13.7-9.5c7.5-0.4,10.9-7.2,17.8-9.5
			c3.1-1,15.2-9.2,6.9-7.6c-2.1,0.4-9.8,1.6-9.8-1.5c0-2-8.6-12.1,2.2-8.8C1262.9,270.5,1273,273,1275.6,270.8L1275.6,270.8z"/>
		<path class="st0" d="M1269,137.5l3.6,4.8c3.1,5-0.3,3-2.8,5c-2.7,2.2-2.2,5.1,0.3,7.3c2.2,1.9,6-3.2,9.1-2.2c2,0.6,3.5,4.5,2.2,6
			c-0.9,1.1-12.1,7.1-6.9,7.1c6.2,0,2.2,3.6,2.1,6.6c-0.1,1.6,0.1,6.7,3.4,6c5.3-1,5.2-6.9,10.2-8.3c4.7-1.3,5.9,5.1,4.8,7.8
			c-0.6,1.9-1.1,8.7-5.1,5.5c-1.7-1.4-4.3-2.5-6.7-2.5c-2.6,0-3.7,2.8-2.2,4.5c2.5,2.6,6.9,0.2,9.6,2.3c1.8,1.4,1.8,2.8,1.8,4.8l0,0
			l1.3,39.1c0.5,2.7-3.4,0.5-3,2.4c0.3,1.2,2.6,1.6,2.4,2.8c-0.5,3.5-11.9-1.2-10,9.6c1.1,6.2,2.5,6.6,10,5.7c0.9-0.1,8,3.7,9,4.4
			c3.5,2.4-3.1,3.4-5,3.1c-4.8-0.6-8.1-3.3-12.5,0.2c-1.2,1-1.6,2.5-2.7,3.3c-1.2,0.8-4.3,2.2-4.7,3.6l-1.6,4.3l0,0l15.9,5.6
			c1.9,2.9-0.6,5.6,1.3,8c1.9,2.5-0.5,4.1-0.5,6.7c0,2.1,1.5,3.7,1.3,5.8c-0.1,2.5-5.9,3.2-5.7,8c0.3,7.7-2.2,9.5,9,8.2
			c3.7-0.4,6.5-0.3,10.1-1.3c3.7-1.1,6.3-0.7,9.8,0.3c1.6,0.7,4.9,2.1,5.1,3.8c0.2,1.5-2.2,2.7-2.4,4.5c-0.2,2.3,1.9,9.6,5.4,5.4
			c4-4.8,4.5,1.1,8.9,2.2c2.3,0.5,5.2,0.7,6.8,2.4c0.7,0.7-0.3,3.1-0.3,4c-0.8,3.1,5.8,2.6,3.8,5.8c-2.4,3.8-8.7,2.2-10.2,8.7
			c-1.7,7.6,6.6,4.4,10.1,2c3.6-2.4,7.1-1.4,10.3-3.7c2-1.4,4.4-4.4,7.3-3.6c5.9,1.6,6.4-2.7,10.3-2.1c2,0.3,2.7,1.8,5.3,1.8
			c2.3,0,4.7-2,6.7-2.9c5.2,0.3,13.8,7.7,17.3,2.8c5-7.1,10.5,0.3,16.2-1.1c3.6-0.9,6.1-15.2,7.9-18.2c3.8-6.2,13.5-5.9,18.5-1
			c2.6,2.8,6.2,2.5,9.9,2.7c4.2,0.3,12.3,2.8,12.3,7.2c0,4.9-2.4,6.8,0.7,11.7l2.3,2.4l0,0c2.3-2.4,4.1,0.4,5.2,2
			c2.9,4.1,29.6,9.4,34.9,7c4.8-2.1,10.6-5.8,11.4-10.6c0.3-1.9-2.5-10.2-4.7-10.8c-0.7-2.9,0-5.4,0-8.4c-0.5-2.6-0.6-5.9-2.9-7.9
			c-1.8-1.5-4.6-0.9-6.1-3.1c-3.5-5.1-5.7-3.9-10.6-6.7c-3.8-2.2-10.4-12.3-7-15.9c1.6-1.7,1.7-1,3.8-1.3c2.8-0.3,3.6-3.9,6.2-5.2
			c2.2-1.1,4.3,1.2,8-0.3c2.8-3.5,7.1-3.1,10.8-4.8c2.8-1.2,3.1-4.1,4.7-6.2c2.5-3.1,7.4,0,9.3-4.4c1.8-4.1,6.5-3.7,8.2-7.1
			c-0.6-1.3,5.2-5.2,6.3-5.8l0,0l-8.2-15.2l-6.7-9.9l-30.9-47.9l-23.7-35.5l-11.5-9.2l-51.6-37.7c-1.4-2.2-3.1-3-2.8-5.6
			c0.3-2.5-2-2.6-2.8-4.6c-1.4-3.6,4.8-2,7.2-2c2.1,5.6,10.8-4,10.8-7.1c0-1.7,1.8-2.5,2-4.2c0.5-4.1-3.9-2-4.2-3.5
			c2.2-0.5,6.5-2.1,7.7-3.5c-2.2-2.6,1.1-1.3-2.8-1.5c-1.6-0.1-4,0.6-5.5,1.2c-5.5,2-2.1,6.3-8.4,6.3c-3.5,0-6.3,1.1-9.8,0.1
			c-6.9-2-4.5-1.8-8.6,2.4l1.1,2.2l-29,11.4l-3.9-0.7l-6.6,3l2.6,4.6l-1.8,3.1c-5.4,2.6-14,10.5-19.5,9.8
			c-4.8-0.6-11.7-2.7-11.7,4.2c-2.1,0.6-2.9,0-3.9,2.6c-1.2,3.1-1.4,2.7-4.9,2.4c-6.3-3.1-6.5,5-4.4,7.9c0.8,1.1-5.3,10.4-7.1,4.2
			c-0.1,0-0.4-0.3-0.5-0.3c-0.1,0-0.1,0-0.2-0.1c-0.5-1.8,0.6-3.4-2-4.2c-1.5-0.5-3.4-2.3-4.6-0.8c-0.8-0.1-2,2.7-3.6,0.7
			c-0.9-1.1,0-2.9-1.3-4c-0.9-0.8-7.8-0.9-8.6,0.2c-1.2,1.7-1.6,4.5-4.4,2.1C1280.6,126.1,1273.3,134.3,1269,137.5L1269,137.5z"/>
		<path class="st0" d="M1378.4,782c-2.1-1.8-9-3-8.8-6.2c0.3-4.4-2.9-3.4-6.9-4.4c-11.1-2.7-6.1-15.8-2.6-21.8
			c4.3-7.4-3.8-3.4-6.9-7c-1.2-1.5-4,0.6-6-0.4c-11.7-5,1.4-9.3,5.3-13.3c4.1-4.3,2.2-12.9,3-18.6c0.7-4.5-5.3-5-8.5-7.8
			c-1.7-1.5-3.1-3.7-5.1-4.8c-1.8-1.6-4.4-3.3-6.5-4.6c-2.8-1.7-4.7-0.1-7.3-0.4c-4.2-0.4-7.6-8-8-11.2c-0.3-2.1,0.6-6.9-0.7-8.5
			c-1.6-2.1-9.2-5.8-12.1-5.9c-1.6-0.1-6.2-0.1-6.7-1.9c-0.2-0.1-0.1-0.3-0.2-0.5l-5-11.6l-0.8-5.6l-6.6-15.2l4.9-21l1.8-7.1l0,0
			l8.6-9.7c0-0.8,0-0.4,0.1-0.8c3.7-1.3,10.2-10.3,14.7-13c12.7-7.7,26.5-15.5,42.3-15.5c6.9-3.5,27.2,0.2,35.1,1.3
			c1,1.8,15.9,5.2,18.6,5.9c7.1,1.7,13,1.7,20.4,1.7c1.8-0.8,4.2-1.1,6.2-1.5c5.2-1,17.1-6,15.8-11.9l-0.3-25.2l0,0
			c2.7-1.9,7.1,0.7,9.3,1.5c3,1.1,5.9-1.8,7.2-3.8c3.6-5.5,4.5,5.1,10.2,1.9c1.8-1,6.8-7.9,9.3-5.9c3.7,2.9,11.1,7.9,16.2,8.1
			c6.6,0.2,3.5,6,12.9,6l14.4-2l13.3,18.4l21-5.3c4-1,7-1.5,11-1.2c5,0.4,3.4,2.4,5.9,4.9c5.1,5,21.9,8,29.6,11.3l16.8,9.9
			c4.9,2.9,8.4-1.9,13.1-3.1c4.1-1.1,7.3-2.9,4.9,2.1c-5.1,10.8,6,20.7,12.2,29.6c-0.1,2.1,5,6.5,6.7,8.1c2.4,2.4,9.1,5.9,7.3,9.5
			c-1.2,2.4,0.7,7.5,5.3,7.5l0,0c0.2,0.3,0.4,0.6,0.8,0.8c4.7,3.3,14.2,4,14.2,10.5c0.5,6.6-0.4,11.3-8.7,9.1
			c-7.5-2-4.7-3.5-12.5-1.2c-3.3,0.9,0.1-3.2-5.4-1.6c-4.9,1.4-7.2-2.9-9.3-5.8c-3.9-5.5-6.6,0.8-10.4-0.9c-2.3,2-4.1,5-8,4.4
			c-1-0.2-11.1,2.3-11.6,2.9c-1.7,1.2-4.9,2.9-7.1,3.6c-0.8,0.3-2.2-0.7-3.5-0.3c-3.2,1-2.8,3.3-6.9,1.5c-4.6-2.1-8.7,2.9-13.9,1.8
			c-4.9-1.1-4,2.6-7.7,3l-12.3,1c-2.5,0.2-9.2,6-9.2,8.3l0.1,0.1c3.4,0,3.7,3.1,4.5,5.2c2.4,0,4.7-2,6.8-2c0,0.1,0.1,0.1,0.1,0.1
			c0,4.7,5.8,6.9,9.8,9.2c7.2,4.1,0.1,6.2,0.1,11c0.1,4.7,2.6,8.7,1.1,13.6c-0.7,2.5-0.6,5.2,0.3,7.7c0.4,1.3,3.5,2.2,2.9,3.7
			c-1.9,4.4,1.3,3.4,2.3,6.6c1.1,3.6,1.1,6.1,3.2,9.8c0.9,3.9,4.6,10.2,6.5,13.8c1,1.8,2.5,3.1,1.7,5.3c-0.7,1.8-2.5,2-1.8,4.5
			c3.9,0.8,3.1,1,3.4,4.2c0.1,1.5,3,3.5,0.9,5.2c-3.1,2.4-8-0.2-10.9,2.3c-1.8,1.5-1.6,2.6-4.4,3.1c-1.2,0.2-5.2,0.5-4.5,2.4
			c2.5,1.6,3.9,3.5,7.1,4.4c7.5,2.1-1.1,3.6-4.2,4.7c-4.4,1.6-6.3-1.3-7.4,3.8c-0.6,2.7-1.7,3.2-3.6,5.3c-2.1,2.2-0.5,7.3,2,8.5
			c2.2,1.1-4.3,6.1,0.1,7.3c0,1.7-1.4,2.5,0.5,4.1c1.4,1.2,1.9,3.4,0.5,4.7l-3.8,0.9l0,0l-2.5-2.6c-1-3.6-4.2-3.2-5.9-5.6
			c-0.6-0.9-0.4-2.1-1.6-2.7c-1.3-0.7-3.1-1.2-4.7-1.2c-3.4,0-3.5-1-5.9-1.6c-2.9-0.7-7.8,1.9-10.5,0.6c-2.3-1.1-2.3-2.9-4.2-4.1
			l-9.9-6.7c-4.7-3.2,2-8.5-4-7.2c-10.4,2.2-20-0.7-28.7-5.1c-3.5-1.8-6.5,1.3-9.7,1.3c-6.4,0-15.2,1.4-21-1.5
			c-2.9-1.5-9-1.2-12.5-2c-5.5-0.5-14.2,2.5-18.2,0.5c-5.7-2.8-7.6-3.7-13.4-3.3c-3.2,0.2-4.9,0.7-7.7,1.3c-1,3.5-7.4,2.3-10.1,2.2
			c-0.2,0-3-0.5-2.6-0.2c-3.4,2.3-2.6,1-6.4,2.2c-3.4,1-2.8-2-5.1-2.4c-2.4-0.4-14.5,1-15.2-1.2c-0.2,0-0.3-0.4-0.5-0.5
			C1383.4,777.5,1380.1,780.5,1378.4,782L1378.4,782z"/>
		<g>
			<g>
				<path class="st1" d="M1115,356.7c-3,0-5.1-2-6.1-6c-0.5-2-0.9-3.7-1.2-5.1c-0.7-3.2-1-4.3-1.7-4.3c-1.2,0-4,1.6-8.7,4.1
					l-0.7,0.4l-0.1,0c-2.1,0.7-4,1.1-5.7,1.1c-5.3,0-7.7-3.3-9.8-6.3c-1.8-2.5-3.4-4.6-6.4-4.6c-1.4,0-3.1,0.5-5.2,1.4
					c-6.5,3-10.4,4.3-13.3,4.3c-5.7,0-6.9-5.3-6.9-13.2c0-5.2-1.1-11.9-2.9-17.4c-0.3-0.9-1-2-3.5-2c-4.7,0-12.2,3.7-17.8,6.4
					c-2.8,1.4-5.1,2.5-6.4,2.9c-0.7,0.2-1.4,0.3-2,0.3c-2.8,0-4.2-2-5.5-3.7c-1-1.3-1.9-2.6-3.4-3.1l-0.9,4.3l-8.4,2.1l-5-1.5
					c-1.8,0-3.1-0.3-4.2-0.6c-0.9-0.2-1.7-0.4-2.6-0.4c-1.2,0-2.6,0.4-4.2,1.3c-0.3,0.1-0.6,0.3-0.9,0.5c-2.1,1.2-4.8,2.6-7.4,2.6
					c-1.9,0-3.4-0.8-4.6-2.3c-1.6-2.1-1.9-4.8-2.2-7.2c-0.5-3.9-0.8-6.5-5.6-6.5c-1.1,0-2.5,0.1-4,0.4c-4.1,0.8-6.2,1.1-8,1.1
					c-1.5,0-2.7-0.2-4.6-0.5c-1.3-0.2-2.8-0.4-4.9-0.7c-8-1-9.7-2.6-11.7-4.7c-1.3-1.3-2.7-2.7-6.1-4.4c-1.4-0.7-2.7-1.1-4-1.4
					c-2.1-0.6-4.4-1.2-6.6-3.1c-1.3-1.2-2.5-1.7-3.7-1.7c-1.6,0-3.2,1.2-5.1,3.8c-1.6,2.2-2.9,3.1-4.1,3.1c-1.2,0-2-0.8-2.9-1.6
					c-0.9-0.8-1.9-1.7-3.4-2.1l-0.6-0.1l-0.2-0.6c-0.5-1.9-0.3-3.6-0.2-5.4c0.1-1.2,0.3-2.5,0.1-3.7l0-0.2l0-0.2
					c0.8-3.1,0.7-5.1-0.6-6c-1-0.8-1.7-1.2-2.2-1.5c-2-1.2-2-1.7-2-5.7v-0.2c0-1.3-0.4-1.8-1-2.5c-0.4-0.5-0.9-1.1-1.3-2.1
					c-0.4-1.1-0.2-2.5,0.7-3.8c0.8-1.2,2.3-2.6,4.1-2.7c0.4,0,0.7-0.1,0.9-0.3c0.3-0.4,0.2-1.6,0.1-2.6c-0.2-1.4-0.4-2.8,0.3-3.9
					c1.4-2.3,1.9-9.1,0.4-11.1l-0.2-0.3v-0.3c0-1.6-2.4-2.9-4.6-4.1c-2.3-1.3-4.5-2.5-4.9-4.3c-0.2-0.7-0.1-1.5,0.4-2.1
					c1.4-2,5.6-2.7,10.2-3.2c0.9-0.1,1.7-0.2,2.1-0.3c7.2-1.7,7.6-5.4,8.2-9.7c0.4-3.2,0.8-6.9,4.6-9.2c2.3-1.4,3.2-3.6,3.5-5.2
					c0.7-3,0-6.5-1.7-9.1l-0.7-1.1l10.7-3.9l0.3,0.1c2.2,0.8,3.3,2.4,4.2,3.8c0.8,1.1,1.4,2.1,2.6,2.6c0,0,0.1,0.1,0.5,0.1
					c1.3,0,3.7-0.6,6.2-1.2c3-0.7,6.2-1.5,8.4-1.5c3,0,3.4,1.5,3.4,2.4c0,1.8,0.2,3,0.5,3.6c0.2,0.3,0.4,0.5,1.1,0.5
					c0.5,0,1.2-0.1,1.9-0.2c1.1-0.2,2.3-0.4,3.6-0.4c1.3,0,2.5,0.2,3.6,0.5c1,0.3,1.7,0.9,2.3,1.4c0.6,0.6,1.2,1,2.1,1.1
					c0.4,0,0.7,0.1,1.1,0.1c1.1,0,2.2-0.2,3.4-0.4c1.3-0.2,2.6-0.4,3.9-0.4c0.7,0,1.3,0,1.9,0.2c0.7,0.1,1.4,0.4,2.2,0.6
					c1.1,0.4,2.3,0.8,3.2,0.8c0.6,0,1.1-0.1,1.2-1.5c0-0.9-0.1-1.9-0.3-2.9c-0.5-2.7-1.1-6,3.3-7.6l0.2-0.1l0.2,0
					c6.6,0.5,9.3,2.7,12.1,5.1c1.7,1.4,3.5,2.9,6.5,4.1c0.1,0,0.3,0.1,0.6,0.1c3.1,0,10.6-3.9,12.8-5.7c0.8-0.6,0.2-2-0.7-3.8
					c-0.8-1.5-1.5-2.9-0.8-4c0.6-1.1,2.1-1.1,2.6-1.1l0.2,0c3.7,0,13.2-4.8,14.3-7.7c1.1-2.8,1.9-3.3,3.5-3.3c0.7,0,1.3,0,2.6-1
					c0.9-0.7,1.5-1.3,2-2c1.3-1.5,2.4-2.8,6.6-2.8c1.7,0,2-0.3,2-0.3c0-0.3-0.8-1.6-1.3-2.2c-1-1.4-2.1-2.9-1.6-4.2
					c0.2-0.7,1-1.4,2.6-2.8c0.7-0.6,1.4-1.2,1.7-1.5l0.5-0.6c1.1-1.3,2.2-2.7,2.2-4.1v-0.1l0-0.1c1.2-6.4-3.4-10.6-8.2-15.1
					l-0.8-0.7c-1.3-1.2-2-2.5-2-4c0-2.9,2.7-5.4,5.1-7.7c0.8-0.8,1.6-1.5,2.2-2.1c0.3-0.3,0.6-0.6,0.8-0.9c1.8-2,3.3-3.7,5.5-3.7
					c1,0,2.2,0.4,3.4,1.2c0.2,0.1,0.5,0.2,0.8,0.2c1.3,0,3.2-0.7,5.3-1.5c2.5-0.9,5.1-1.9,7.3-1.9c2.6,0,4.3,1.4,5,4
					c0,0.2,0.1,0.5,0.2,0.8c0.7,3.7,1.4,4.3,1.7,4.3c0.2,0,0.4-0.1,0.7-0.3c1-0.8,1.3-1.6,1.6-2.7c0.5-1.6,1-3.5,4.1-5.4l0.1-0.1
					l0.2,0c0.2,0,0.5-0.1,0.8-0.1c2.9,0,12.6,1.9,14.1,2.8c2.7,1.6,3,4,3.2,6.1c0.1,1.4,0.3,2.6,1,3.7c0.6,0.9,1.7,1.3,3.4,1.3
					c0.7,0,1.4-0.1,2-0.1c0.7-0.1,1.4-0.1,2.1-0.1c0.1,0,0.3,0,0.4,0c3.4,0.1,5.5,3.3,7.5,6.4c1.8,2.7,3.5,5.3,5.7,5.3
					c0.9,0,2-0.5,3.2-1.3l0.1-0.1l0.1,0c1.1-0.5,2.1-1.2,3.2-1.9c1.7-1,3.4-2.1,5.4-2.8l0.8-0.3c1.4-0.5,2.6-0.9,4.1-0.9
					c0.6,0,1.2,0.1,1.9,0.2c0.1,0,0.3,0,0.4,0c0.8,0,1.9-0.2,3.1-0.4c1.5-0.3,3-0.6,4.4-0.6c1.9,0,3.1,0.6,3.7,1.7
					c0.2,0.4,0.3,0.7,0.5,1.1c0.9,2.1,1.5,3.2,3.7,3.2c1.7,0,3,0.2,4.1,0.4c0.9,0.1,1.7,0.3,2.6,0.3c1.1,0,2.4-0.2,3.9-0.6
					c2.6-0.7,4.8-1.1,6.7-1.1c9,0,9.4,7.9,9.8,14.9c0.2,4.1,0.5,8.4,2.4,10.8c2.9,3.8,7,4.1,11.3,4.1c0.7,0,1.3,0,2,0
					c0.7,0,1.4,0,2.2,0c3.8,0,6.5-1.5,9.3-3c2.4-1.3,4.8-2.6,8-3.2c0.3,0,0.5-0.1,0.8-0.1c1.6,0,2.5,0.9,3.2,1.6
					c0.6,0.6,1,0.9,1.5,0.9c0.1,0,0.1,0,0.2,0c1.1-0.2,2.3-0.5,3.4-0.8c1.8-0.5,3.7-0.9,5.4-0.9c2.9,0,4.9,1.3,6.1,4.1
					c0.7,1.5,1.2,3.1,1.7,4.6c1.8,5.2,3.2,9.3,10.1,10.3c1.2,0.2,2.1,0.7,2.9,1.2c0.7,0.4,1.3,0.8,2.1,1c0.3,0.1,0.6,0.1,1.1,0.1
					l0.2,0c0.7,0,1.4-0.1,2.2-0.2c0.8-0.1,1.7-0.2,2.5-0.2c0.9,0,1.7,0.1,2.4,0.3c1,0.3,1.7,0.9,2.2,1.5c0.1,0.2,0.3,0.3,0.4,0.5
					c0.7,0.8,1.1,1.3,2.2,1.4l0.1,0l23.8,6l1.3,39.7c0.1,0.8,0,1.4-0.4,1.8c-0.6,0.7-1.6,0.8-2.3,0.8c0,0,0,0-0.1,0
					c0.2,0.2,0.4,0.3,0.6,0.4c0.7,0.5,1.8,1.2,1.6,2.4c-0.3,2-2.4,2.3-4.5,2.6c-1.9,0.2-4,0.5-5,1.9c-0.8,1-0.9,2.7-0.5,4.9
					c0.8,4.6,1.7,5.2,4.5,5.2c1,0,2.3-0.1,4.3-0.4l0.1,0l0.1,0c1.4,0,8.8,4.1,9.6,4.6c1.5,1,1.6,2,1.4,2.6c-0.7,2.3-6.3,2.4-6.3,2.4
					c-0.3,0-0.5,0-0.7,0c-1.4-0.2-2.7-0.5-3.9-0.8c-1.4-0.4-2.6-0.7-3.8-0.7c-1.4,0-2.7,0.5-4,1.5c-0.5,0.4-0.8,0.9-1.2,1.4
					c-0.4,0.7-0.9,1.3-1.6,1.8c-0.3,0.2-0.8,0.5-1.3,0.8c-0.9,0.5-2.9,1.6-3,2.3l-1.7,4.6l-0.2,0.2c-0.9,0.8-2.4,1.2-4.5,1.2
					c-4.1,0-9.7-1.4-12.1-2.1c-1.3-0.4-2.4-0.6-3.1-0.6c-0.5,0-0.8,0.1-0.9,0.2c-0.5,0.8,1.1,3.6,1.8,5c0.9,1.6,1.4,2.5,1.4,3.3
					c0,0.1,0,0.4,0.7,0.7c0.6,0.2,1.6,0.4,2.7,0.4c2.2,0,4.5-0.4,5.2-0.5c0.8-0.2,1.4-0.2,2-0.2c1.6,0,2,0.8,2.1,1.3
					c0.4,2.7-8.6,7.8-10.4,8.4c-2.8,0.9-5.1,2.7-7.2,4.4c-3.1,2.4-6.2,4.9-10.8,5.1c-8.7,0.5-8.7,1.8-8.8,3.4
					c-0.1,1.7-0.1,4-4.6,6.1c-1.4,0.6-2.9,0.8-4.1,1c-0.6,0.1-1.5,0.2-1.8,0.3c0.1,0.2,0.3,0.9,1.5,2.3c1.1,1.3,1.5,2.2,1.4,3
					c-0.1,0.9-0.9,1.3-1.4,1.6c-0.5,0.3-0.9,0.5-1,1l-0.2,0.6l-0.6,0.1c0,0-0.1,0.1-0.1,0.2c0,0.1-0.1,0.2-0.2,0.3
					c-0.3,3.6-4.5,3.6-6.6,3.6c-0.4,0-1.9,0-2.2,0c-1.7,0-3.4,0.1-3.6,0.9c-1.5,6-3.3,6.4-6,6.6c-1.4,0.1-3.1,0.2-5.3,1.8l-0.3,0.2
					h-0.3c-1.9,0-3-0.3-3.8-0.6c-0.5-0.2-0.9-0.3-1.4-0.3c-0.9,0-2.1,0.4-4.2,1.2c-1.7,0.7-3.3,1.1-4.4,1.1c-1.7,0-2.4-0.8-2.7-1.3
					c-0.6-1.2-0.1-3,1.6-5.3c1.5-1.9,3.6-7.6,2.8-10.3c-0.2-0.8-0.7-1-1-1.1l-0.2-0.1c-3.2-1.1-6-2-9-2c-1.5,0-2.9,0.2-4.4,0.7
					c-3.1,1-5.1,3-7,5c-2.5,2.6-5.1,5.3-10.1,5.3c-0.1,0-0.3,0.1-0.6,0.1l-0.7,0.8c-1.1,1.2-1.6,2.3-2,3.2c-1.1,2.3-2.1,3.7-7.5,4.3
					c-5.5,0.7-6.1,1.4-5.9,6.5c0.4,8.4-2.2,9.7-7.4,11.5c-2.1,0.7-4.6,1.6-7.5,3.4C1120.8,355,1117.8,356.7,1115,356.7z"/>
				<path class="st2" d="M1067.9,114.9c1.9,0,3.4,0.8,4,3.3c0.3,1.2,0.8,5.9,2.8,5.9c0.4,0,0.8-0.2,1.3-0.5c3-2.2,0.8-5.1,5.6-8
					c0.1,0,0.3,0,0.6,0c2.9,0,12.3,1.9,13.6,2.7c3.9,2.3,1.7,6.4,3.9,9.5c1,1.4,2.5,1.7,4.2,1.7c1.4,0,2.8-0.2,4.2-0.2
					c0.1,0,0.3,0,0.4,0c5.7,0.2,7.7,11.8,13.3,11.8c1.1,0,2.3-0.5,3.8-1.5c2.9-1.4,5.4-3.5,8.6-4.7c1.9-0.6,3-1.2,4.6-1.2
					c0.5,0,1.1,0.1,1.7,0.2c0.2,0,0.4,0,0.6,0c1.8,0,5.1-1,7.5-1c1.3,0,2.3,0.3,2.8,1.2c1.1,2.2,1.6,4.8,5.1,4.8
					c3,0,4.5,0.6,6.6,0.6c1.1,0,2.4-0.2,4.1-0.7c2.6-0.7,4.7-1.1,6.4-1.1c13.1,0,6,18.4,11.4,25.4c3.1,4,7.3,4.5,12,4.5
					c1.4,0,2.8,0,4.2,0c7.3,0,10.6-5,17.5-6.3c0.2,0,0.4-0.1,0.6-0.1c2.3,0,2.8,2.5,4.7,2.5c0.1,0,0.2,0,0.4,0
					c2.9-0.4,6-1.7,8.7-1.7c2.2,0,4,0.8,5.2,3.5c3.1,6.8,3,14.1,12.6,15.4c1.8,0.2,3.1,1.8,4.9,2.2c0.4,0.1,0.8,0.1,1.2,0.1
					c0.1,0,0.2,0,0.2,0c1.5,0,3.1-0.4,4.7-0.4c0.7,0,1.4,0.1,2.1,0.3c0.8,0.2,1.3,0.7,1.8,1.2c0.9,1,1.5,2.1,3.3,2.2l23,5.8
					l1.3,39.1c0.5,2.7-3.4,0.5-3,2.4c0.3,1.2,2.6,1.6,2.4,2.8c-0.5,3.5-11.9-1.2-10,9.6c0.8,4.7,1.8,6.1,5.5,6.1
					c1.2,0,2.6-0.1,4.5-0.4c0,0,0,0,0,0c1,0,7.9,3.7,9,4.4c3.2,2.2-2,3.2-4.4,3.2c-0.2,0-0.4,0-0.6,0c-3-0.3-5.4-1.5-7.9-1.5
					c-1.5,0-3,0.4-4.7,1.8c-1.2,1-1.6,2.5-2.7,3.3c-1.2,0.8-4.3,2.2-4.7,3.6l-1.6,4.3c-0.8,0.7-2.2,0.9-3.9,0.9
					c-4.1,0-9.7-1.4-11.8-2.1c-1.5-0.5-2.6-0.7-3.4-0.7c-5.1,0,1.3,7.8,1.3,9.5c0,1.6,2.1,2.1,4.5,2.1c2.1,0,4.4-0.4,5.4-0.6
					c0.7-0.1,1.3-0.2,1.8-0.2c4.5,0-5.8,6.8-8.6,7.8c-6.9,2.3-10.3,9.1-17.8,9.5c-16.7,0.9-4.5,5.3-13.7,9.5
					c-3.9,1.8-9.4-0.3-4.7,5.1c3,3.4-0.5,2.3-1.2,4.6c-0.9,0.1-0.8,1-1.1,1c0,2.7-2.7,3-5.6,3c-0.7,0-1.5,0-2.2,0
					c-2.3,0-4.2,0.2-4.6,1.7c-2.3,9.2-4.6,3.5-10.9,7.8c-3,0-3.6-0.9-5.2-0.9c-0.9,0-2.2,0.3-4.5,1.3c-1.6,0.7-3,1.1-4,1.1
					c-2.2,0-2.7-1.7-0.3-5c1.8-2.4,5.3-11.6,1.3-12.9c-3.3-1.1-6.3-2.1-9.5-2.1c-1.5,0-3,0.2-4.7,0.7c-7.6,2.3-8.7,10.2-16.8,10.2
					c-0.7,0-2.7,0.8-2,1.3c-3.7,4.2-1.3,6.3-8.9,7.2c-6,0.8-7,1.9-6.7,7.6c0.6,11.7-4.8,8.2-14.4,14.1c-2.9,1.8-5.8,3.3-8.2,3.3
					c-2.3,0-4.2-1.4-5.2-5.2c-1.8-6.9-1.6-10.2-3.8-10.2c-1.6,0-4.3,1.6-9.8,4.6c-2.1,0.7-3.9,1-5.4,1c-9.1,0-8.8-10.9-16.2-10.9
					c-1.5,0-3.3,0.4-5.6,1.5c-5.8,2.7-10,4.2-12.8,4.2c-4.6,0-5.9-3.8-5.9-12.2c0-5.5-1.2-12.3-3-17.7c-0.6-1.9-2.3-2.7-4.5-2.7
					c-7.2,0-20.5,8.2-24.5,9.3c-0.6,0.2-1.2,0.3-1.7,0.3c-4.5,0-4.7-6.4-9.7-7l-1,4.6l-7.5,1.9l-4.9-1.5c-3.2,0-4.8-1-7-1
					c-1.3,0-2.7,0.3-4.7,1.4c-2.2,1.2-5.1,3-7.8,3c-1.4,0-2.7-0.5-3.8-1.9c-3.9-5.1,0.6-14.1-8.6-14.1c-1.2,0-2.5,0.1-4.2,0.5
					c-4,0.8-6.1,1.1-7.8,1.1c-2.4,0-4.2-0.5-9.4-1.2c-12.6-1.5-8.4-4.5-17.5-9.1c-3.7-1.8-7.1-1.6-10.4-4.4c-1.6-1.3-3-2-4.3-2
					c-2.1,0-4,1.6-5.9,4.2c-1.5,2-2.5,2.7-3.3,2.7c-1.7,0-2.9-3-6.1-3.7c-0.8-2.9,0.3-5.8,0-9c0.6-2.4,1.1-5.4-0.9-7.1
					c-3.8-3-3.8-1-3.8-6.6c0-2.7-1.5-2.9-2.3-5c-0.7-1.9,1.6-5.1,3.9-5.2c3.8-0.3,0.7-5.2,2-7.3c1.6-2.6,2.1-9.8,0.4-12.2
					c0-3.9-8.8-5.6-9.6-8.7c-0.9-3.5,9.8-3.9,12-4.4c13.7-3.2,5.2-14.2,13.1-19.1c5.1-3.2,5.4-10.7,2.2-15.7l9.2-3.3
					c3.7,1.4,3.7,5.1,6.8,6.4c0.2,0.1,0.5,0.1,0.9,0.1c3,0,10.7-2.6,14.6-2.6c1.5,0,2.4,0.4,2.4,1.4c0,4.1,0.9,5.1,2.6,5.1
					c1.4,0,3.3-0.6,5.6-0.6c1,0,2.1,0.1,3.3,0.5c1.8,0.5,2.3,2.3,4.5,2.6c0.4,0.1,0.8,0.1,1.3,0.1c2.4,0,4.8-0.8,7.4-0.8
					c0.6,0,1.1,0,1.7,0.1c1.5,0.3,3.8,1.4,5.6,1.4c1.2,0,2.1-0.6,2.2-2.4c0.2-3.7-2.7-7.8,2.3-9.6c10.3,0.8,10.5,6,18.3,9.1
					c0.3,0.1,0.6,0.2,1,0.2c3.5,0,11.2-4.1,13.4-5.9c3.1-2.5-4.9-8.7,0.4-8.7c0.1,0,0.1,0,0.2,0c0,0,0.1,0,0.1,0
					c3.9,0,13.9-4.9,15.2-8.3c1.8-4.6,2.2-1.2,5.7-3.8c3.2-2.4,2.5-4.5,8-4.5c7.1,0-0.7-5.1,0.1-7.5c0.3-0.8,3.3-3,4.1-4
					c1.3-1.6,3-3.3,3-5.3c1.3-7.3-4.1-11.8-9.3-16.7c-4.8-4.5,2.1-8.8,5.4-12.4c2.1-2.4,3.5-4.3,5.6-4.3c0.8,0,1.7,0.3,2.9,1
					c0.4,0.2,0.8,0.3,1.4,0.3C1058.4,118.3,1064,114.9,1067.9,114.9 M1067.9,112.9L1067.9,112.9c-2.4,0-5.1,1-7.7,2
					c-1.9,0.7-3.8,1.4-4.9,1.4c-0.2,0-0.3,0-0.3,0c-1.4-0.9-2.7-1.3-3.9-1.3c-2.7,0-4.4,2-6.3,4c-0.3,0.3-0.5,0.6-0.8,0.9
					c-0.6,0.6-1.3,1.3-2.1,2.1c-2.6,2.4-5.4,5.1-5.4,8.4c0,1.7,0.8,3.3,2.3,4.7l0.8,0.7c4.8,4.5,9,8.3,7.9,14.1l0,0.2v0.2
					c0,1-1.1,2.3-2,3.4c-0.2,0.2-0.3,0.4-0.5,0.6c-0.2,0.3-1,0.9-1.5,1.4c-1.7,1.5-2.6,2.3-2.9,3.2c-0.6,1.8,0.6,3.6,1.7,5.1
					c0.2,0.3,0.5,0.6,0.7,1c-0.2,0-0.4,0-0.6,0c-4.3,0-5.8,1.3-7.4,3.1c-0.5,0.6-1,1.2-1.9,1.8c-1,0.7-1.4,0.8-2,0.8
					c-2.2,0-3.2,1-4.4,4c-0.9,2.3-9.8,7-13.3,7l-0.1,0c-0.1,0-0.2,0-0.3,0c-1.7,0-2.8,0.5-3.4,1.5c-1,1.6-0.1,3.4,0.8,5
					c0.4,0.7,1.1,2.1,1,2.6c-2.1,1.7-9.3,5.5-12.1,5.5c-0.2,0-0.3,0-0.3,0c-2.8-1.1-4.4-2.5-6.2-4c-2.8-2.4-5.8-4.8-12.7-5.3l-0.4,0
					l-0.4,0.2c-5.1,1.9-4.4,6-3.9,8.7c0.2,1,0.3,1.9,0.3,2.7c0,0.3,0,0.4-0.1,0.5c0,0-0.1,0-0.1,0c-0.7,0-1.8-0.4-2.8-0.7
					c-0.8-0.3-1.6-0.5-2.4-0.7c-0.7-0.1-1.3-0.2-2-0.2c-1.4,0-2.8,0.2-4.1,0.4c-1.2,0.2-2.2,0.4-3.3,0.4c-0.4,0-0.7,0-1-0.1
					c-0.6-0.1-0.9-0.3-1.5-0.9c-0.6-0.6-1.4-1.3-2.7-1.6c-1.3-0.4-2.5-0.6-3.9-0.6c-1.5,0-2.8,0.2-3.8,0.4c-0.7,0.1-1.3,0.2-1.8,0.2
					c-0.1,0-0.2,0-0.2,0c-0.1-0.2-0.4-0.9-0.4-3.1c0-0.8-0.3-3.4-4.4-3.4c-2.3,0-5.5,0.8-8.6,1.5c-2.3,0.6-4.8,1.1-5.9,1.1
					c-0.1,0-0.2,0-0.2,0c-0.8-0.4-1.3-1.1-2.1-2.2c-1-1.4-2.2-3.2-4.7-4.2l-0.7-0.3l-0.7,0.3l-9.2,3.3l-2.4,0.9l1.3,2.1
					c1.6,2.5,2.2,5.7,1.6,8.4c-0.3,1.4-1.1,3.3-3.1,4.5c-4.2,2.6-4.7,6.7-5.1,9.9c-0.5,4.3-0.9,7.4-7.4,8.9c-0.3,0.1-1.2,0.2-2,0.3
					c-5,0.6-9.3,1.3-10.9,3.7c-0.6,0.9-0.8,1.9-0.5,2.9c0.6,2.3,2.9,3.6,5.4,5c1.6,0.9,4.1,2.3,4.1,3.3v0.7l0.4,0.5
					c1.1,1.5,0.8,7.9-0.5,10c-0.9,1.4-0.7,3.1-0.5,4.6c0.1,0.5,0.2,1.4,0.1,1.8c0,0-0.1,0-0.1,0c-1.8,0.1-3.7,1.4-4.9,3.2
					c-1,1.6-1.3,3.3-0.8,4.7c0.4,1.1,1,1.8,1.4,2.4c0.5,0.7,0.7,1,0.7,1.9v0.2c0,4.1,0,5.1,2.5,6.6c0.5,0.3,1.2,0.7,2.1,1.4
					c0.9,0.7,1,2.3,0.3,5l-0.1,0.4l0,0.4c0.1,1.2,0,2.3-0.1,3.5c-0.2,1.8-0.4,3.7,0.2,5.8l0.3,1.1l1.2,0.3c1.2,0.3,2,1,2.9,1.8
					c1,0.9,2,1.9,3.6,1.9c2.1,0,3.7-1.8,5-3.6c1.6-2.3,3.1-3.4,4.3-3.4c0.9,0,1.9,0.5,3,1.5c2.4,2,4.7,2.7,6.9,3.3
					c1.3,0.4,2.6,0.7,3.9,1.4c3.3,1.6,4.6,3,5.8,4.2c2.5,2.5,4.4,4.1,12.3,5c2.1,0.3,3.7,0.5,4.9,0.7c1.8,0.3,3.2,0.5,4.7,0.5
					c1.9,0,4-0.3,8.2-1.1c1.5-0.3,2.7-0.4,3.8-0.4c3.8,0,4.1,1.4,4.6,5.6c0.3,2.5,0.6,5.3,2.4,7.7c1.4,1.8,3.2,2.7,5.4,2.7
					c2.8,0,5.6-1.5,7.8-2.7c0.3-0.2,0.6-0.3,0.9-0.5c2-1,3.1-1.2,3.8-1.2c0.8,0,1.5,0.2,2.4,0.4c1.1,0.3,2.5,0.6,4.3,0.6l4.6,1.4
					l0.5,0.2l0.5-0.1l7.5-1.9l1.2-0.3l0.3-1.2l0.5-2.4c0.6,0.5,1.2,1.3,1.9,2.2c1.3,1.8,3,4.1,6.3,4.1c0.7,0,1.5-0.1,2.3-0.3
					c1.5-0.4,3.7-1.5,6.6-2.9c5.5-2.7,12.9-6.3,17.4-6.3c2.1,0,2.4,0.9,2.6,1.3c1.8,5.4,2.9,11.9,2.9,17c0,5,0,14.2,7.9,14.2
					c3,0,7-1.3,13.7-4.4c1.9-0.9,3.5-1.3,4.8-1.3c2.4,0,3.6,1.5,5.6,4.2c2.2,3,4.9,6.7,10.6,6.7c1.8,0,3.8-0.4,6-1.1l0.2-0.1
					l0.2-0.1l0.6-0.4c3.8-2.1,6.8-3.8,8-4c0.3,0.6,0.6,2.1,0.9,3.5c0.3,1.4,0.6,3.1,1.2,5.1c1.4,5.6,4.7,6.7,7.1,6.7
					c3,0,6.2-1.7,9.2-3.6c2.8-1.7,5.2-2.6,7.3-3.3c5.3-1.9,8.5-3.5,8-12.5c-0.1-2.4,0-3.6,0.5-4.2c0.6-0.7,2.7-1.1,4.5-1.3
					c5.6-0.7,6.9-2.1,8.3-4.9c0.4-0.9,0.9-1.8,1.9-3l0.5-0.6c0,0,0,0,0.1,0c5.3,0,8.2-3,10.8-5.6c1.9-2,3.7-3.8,6.6-4.7
					c1.4-0.4,2.7-0.6,4.1-0.6c2.8,0,5.5,0.9,8.7,2l0.2,0.1c0.1,0,0.2,0.1,0.3,0.4c0.7,2.2-1.4,7.6-2.7,9.4c-1.9,2.6-2.5,4.7-1.7,6.3
					c0.4,0.7,1.3,1.9,3.6,1.9c1.3,0,3-0.4,4.8-1.2c1.8-0.8,3.1-1.2,3.8-1.2c0.3,0,0.6,0.1,1.1,0.2c0.8,0.3,2,0.6,4.1,0.6h0.6
					l0.5-0.3c2-1.4,3.5-1.5,4.8-1.6c3.5-0.3,5.4-1.4,6.9-7.2c0.2-0.1,0.9-0.3,2.7-0.3c0.4,0,0.7,0,1.1,0c0.4,0,0.8,0,1.1,0
					c2,0,6.9,0,7.5-4.2l0.7-0.1l0.3-1.2c0-0.1,0.1-0.2,0.6-0.4c0.6-0.3,1.6-0.9,1.9-2.3c0.2-1.4-0.6-2.7-1.6-3.8
					c-0.3-0.4-0.5-0.7-0.7-0.9c0.1,0,0.2,0,0.3,0c1.3-0.2,2.9-0.4,4.4-1.1c4.7-2.1,5.1-4.7,5.2-7c0-0.9,0-0.9,0.3-1.1
					c0.7-0.4,2.6-1,7.5-1.3c4.9-0.3,8.2-2.9,11.4-5.4c2.2-1.7,4.3-3.4,6.9-4.3c0.8-0.3,11.7-5.5,11.1-9.5c-0.1-0.5-0.5-2.2-3.1-2.2
					c-0.6,0-1.3,0.1-2.1,0.2c-1.3,0.3-3.3,0.5-5,0.5c-1.5,0-2.2-0.2-2.5-0.3c-0.1-0.9-0.6-1.9-1.5-3.5c-0.5-0.9-1.5-2.8-1.7-3.7
					c0.5,0,1.3,0.1,2.8,0.6c2.4,0.7,8.2,2.2,12.3,2.2c2.4,0,4.1-0.5,5.2-1.4l0.4-0.3l0.2-0.5l1.6-4.3l0-0.1c0.3-0.5,1.9-1.4,2.6-1.8
					c0.5-0.3,1-0.6,1.3-0.8c0.9-0.6,1.4-1.4,1.9-2.1c0.3-0.5,0.6-0.9,0.9-1.2c1.1-0.9,2.2-1.3,3.4-1.3c1.1,0,2.2,0.3,3.6,0.7
					c1.2,0.3,2.6,0.7,4.1,0.8c0.2,0,0.5,0,0.8,0c0.6,0,6.4-0.1,7.3-3.1c0.2-0.8,0.3-2.3-1.8-3.7c-0.1,0-8.1-4.8-10.1-4.8l-0.1,0
					l-0.2,0c-2,0.2-3.3,0.3-4.2,0.3c-2.2,0-2.8,0-3.5-4.4c-0.2-1.3-0.4-3.1,0.4-4.1c0.8-1.1,2.6-1.3,4.3-1.5c2.1-0.3,5-0.6,5.3-3.4
					c0.1-1.1-0.3-1.9-0.8-2.4c0.3-0.2,0.6-0.4,0.8-0.7c0.4-0.5,0.8-1.3,0.6-2.6l-1.3-38.9l0-1.5l-1.5-0.4l-23-5.8l-0.2,0l-0.2,0
					c-0.6,0-0.9-0.3-1.6-1.1c-0.1-0.2-0.3-0.3-0.4-0.5c-0.6-0.6-1.4-1.4-2.7-1.8c-0.8-0.3-1.7-0.4-2.7-0.4c-0.9,0-1.8,0.1-2.6,0.2
					c-0.7,0.1-1.4,0.2-2.1,0.2l-0.2,0c-0.4,0-0.6,0-0.9-0.1c-0.6-0.1-1.1-0.5-1.8-0.9c-0.9-0.6-2-1.2-3.3-1.4
					c-6.3-0.9-7.5-4.5-9.3-9.6c-0.5-1.5-1.1-3.1-1.8-4.6c-1.4-3.1-3.8-4.7-7.1-4.7c-1.9,0-3.8,0.5-5.7,1c-1.2,0.3-2.3,0.6-3.3,0.7
					c0,0-0.1,0-0.1,0c-0.1,0-0.5-0.3-0.8-0.6c-0.8-0.7-2-1.9-3.9-1.9c-0.3,0-0.6,0-0.9,0.1c-3.4,0.6-5.9,2-8.3,3.3
					c-2.8,1.6-5.3,2.9-8.8,2.9c-0.7,0-1.5,0-2.2,0c-0.7,0-1.4,0-2,0c-4.9,0-8-0.6-10.5-3.7c-1.7-2.2-1.9-6.3-2.2-10.3
					c-0.4-7.1-0.9-15.9-10.8-15.9c-2,0-4.3,0.4-7,1.1c-1.4,0.4-2.6,0.6-3.6,0.6c-0.8,0-1.6-0.1-2.4-0.2c-1.1-0.2-2.4-0.4-4.2-0.4
					c-1.6,0-2-0.6-2.8-2.6c-0.2-0.4-0.3-0.8-0.5-1.1c-0.7-1.5-2.3-2.3-4.6-2.3c-1.5,0-3.1,0.3-4.6,0.6c-1.1,0.2-2.2,0.4-2.9,0.4
					c-0.2,0-0.2,0-0.2,0c-0.7-0.1-1.4-0.2-2.1-0.2c-1.7,0-3,0.4-4.4,1c-0.3,0.1-0.5,0.2-0.8,0.3c-2.1,0.7-3.9,1.9-5.6,2.9
					c-1.1,0.7-2.1,1.3-3.1,1.8l-0.2,0.1l-0.2,0.1c-1,0.8-1.9,1.1-2.6,1.1c-1.7,0-3.3-2.5-4.9-4.9c-2.1-3.2-4.4-6.7-8.3-6.9
					c-0.1,0-0.3,0-0.5,0c-0.7,0-1.5,0.1-2.2,0.1c-0.7,0.1-1.3,0.1-2,0.1c-1.6,0-2.2-0.3-2.6-0.9c-0.6-0.8-0.7-1.9-0.8-3.2
					c-0.2-2.1-0.5-5-3.7-6.8c-1.8-1-11.8-2.9-14.6-2.9c-0.4,0-0.7,0-1,0.1l-0.3,0.1l-0.3,0.2c-3.4,2-4,4.3-4.5,6
					c-0.3,1.1-0.5,1.6-1.1,2.1c-0.3-0.5-0.6-1.6-0.9-3.3c-0.1-0.4-0.1-0.7-0.2-0.9C1073.1,114.6,1071,112.9,1067.9,112.9
					L1067.9,112.9L1067.9,112.9z"/>
			</g>
		</g>
	</g>
</g>
</svg>
