<svg width="80" height="81" viewBox="0 0 80 81" fill="none" xmlns="http://www.w3.org/2000/svg">
<g clip-path="url(#clip0)">
<path d="M72.3906 12.1424C72.875 11.7205 72.9375 10.9862 72.5157 10.4862C72.0938 10.0018 71.3594 9.9393 70.8594 10.3612L68.3438 12.5174C67.8594 12.9393 67.7969 13.6737 68.2188 14.1737C68.4532 14.4393 68.7813 14.5799 69.1094 14.5799C69.375 14.5799 69.6563 14.4862 69.875 14.2987L72.3906 12.1424Z" fill="#0060BA"/>
<path d="M67.2813 36.3768V37.8143C67.2813 38.4549 67.8125 38.9861 68.4532 38.9861C69.0938 38.9861 69.625 38.4549 69.625 37.8143V36.3768C69.625 35.7361 69.0938 35.2049 68.4532 35.2049C67.7969 35.2049 67.2813 35.7205 67.2813 36.3768Z" fill="#0060BA"/>
<path d="M38.2969 18.3924H43.75C44.3907 18.3924 44.9219 17.8611 44.9219 17.2205C44.9219 16.5799 44.3907 16.0486 43.75 16.0486H38.2969C37.6563 16.0486 37.125 16.5799 37.125 17.2205C37.125 17.8611 37.6407 18.3924 38.2969 18.3924Z" fill="#0060BA"/>
<path d="M13.9688 15.1737H17.4375C18.875 15.1737 20.0313 14.0018 20.0313 12.5799V11.4705L31.125 12.658V19.3299C31.125 20.8143 32.3281 22.0174 33.7969 22.0174H35.8438L30.4063 64.0643H28.9375C27.9375 64.0643 27.1094 64.8768 27.1094 65.8924V70.9549H24.875C23.6563 70.9549 22.6719 71.9393 22.6719 73.158V77.8455H25.0156V73.2987H56.9844V77.8299H59.3281V73.1424C59.3281 71.9237 58.3438 70.9393 57.125 70.9393H54.8906V65.8768C54.8906 64.8768 54.0781 64.0487 53.0625 64.0487H51.5938L46.1563 22.0018H48.2031C49.6875 22.0018 50.875 20.7987 50.875 19.3143V14.783L63.3906 16.1268V50.8768C63.3906 51.2987 63.6094 51.6737 63.9844 51.8924C64.3438 52.0955 64.7969 52.1112 65.1563 51.8924C68.625 49.8924 71.4063 46.7205 73.4375 42.4862C73.7188 41.908 73.4688 41.2049 72.8906 40.9237C72.3125 40.6424 71.6094 40.8924 71.3281 41.4705C69.875 44.5174 68 46.9237 65.75 48.6737V11.033L73.2969 4.59554C75.6094 17.9705 75.5 28.9393 72.9688 37.2049C72.7813 37.8299 73.125 38.4705 73.75 38.6737C74.375 38.8612 75.0313 38.5174 75.2188 37.8924C77.8906 29.1268 77.9844 17.5643 75.5 3.51741C75.375 2.82991 74.8906 2.25179 74.2344 2.01741C73.5781 1.78304 72.8281 1.92366 72.2969 2.37679L64.2656 9.23616L30.1406 2.57991C29.5 2.45491 28.8906 2.87679 28.7656 3.50179C28.6406 4.14241 29.0625 4.75179 29.6875 4.87679L63.4219 11.4549V13.7674C61.5469 13.5643 10 8.03304 8.26563 7.84554L8.54688 7.32991C10.5 3.78304 14.4844 1.90804 18.4688 2.68929L25 3.97054C25.6406 4.09554 26.25 3.67366 26.375 3.04866C26.5 2.40804 26.0781 1.79866 25.4531 1.67366L18.9063 0.392411C13.9219 -0.576339 8.9375 1.75179 6.48438 6.20491L5.35938 8.25179C5.17188 8.59554 5.17188 9.01741 5.34375 9.36116C5.53125 9.70491 5.85938 9.93929 6.25 9.98616L10 10.3924V12.5799C10 14.0174 11.1719 15.1737 12.5938 15.1737H13.8281H13.9688ZM17.7031 12.5799C17.7031 12.7205 17.5938 12.8299 17.4531 12.8299H12.625C12.4844 12.8299 12.375 12.7205 12.375 12.5799V10.6424L17.7031 11.2205V12.5799ZM35.6875 41.5955L45.1406 46.158L34.5 50.7362L35.6875 41.5955ZM37.9063 24.5174L38.2188 22.0799H40.7031L37.9063 24.5174ZM43.8594 22.4237L45.0156 31.3143L38.5 27.0955L43.8594 22.4237ZM44.0469 33.4862L36.1875 37.8299L37.3125 29.1268L44.0469 33.4862ZM34.0625 54.1268L46.7813 59.0643L37.6406 64.033L37.625 64.0487H32.7813L34.0625 54.1268ZM52.5625 66.3924V70.9393H29.4688V66.3924H52.5625ZM49.25 64.0487H42.5313L48.8125 60.6424L49.25 64.0487ZM48.3594 57.158L36.3438 52.5018L47.1406 47.8455L48.3594 57.158ZM46.7031 44.3143L37.4063 39.8299L45.5469 35.3455L46.7031 44.3143ZM48.2188 19.658H33.7969C33.6094 19.658 33.4688 19.5018 33.4688 19.3143V12.908L48.5469 14.533V19.3299C48.5625 19.5018 48.4063 19.658 48.2188 19.658Z" fill="#0060BA"/>
<path d="M12.5625 60.58C11.3438 59.3612 9.35938 59.3612 8.14063 60.58C6.92187 61.7987 6.92187 63.7831 8.14063 65.0018C9.35938 66.2206 11.3438 66.2206 12.5625 65.0018C13.7813 63.7831 13.7813 61.7987 12.5625 60.58ZM10.9063 63.3456C10.5938 63.6581 10.0938 63.6581 9.79688 63.3456C9.48438 63.0331 9.48438 62.5331 9.79688 62.2362C10.1094 61.9237 10.5938 61.9237 10.9063 62.2362C11.2188 62.5331 11.2188 63.0331 10.9063 63.3456Z" fill="#B29D8A"/>
<path d="M21.75 51.3925C20.5312 50.1737 18.5468 50.1737 17.3281 51.3925C16.1093 52.6112 16.1093 54.5956 17.3281 55.8143C18.5468 57.0331 20.5312 57.0331 21.75 55.8143C22.9687 54.5956 22.9687 52.6112 21.75 51.3925ZM20.0937 54.1581C19.7812 54.4706 19.2812 54.4706 18.9843 54.1581C18.6718 53.8456 18.6718 53.3456 18.9843 53.0487C19.2968 52.7362 19.7968 52.7362 20.0937 53.0487C20.25 53.205 20.3281 53.4081 20.3281 53.6112C20.3281 53.8143 20.25 54.0018 20.0937 54.1581Z" fill="#B29D8A"/>
<path d="M13.6094 56.6425C13.1562 57.0956 13.1562 57.8456 13.6094 58.2987L14.8438 59.5331C15.0781 59.7675 15.375 59.8768 15.6719 59.8768C15.9688 59.8768 16.2656 59.7675 16.5 59.5331C16.9531 59.08 16.9531 58.33 16.5 57.8768L15.2656 56.6425C14.8125 56.1737 14.0781 56.1737 13.6094 56.6425Z" fill="#B29D8A"/>
<path d="M78.9375 77.83H18.6562L15.2031 67.2206L24.5937 57.83C27.1562 55.2675 27.1562 51.1112 24.5937 48.5487C22.3125 46.2675 18.8281 46.0487 16.3125 47.7206V15.1737H13.9687V49.8925L9.14061 54.7206C8.68748 55.1737 8.68748 55.9237 9.14061 56.3768C9.59373 56.83 10.3437 56.83 10.7969 56.3768L16.9687 50.205C18.6094 48.5643 21.2812 48.5643 22.9375 50.205C24.5781 51.8456 24.5781 54.5175 22.9375 56.1737L13.1562 65.955C11.5156 67.5956 8.84373 67.5956 7.20311 65.955C5.56248 64.3143 5.56248 61.6425 7.20311 60.0018L7.48436 59.7206C7.93748 59.2675 7.93748 58.5175 7.48436 58.0643C7.03123 57.6112 6.28123 57.6112 5.82811 58.0643L5.54686 58.3456C2.98436 60.9081 2.98436 65.0643 5.54686 67.6268C5.78123 67.8456 6.01561 68.0643 6.26561 68.2518L3.12498 77.83H1.28123C0.64061 77.83 0.10936 78.3612 0.10936 79.0018C0.10936 79.6425 0.64061 80.1737 1.28123 80.1737H78.9375C79.5781 80.1737 80.1094 79.6425 80.1094 79.0018C80.1094 78.3612 79.5781 77.83 78.9375 77.83ZM5.59373 77.83L8.37498 69.2831C8.96873 69.455 9.56248 69.5331 10.1719 69.5331C11.2344 69.5331 12.2812 69.2831 13.2344 68.7831L16.1875 77.8456H5.59373V77.83Z" fill="#B29D8A"/>
</g>
<defs>
<clipPath id="clip0">
<rect width="80" height="80" fill="white" transform="translate(0 0.173706)"/>
</clipPath>
</defs>
</svg>
