^C:\USERS\ARMAN\SOURCE\REPOS\POCO_EXAMPLE\POCO_EXAMPLE\DEBUG\SOURCE.OBJ
C:\USERS\ARMAN\SOURCE\REPOS\POCO_EXAMPLE\DEBUG\POCO_EXAMPLE.EXE
C:\USERS\ARMAN\SOURCE\REPOS\POCO_EXAMPLE\POCO_EXAMPLE\DEBUG\POCO_EXAMPLE.ILK
C:\USERS\ARMAN\SOURCE\REPOS\POCO_EXAMPLE\DEBUG\POCO_EXAMPLE.PDB
