module github.com/rancher/k3s

go 1.15

replace (
	github.com/Microsoft/hcsshim => github.com/Microsoft/hcsshim v0.8.9
	github.com/benmoss/go-powershell => github.com/k3s-io/go-powershell v0.0.0-20201118222746-51f4c451fbd7
	github.com/containerd/btrfs => github.com/containerd/btrfs v0.0.0-20201111183144-404b9149801e
	github.com/containerd/cgroups => github.com/containerd/cgroups v0.0.0-20200710171044-318312a37340
	github.com/containerd/console => github.com/containerd/console v1.0.0
	github.com/containerd/containerd => github.com/k3s-io/containerd v1.4.4-k3s1
	github.com/containerd/continuity => github.com/k3s-io/continuity v0.0.0-20210309170710-f93269e0d5c1
	github.com/containerd/cri => github.com/k3s-io/cri v1.4.0-k3s.5 // k3s-release/1.4
	github.com/containerd/fifo => github.com/containerd/fifo v0.0.0-20200410184934-f15a3290365b
	github.com/containerd/go-runc => github.com/containerd/go-runc v0.0.0-20200220073739-7016d3ce2328
	github.com/containerd/ttrpc => github.com/containerd/ttrpc v1.0.1
	github.com/containerd/typeurl => github.com/containerd/typeurl v1.0.1
	github.com/coreos/flannel => gitlab.com/arm-research/smarter/p2p/flannel v0.12.0-k3sibr1.1
	github.com/coreos/go-systemd => github.com/coreos/go-systemd v0.0.0-20190321100706-95778dfbb74e
	github.com/docker/distribution => github.com/docker/distribution v2.7.1-0.20190205005809-0d3efadf0154+incompatible
	github.com/docker/docker => github.com/docker/docker v17.12.0-ce-rc1.0.20200310163718-4634ce647cf2+incompatible
	github.com/docker/libnetwork => github.com/docker/libnetwork v0.8.0-dev.2.0.20190624125649-f0e46a78ea34
	github.com/golang/protobuf => github.com/golang/protobuf v1.3.5
	github.com/juju/errors => github.com/k3s-io/nocode v0.0.0-20200630202308-cb097102c09f
	github.com/kubernetes-sigs/cri-tools => github.com/k3s-io/cri-tools v1.20.0-k3s1
	github.com/matryer/moq => github.com/rancher/moq v0.0.0-20190404221404-ee5226d43009
	github.com/moby/sys/mountinfo => github.com/moby/sys/mountinfo v0.1.3
	github.com/opencontainers/runc => github.com/opencontainers/runc v1.0.0-rc92
	github.com/opencontainers/runtime-spec => github.com/opencontainers/runtime-spec v1.0.3-0.20200728170252-4d89ac9fbff6
	go.etcd.io/etcd => github.com/k3s-io/etcd v0.5.0-alpha.5.0.20201208200253-50621aee4aea
	golang.org/x/crypto => golang.org/x/crypto v0.0.0-20201002170205-7f63de1d35b0
	golang.org/x/net => golang.org/x/net v0.0.0-20201110031124-69a78807bb2b
	golang.org/x/sys => golang.org/x/sys v0.0.0-20201112073958-5cba982894dd
	google.golang.org/genproto => google.golang.org/genproto v0.0.0-20200224152610-e50cd9704f63
	google.golang.org/grpc => google.golang.org/grpc v1.27.1
	gopkg.in/square/go-jose.v2 => gopkg.in/square/go-jose.v2 v2.2.2
	k8s.io/api => github.com/k3s-io/kubernetes/staging/src/k8s.io/api v1.20.5-k3s1
	k8s.io/apiextensions-apiserver => github.com/k3s-io/kubernetes/staging/src/k8s.io/apiextensions-apiserver v1.20.5-k3s1
	k8s.io/apimachinery => github.com/k3s-io/kubernetes/staging/src/k8s.io/apimachinery v1.20.5-k3s1
	k8s.io/apiserver => github.com/k3s-io/kubernetes/staging/src/k8s.io/apiserver v1.20.5-k3s1
	k8s.io/cli-runtime => github.com/k3s-io/kubernetes/staging/src/k8s.io/cli-runtime v1.20.5-k3s1
	k8s.io/client-go => github.com/k3s-io/kubernetes/staging/src/k8s.io/client-go v1.20.5-k3s1
	k8s.io/cloud-provider => github.com/k3s-io/kubernetes/staging/src/k8s.io/cloud-provider v1.20.5-k3s1
	k8s.io/cluster-bootstrap => github.com/k3s-io/kubernetes/staging/src/k8s.io/cluster-bootstrap v1.20.5-k3s1
	k8s.io/code-generator => github.com/k3s-io/kubernetes/staging/src/k8s.io/code-generator v1.20.5-k3s1
	k8s.io/component-base => github.com/k3s-io/kubernetes/staging/src/k8s.io/component-base v1.20.5-k3s1
	k8s.io/component-helpers => github.com/k3s-io/kubernetes/staging/src/k8s.io/component-helpers v1.20.5-k3s1
	k8s.io/controller-manager => github.com/k3s-io/kubernetes/staging/src/k8s.io/controller-manager v1.20.5-k3s1
	k8s.io/cri-api => github.com/k3s-io/kubernetes/staging/src/k8s.io/cri-api v1.20.5-k3s1
	k8s.io/csi-translation-lib => github.com/k3s-io/kubernetes/staging/src/k8s.io/csi-translation-lib v1.20.5-k3s1
	k8s.io/kube-aggregator => github.com/k3s-io/kubernetes/staging/src/k8s.io/kube-aggregator v1.20.5-k3s1
	k8s.io/kube-controller-manager => github.com/k3s-io/kubernetes/staging/src/k8s.io/kube-controller-manager v1.20.5-k3s1
	k8s.io/kube-proxy => github.com/k3s-io/kubernetes/staging/src/k8s.io/kube-proxy v1.20.5-k3s1
	k8s.io/kube-scheduler => github.com/k3s-io/kubernetes/staging/src/k8s.io/kube-scheduler v1.20.5-k3s1
	k8s.io/kubectl => github.com/k3s-io/kubernetes/staging/src/k8s.io/kubectl v1.20.5-k3s1
	k8s.io/kubelet => github.com/k3s-io/kubernetes/staging/src/k8s.io/kubelet v1.20.5-k3s1
	k8s.io/kubernetes => github.com/k3s-io/kubernetes v1.20.5-k3s1
	k8s.io/legacy-cloud-providers => github.com/k3s-io/kubernetes/staging/src/k8s.io/legacy-cloud-providers v1.20.5-k3s1
	k8s.io/metrics => github.com/k3s-io/kubernetes/staging/src/k8s.io/metrics v1.20.5-k3s1
	k8s.io/mount-utils => github.com/k3s-io/kubernetes/staging/src/k8s.io/mount-utils v1.20.5-k3s1
	k8s.io/node-api => github.com/k3s-io/kubernetes/staging/src/k8s.io/node-api v1.20.5-k3s1
	k8s.io/sample-apiserver => github.com/k3s-io/kubernetes/staging/src/k8s.io/sample-apiserver v1.20.5-k3s1
	k8s.io/sample-cli-plugin => github.com/k3s-io/kubernetes/staging/src/k8s.io/sample-cli-plugin v1.20.5-k3s1
	k8s.io/sample-controller => github.com/k3s-io/kubernetes/staging/src/k8s.io/sample-controller v1.20.5-k3s1
	mvdan.cc/unparam => mvdan.cc/unparam v0.0.0-20190209190245-fbb59629db34
)

require (
	github.com/NYTimes/gziphandler v1.1.1 // indirect
	github.com/bronze1man/goStrongswanVici v0.0.0-20190828090544-27d02f80ba40 // indirect
	github.com/containerd/cgroups v0.0.0-20200710171044-318312a37340
	github.com/containerd/containerd v1.5.0-beta.4
	github.com/containerd/cri v1.11.1-0.20200820101445-b0cc07999aa5
	github.com/containerd/fuse-overlayfs-snapshotter v1.0.2
	github.com/coreos/flannel v0.12.0
	github.com/coreos/go-iptables v0.4.5
	github.com/coreos/go-systemd v0.0.0-20190719114852-fd7a80b32e1f
	github.com/docker/docker v20.10.0-beta1.0.20201108103107-c7109494fe65+incompatible
	github.com/erikdubbelboer/gspt v0.0.0-20190125194910-e68493906b83
	github.com/frankban/quicktest v1.10.2 // indirect
	github.com/go-bindata/go-bindata v3.1.2+incompatible
	github.com/go-sql-driver/mysql v1.4.1
	github.com/google/tcpproxy v0.0.0-20180808230851-dfa16c61dad2
	github.com/google/uuid v1.2.0
	github.com/gorilla/mux v1.8.0
	github.com/gorilla/websocket v1.4.2
	github.com/k3s-io/helm-controller v0.8.3
	github.com/k3s-io/kine v0.6.0
	github.com/klauspost/compress v1.11.7
	github.com/kubernetes-sigs/cri-tools v0.0.0-00010101000000-000000000000
	github.com/lib/pq v1.8.0
	github.com/mattn/go-sqlite3 v1.14.4
	github.com/minio/minio-go/v7 v7.0.7
	github.com/natefinch/lumberjack v2.0.0+incompatible
	github.com/opencontainers/runc v1.0.0-rc92
	github.com/opencontainers/selinux v1.6.0
	github.com/pierrec/lz4 v2.5.2+incompatible
	github.com/pion/webrtc/v3 v3.0.20 // indirect
	github.com/pkg/errors v0.9.1
	github.com/rancher/dynamiclistener v0.2.3
	github.com/rancher/remotedialer v0.2.0
	github.com/rancher/wrangler v0.6.1
	github.com/rancher/wrangler-api v0.6.0
	github.com/robfig/cron/v3 v3.0.1
	github.com/rootless-containers/rootlesskit v0.14.0
	github.com/sirupsen/logrus v1.8.1
	github.com/spf13/pflag v1.0.5
	github.com/stretchr/testify v1.7.0
	github.com/tchap/go-patricia v2.3.0+incompatible // indirect
	github.com/urfave/cli v1.22.2
	go.etcd.io/etcd v0.5.0-alpha.5.0.20201208200253-50621aee4aea
	golang.org/x/crypto v0.0.0-20201221181555-eec23a3978ad
	golang.org/x/net v0.0.0-20210316092652-d523dce5a7f4
	golang.org/x/sys v0.0.0-20210119212857-b64e53b001e4
	google.golang.org/grpc v1.33.2
	gopkg.in/yaml.v2 v2.3.0
	k8s.io/api v1.20.5
	k8s.io/apimachinery v1.20.5
	k8s.io/apiserver v1.20.0
	k8s.io/client-go v11.0.1-0.20190409021438-1a26190bd76a+incompatible
	k8s.io/cloud-provider v1.20.0
	k8s.io/component-base v1.20.0
	k8s.io/controller-manager v1.20.0
	k8s.io/cri-api v1.20.0
	k8s.io/klog v1.0.0
	k8s.io/kubectl v1.20.5
	k8s.io/kubernetes v1.20.5
	sigs.k8s.io/yaml v1.2.0
)
