module github.com/kubernetes/dashboard

go 1.13

require (
	github.com/antonmedv/expr v1.8.9
	github.com/docker/distribution v2.7.1+incompatible
	github.com/emicklei/go-restful v2.12.0+incompatible
	github.com/golang/glog v0.0.0-20160126235308-23def4e6c14b
	github.com/opencontainers/go-digest v1.0.0 // indirect
	github.com/prataprc/goparsec v0.0.0-20180806094145-2600a2a4a410
	github.com/prometheus/client_golang v1.7.0
	github.com/spf13/pflag v1.0.5
	github.com/tkrajina/typescriptify-golang-structs v0.0.11 // indirect
	golang.org/x/net v0.0.0-20200602114024-627f9648deb9
	golang.org/x/text v0.3.3
	gopkg.in/igm/sockjs-go.v2 v2.1.0
	gopkg.in/square/go-jose.v2 v2.4.1
	gopkg.in/yaml.v2 v2.3.0
	k8s.io/api v0.18.4
	k8s.io/apiextensions-apiserver v0.18.4
	k8s.io/apimachinery v0.18.4
	k8s.io/client-go v0.18.4
	k8s.io/heapster v1.5.4
)
