56,1024,1347.4,1374.4,2021.2,2061.6
56,2048,2545.2,2545.2,4123.2,3817.7
56,4096,5497.6,5389.8,8084.6,8246.3
56,8192,10779.5,10180.7,15271.0,15271.0
56,16384,21559.1,21559.1,32985.3,32985.3
56,32768,43980.5,43980.5,61084.0,61084.0
56,65536,81445.3,81445.3,113742.6,119946.7
56,131072,151656.8,151656.8,227485.2,227485.2
56,262144,262569.9,262569.9,371665.9,351843.7
56,524288,469125.0,469125.0,573658.2,573658.2
56,1048576,409120.6,418861.6,420530.3,420530.3
56,2097152,437072.9,442570.7,466018.2,466018.2
56,4194304,356749.0,419485.8,291784.7,286051.8
56,8388608,201197.3,179626.7,190100.2,203133.3
56,16777216,194087.2,184000.6,198059.1,202354.4
56,33554432,204523.1,199362.5,210369.9,214634.3
56,67108864,191057.2,189004.5,204963.7,205593.8
56,134217728,82917.8,83991.0,85546.0,85931.3
56,268435456,139582.7,154289.7,119415.1,141084.3
56,536870912,149011.7,129686.8,169068.8,144645.6
56,1073741824,147916.0,136887.0,142547.2,142439.0
56,2147483648,174440.6,163758.9,150181.1,155306.2
56,4294967296,189475.8,190202.2,207597.1,206705.9
56,8589934592,181752.1,177492.4,190618.8,194371.0
