{
  "Map": [
    {
      "Cells": [
        2,
        2,
        2,
        2,
        2,
        2,
        2,
        0,
        2,
        2,
        2,
        2,
        2,
        2,
        2
      ]
    },
    {
      "Cells": [
        2,
        0,
        0,
        0,
        0,
        0,
        0,
        0,
        0,
        0,
        0,
        0,
        0,
        0,
        2
      ]
    },
    {
      "Cells": [
        2,
        0,
        0,
        0,
        0,
        0,
        0,
        0,
        0,
        0,
        0,
        0,
        0,
        0,
        2
      ]
    },
    {
      "Cells": [
        2,
        0,
        0,
        3,
        3,
        3,
        0,
        0,
        0,
        3,
        3,
        3,
        0,
        0,
        2
      ]
    },
    {
      "Cells": [
        2,
        0,
        0,
        3,
        0,
        0,
        0,
        0,
        0,
        0,
        0,
        3,
        0,
        0,
        2
      ]
    },
    {
      "Cells": [
        2,
        0,
        0,
        3,
        0,
        4,
        4,
        4,
        4,
        4,
        0,
        3,
        0,
        0,
        2
      ]
    },
    {
      "Cells": [
        2,
        0,
        0,
        0,
        0,
        4,
        0,
        0,
        0,
        4,
        0,
        0,
        0,
        0,
        2
      ]
    },
    {
      "Cells": [
        2,
        0,
        0,
        0,
        0,
        4,
        0,
        0,
        0,
        4,
        0,
        0,
        0,
        0,
        2
      ]
    },
    {
      "Cells": [
        2,
        0,
        0,
        0,
        0,
        4,
        0,
        0,
        0,
        4,
        0,
        0,
        0,
        0,
        2
      ]
    },
    {
      "Cells": [
        2,
        0,
        0,
        3,
        0,
        4,
        4,
        4,
        4,
        4,
        0,
        3,
        0,
        0,
        2
      ]
    },
    {
      "Cells": [
        2,
        0,
        0,
        3,
        0,
        0,
        0,
        0,
        0,
        0,
        0,
        3,
        0,
        0,
        2
      ]
    },
    {
      "Cells": [
        2,
        0,
        0,
        3,
        3,
        3,
        0,
        0,
        0,
        3,
        3,
        3,
        0,
        0,
        2
      ]
    },
    {
      "Cells": [
        2,
        0,
        0,
        0,
        0,
        0,
        0,
        0,
        0,
        0,
        0,
        0,
        0,
        0,
        2
      ]
    },
    {
      "Cells": [
        2,
        0,
        0,
        0,
        0,
        0,
        0,
        0,
        0,
        0,
        0,
        0,
        0,
        0,
        2
      ]
    },
    {
      "Cells": [
        2,
        2,
        2,
        2,
        2,
        2,
        2,
        0,
        2,
        2,
        2,
        2,
        2,
        2,
        2
      ]
    }
  ],
  "SpawnPoints": [
    {
      "x": 7,
      "y": 0,
      "magnitude": 7.0,
      "sqrMagnitude": 49
    },
    {
      "x": 7,
      "y": 14,
      "magnitude": 15.6524763,
      "sqrMagnitude": 245
    }
  ],
  "Size": 15
}