<svg width="100%" height="100%" version="1.2" baseProfile="tiny"
     xmlns="http://www.w3.org/2000/svg"
     xmlns:xlink="http://www.w3.org/1999/xlink">

  <desc>SVG audio example</desc>

  <audio xlink:href="audio.ogg?c3,1+C,1" audio-level="0.7" type="application/ogg"
        begin="mybutton.click" repeatCount="3"/>

  <g xml:id="mybutton">
    <rect width="150" height="50" x="20" y="20" rx="10"
      fill="#ffd" stroke="#933" stroke-width="5"/>
    <text x="95" y="55" text-anchor="middle" font-size="30"
      fill="#933">Press Me</text>
  </g>

  <rect x="0" y="0" width="190" height="90" fill="none" stroke="#777"/>

</svg>
