<?xml version="1.0" encoding="UTF-8" standalone="no"?>
<svg
   xmlns:dc="http://purl.org/dc/elements/1.1/"
   xmlns:cc="http://creativecommons.org/ns#"
   xmlns:rdf="http://www.w3.org/1999/02/22-rdf-syntax-ns#"
   xmlns:svg="http://www.w3.org/2000/svg"
   xmlns="http://www.w3.org/2000/svg"
   xmlns:sodipodi="http://sodipodi.sourceforge.net/DTD/sodipodi-0.dtd"
   xmlns:inkscape="http://www.inkscape.org/namespaces/inkscape"
   inkscape:version="1.0 (1.0+r73+1)"
   sodipodi:docname="telecom-gvt.svg"
   id="svg10"
   version="1.1"
   viewBox="0 0 39.476429 11.13795"
   height="144.45659"
   width="512">
  <metadata
     id="metadata16">
    <rdf:RDF>
      <cc:Work
         rdf:about="">
        <dc:format>image/svg+xml</dc:format>
        <dc:type
           rdf:resource="http://purl.org/dc/dcmitype/StillImage" />
        <dc:title></dc:title>
      </cc:Work>
    </rdf:RDF>
  </metadata>
  <defs
     id="defs14" />
  <sodipodi:namedview
     inkscape:current-layer="svg10"
     inkscape:window-maximized="1"
     inkscape:window-y="24"
     inkscape:window-x="0"
     inkscape:cy="72.228294"
     inkscape:cx="256"
     inkscape:zoom="3.5917969"
     fit-margin-bottom="0"
     fit-margin-right="0"
     fit-margin-left="0"
     fit-margin-top="0"
     inkscape:showpageshadow="false"
     showgrid="false"
     id="namedview12"
     inkscape:window-height="1033"
     inkscape:window-width="1920"
     inkscape:pageshadow="2"
     inkscape:pageopacity="0"
     guidetolerance="10"
     gridtolerance="10"
     objecttolerance="10"
     borderopacity="1"
     bordercolor="#666666"
     pagecolor="#ffffff" />
  <g
     transform="matrix(0.23332878,0,0,0.23332878,-1.9842279,-16.702841)"
     id="g23">
    <path
       style="clip-rule:evenodd;fill-rule:evenodd"
       id="path4"
       fill="#34358d"
       d="m 141.614,81.117 -0.985,4.418 h 12.142 l -4.202,21.147 h 8.591 l 4.01,-21.221 12.699,-0.019 0.799,-4.32 z m -32.395,0.143 0.006,0.012 0.013,0.025 0.013,0.024 0.012,0.044 0.019,0.043 0.02,0.062 0.024,0.062 0.024,0.074 0.024,0.081 0.031,0.093 0.031,0.093 0.037,0.105 0.038,0.111 0.036,0.124 0.044,0.124 0.043,0.137 0.043,0.143 0.05,0.149 0.05,0.155 0.05,0.161 0.056,0.168 0.056,0.179 0.056,0.18 0.062,0.186 0.062,0.192 0.062,0.198 0.062,0.205 0.068,0.205 0.068,0.217 0.068,0.217 0.074,0.223 0.068,0.229 0.074,0.235 0.074,0.235 0.074,0.248 0.08,0.242 0.081,0.254 0.074,0.254 0.087,0.254 0.08,0.267 0.081,0.26 0.087,0.273 0.08,0.272 0.174,0.552 0.18,0.558 0.174,0.577 0.186,0.583 0.18,0.582 0.186,0.595 0.372,1.202 0.378,1.215 0.379,1.209 0.371,1.202 0.187,0.595 0.18,0.588 0.18,0.584 0.18,0.57 0.173,0.563 0.174,0.558 0.081,0.267 0.087,0.272 0.08,0.267 0.08,0.261 0.081,0.261 0.08,0.254 0.075,0.254 0.08,0.248 0.075,0.241 0.074,0.241 0.067,0.23 0.074,0.235 0.068,0.223 0.068,0.217 0.068,0.217 0.062,0.211 0.062,0.205 0.062,0.198 0.062,0.198 0.056,0.186 0.056,0.18 0.057,0.18 0.055,0.168 0.05,0.161 0.05,0.161 0.044,0.148 0.043,0.143 0.044,0.136 0.043,0.131 0.037,0.124 0.03,0.111 0.038,0.105 0.03,0.099 0.025,0.094 0.024,0.086 0.025,0.075 0.019,0.067 0.019,0.057 0.019,0.049 0.013,0.044 0.006,0.03 0.012,0.025 v 0.013 l 0.006,0.006 4.011,-0.031 19.089,-25.857 h -8.683 l -10.915,15.506 -4.115,-15.444 h -7.47 z m -4.135,0.898 -0.606,-0.155 -0.614,-0.136 -0.613,-0.137 -0.614,-0.124 -0.619,-0.111 -0.619,-0.105 -0.62,-0.099 -0.62,-0.093 -0.62,-0.075 -0.626,-0.074 -0.626,-0.062 -0.626,-0.05 -0.625,-0.043 -0.633,-0.037 -0.632,-0.025 -0.633,-0.013 -0.638,-0.006 -0.632,0.006 -0.639,0.013 -0.645,0.025 -0.638,0.031 -0.645,0.043 -0.645,0.056 -0.645,0.062 -0.651,0.074 -0.65,0.087 -0.65,0.093 -0.657,0.111 -0.651,0.111 -0.657,0.131 -0.663,0.137 -0.657,0.148 -0.44,0.111 -0.435,0.113 -0.428,0.112 -0.421,0.118 -0.409,0.111 -0.409,0.118 -0.403,0.124 -0.39,0.124 -0.391,0.125 -0.378,0.124 -0.378,0.124 -0.372,0.13 -0.359,0.13 -0.359,0.136 -0.347,0.13 -0.347,0.137 -0.341,0.136 -0.334,0.142 -0.323,0.137 -0.321,0.143 -0.316,0.143 -0.31,0.142 -0.304,0.149 -0.298,0.143 -0.291,0.148 -0.285,0.149 -0.286,0.155 -0.272,0.149 -0.272,0.155 -0.26,0.155 -0.261,0.155 -0.254,0.155 -0.248,0.161 -0.241,0.155 -0.236,0.161 -0.229,0.161 -0.224,0.162 -0.223,0.161 -0.217,0.162 -0.205,0.167 -0.205,0.161 -0.204,0.167 -0.192,0.167 -0.186,0.167 -0.186,0.167 -0.18,0.167 -0.174,0.173 -0.167,0.168 -0.162,0.167 -0.16,0.174 -0.155,0.173 -0.148,0.174 -0.143,0.167 -0.136,0.174 -0.136,0.174 -0.13,0.173 -0.124,0.173 -0.124,0.18 -0.112,0.174 -0.111,0.173 -0.105,0.173 -0.105,0.18 -0.093,0.173 -0.093,0.174 -0.087,0.18 -0.086,0.173 -0.081,0.173 -0.074,0.18 -0.068,0.173 -0.068,0.18 -0.062,0.174 -0.056,0.18 -0.05,0.173 -0.049,0.173 -0.049,0.18 -0.038,0.174 -0.037,0.173 -0.031,0.174 -0.031,0.179 -0.025,0.173 -0.019,0.174 -0.019,0.173 -0.015,0.174 -0.006,0.174 -0.006,0.167 v 0.346 l 0.006,0.167 0.013,0.174 0.012,0.167 0.019,0.168 0.019,0.173 0.025,0.167 0.031,0.168 0.031,0.161 0.037,0.167 0.037,0.168 0.043,0.161 0.043,0.161 0.049,0.161 0.05,0.161 0.056,0.161 0.062,0.161 0.062,0.154 0.062,0.162 0.068,0.154 0.074,0.154 0.074,0.155 0.081,0.149 0.081,0.154 0.081,0.148 0.086,0.149 0.093,0.148 0.093,0.143 0.093,0.149 0.099,0.142 0.105,0.144 0.099,0.136 0.112,0.143 0.106,0.137 0.229,0.272 0.242,0.267 0.247,0.254 0.255,0.255 0.285,0.229 0.292,0.229 0.297,0.224 0.304,0.21 0.31,0.211 0.316,0.204 0.316,0.199 0.329,0.186 0.334,0.186 0.341,0.18 0.341,0.174 0.353,0.168 0.359,0.16 0.36,0.155 0.372,0.155 0.372,0.143 0.384,0.143 0.384,0.137 0.391,0.124 0.403,0.13 0.403,0.117 0.409,0.111 0.415,0.112 0.421,0.099 0.422,0.1 0.434,0.099 0.44,0.087 0.44,0.087 0.446,0.074 0.458,0.081 0.459,0.067 0.465,0.068 0.464,0.062 0.478,0.057 0.483,0.049 0.483,0.05 0.49,0.044 0.496,0.043 0.501,0.037 0.508,0.031 0.508,0.024 0.515,0.025 0.527,0.024 0.521,0.013 0.533,0.013 0.539,0.012 0.539,0.006 h 1.096 l 0.558,-0.006 0.558,-0.006 0.564,-0.013 0.57,-0.019 0.577,-0.019 0.583,-0.019 0.583,-0.024 0.588,-0.025 0.589,-0.03 0.601,-0.031 0.601,-0.037 0.607,-0.044 0.613,-0.037 0.614,-0.043 0.62,-0.05 2.678,-13.108 -13.549,-0.329 -0.812,3.948 7.183,-0.037 -1.432,4.996 -0.576,0.024 -0.576,0.019 -0.57,0.019 -0.564,0.006 -0.558,0.013 h -1.097 l -0.539,-0.006 -0.526,-0.013 -0.527,-0.012 -0.521,-0.025 -0.514,-0.024 -0.502,-0.031 -0.502,-0.031 -0.489,-0.043 -0.484,-0.044 -0.478,-0.055 -0.471,-0.057 -0.465,-0.062 -0.452,-0.062 -0.446,-0.074 -0.44,-0.081 -0.434,-0.08 -0.428,-0.087 -0.415,-0.099 -0.409,-0.1 -0.403,-0.105 -0.397,-0.111 -0.384,-0.117 -0.378,-0.125 -0.366,-0.13 -0.359,-0.136 -0.254,-0.174 -0.241,-0.174 -0.236,-0.18 -0.223,-0.174 -0.211,-0.18 -0.205,-0.18 -0.191,-0.18 -0.18,-0.186 -0.173,-0.18 -0.161,-0.187 -0.155,-0.179 -0.143,-0.187 -0.13,-0.187 -0.124,-0.186 -0.118,-0.186 -0.105,-0.192 -0.093,-0.186 -0.087,-0.181 -0.081,-0.191 -0.067,-0.187 -0.062,-0.192 -0.05,-0.186 -0.043,-0.192 -0.031,-0.186 -0.024,-0.192 -0.019,-0.193 -0.012,-0.186 0.006,-0.192 0.006,-0.186 0.019,-0.192 0.024,-0.186 0.031,-0.186 0.038,-0.192 0.049,-0.186 0.056,-0.186 0.067,-0.186 0.068,-0.186 0.081,-0.186 0.087,-0.18 0.099,-0.186 0.1,-0.18 0.111,-0.186 0.112,-0.18 0.124,-0.179 0.13,-0.174 0.143,-0.18 0.143,-0.174 0.148,-0.18 0.162,-0.168 0.161,-0.173 0.173,-0.173 0.174,-0.167 0.187,-0.167 0.192,-0.168 0.198,-0.161 0.198,-0.167 0.211,-0.161 0.216,-0.155 0.217,-0.161 0.229,-0.154 0.229,-0.149 0.242,-0.155 0.242,-0.148 0.248,-0.143 0.26,-0.148 0.261,-0.143 0.26,-0.136 0.273,-0.143 0.279,-0.13 0.279,-0.136 0.285,-0.13 0.292,-0.13 0.297,-0.124 0.298,-0.118 0.31,-0.124 0.31,-0.117 0.31,-0.112 0.323,-0.112 0.322,-0.104 0.328,-0.106 0.328,-0.105 0.341,-0.099 0.342,-0.093 0.34,-0.093 0.347,-0.086 0.353,-0.087 0.354,-0.086 0.359,-0.075 0.365,-0.074 0.366,-0.075 0.372,-0.068 0.372,-0.062 0.378,-0.062 0.378,-0.056 0.384,-0.056 0.384,-0.05 0.391,-0.043 0.391,-0.038 0.396,-0.036 0.396,-0.038 0.397,-0.024 0.403,-0.024 0.403,-0.02 0.409,-0.019 0.41,-0.012 0.415,-0.006 h 0.831 l 0.416,0.013 0.421,0.006 0.421,0.019 0.428,0.025 0.422,0.024 0.428,0.031 0.434,0.037 0.428,0.037 0.434,0.05 0.434,0.049 0.435,0.056 0.434,0.062 0.439,0.069 0.435,0.074 0.44,0.081 0.439,0.08 0.44,0.087 0.439,0.099 0.44,0.099 0.445,0.105 z" />
    <path
       style="clip-rule:evenodd;fill-rule:evenodd"
       id="path6"
       d="m 140.22,72.992 -1.884,-0.149 -1.891,-0.149 -1.89,-0.136 -1.903,-0.136 -1.909,-0.131 -1.921,-0.117 -0.961,-0.057 -0.966,-0.055 -0.967,-0.049 -0.973,-0.05 -0.974,-0.05 -0.972,-0.043 -0.98,-0.043 -0.985,-0.038 -0.985,-0.037 -0.993,-0.031 -0.991,-0.031 -0.998,-0.025 -0.998,-0.018 -1.004,-0.019 -1.01,-0.018 -1.01,-0.013 -1.017,-0.006 -1.022,-0.006 -1.023,0.006 h -1.029 l -1.035,0.013 -1.034,0.012 -1.048,0.019 -1.047,0.024 -1.054,0.025 -1.059,0.031 -1.061,0.037 -1.072,0.043 -1.073,0.05 -1.078,0.05 -1.091,0.062 -1.09,0.062 -1.097,0.068 -1.103,0.074 -1.11,0.087 -1.116,0.086 -1.121,0.094 -1.128,0.098 -1.134,0.106 -1.141,0.112 -1.147,0.117 -1.152,0.124 -1.165,0.131 -1.166,0.142 -1.177,0.143 -1.184,0.155 -1.19,0.161 -1.196,0.167 -1.209,0.174 -1.208,0.179 -1.221,0.193 -1.234,0.198 -0.818,0.148 -0.811,0.15 -0.813,0.148 -0.799,0.149 -0.8,0.149 -0.793,0.149 -0.787,0.148 -0.781,0.149 -0.775,0.149 -0.775,0.148 -0.768,0.143 -0.756,0.148 -0.756,0.15 -0.75,0.148 -0.75,0.143 -0.737,0.149 -0.732,0.149 -0.731,0.148 -0.726,0.143 -0.719,0.148 -0.712,0.143 -0.707,0.149 -0.706,0.142 -0.695,0.149 -0.694,0.143 -0.688,0.148 -0.682,0.143 -0.675,0.149 -0.669,0.142 -0.669,0.142 -0.658,0.15 -0.656,0.142 -0.652,0.143 -0.644,0.148 -0.638,0.143 -0.639,0.142 -0.626,0.143 -0.626,0.148 -0.62,0.143 -0.607,0.143 -0.613,0.142 -0.602,0.143 -0.595,0.143 -0.594,0.142 -0.589,0.142 -0.583,0.143 -0.577,0.143 -0.57,0.142 -0.564,0.143 -0.564,0.142 -0.551,0.143 -0.552,0.142 -0.545,0.143 -0.539,0.136 -0.533,0.142 -0.534,0.143 -0.526,0.143 -0.515,0.136 -0.514,0.143 -0.509,0.142 -0.501,0.143 -0.503,0.136 -0.489,0.143 -0.49,0.142 -0.483,0.137 -0.477,0.142 -0.471,0.136 -0.465,0.143 -0.465,0.136 -0.459,0.143 -0.446,0.136 -0.446,0.143 -0.446,0.136 -0.434,0.142 -0.428,0.137 -0.428,0.137 -0.421,0.142 -0.415,0.137 -0.409,0.136 -0.403,0.142 -0.397,0.136 -0.397,0.137 -0.39,0.137 -0.384,0.142 -0.379,0.136 -0.371,0.137 -0.366,0.136 -0.366,0.136 -0.353,0.143 -0.353,0.136 -0.347,0.137 -0.347,0.136 -0.335,0.137 -0.329,0.136 -0.328,0.136 -0.322,0.137 -0.316,0.136 -0.31,0.136 -0.31,0.136 -0.297,0.137 -0.298,0.136 -0.291,0.137 -0.285,0.136 -0.279,0.13 -0.273,0.136 -0.273,0.137 -0.26,0.136 -0.26,0.137 -0.254,0.135 -0.248,0.131 -0.248,0.136 -0.236,0.137 -0.235,0.136 -0.229,0.13 -0.224,0.137 -0.217,0.136 -0.21,0.13 -0.211,0.136 -0.205,0.137 -0.198,0.13 -0.192,0.136 -0.186,0.131 -0.18,0.136 -0.179,0.136 -0.168,0.13 -0.167,0.137 -0.161,0.13 -0.161,0.136 -0.149,0.13 -0.149,0.136 -0.136,0.131 -0.136,0.136 -0.131,0.13 -0.13,0.13 -0.118,0.137 -0.117,0.13 -0.106,0.136 -0.105,0.13 -0.105,0.13 -0.094,0.137 -0.086,0.13 -0.087,0.13 -0.08,0.137 -0.075,0.129 -0.068,0.131 -0.062,0.13 -0.062,0.136 -0.056,0.131 -0.043,0.13 -0.049,0.13 -0.038,0.13 -0.031,0.136 -0.031,0.131 -0.019,0.129 -0.018,0.131 -0.019,0.13 -0.006,0.13 v 0.266 l 0.006,0.131 0.012,0.13 0.019,0.13 0.025,0.131 0.025,0.129 0.031,0.13 0.044,0.131 0.037,0.13 0.049,0.13 0.056,0.13 0.055,0.13 0.063,0.131 0.068,0.129 0.074,0.13 0.08,0.13 0.081,0.131 0.093,0.13 0.093,0.124 0.099,0.13 0.099,0.131 0.112,0.13 0.111,0.13 0.124,0.129 0.125,0.131 0.123,0.124 0.137,0.13 0.142,0.13 0.143,0.131 0.148,0.13 0.156,0.13 0.161,0.124 0.161,0.13 0.173,0.13 0.174,0.13 0.18,0.124 0.186,0.13 0.186,0.13 0.198,0.131 0.198,0.124 0.205,0.13 0.211,0.13 0.217,0.124 0.216,0.13 0.223,0.131 0.23,0.124 0.235,0.129 0.242,0.13 0.248,0.124 0.248,0.13 0.254,0.131 0.26,0.124 0.266,0.13 0.273,0.13 0.273,0.124 0.279,0.13 0.291,0.124 0.285,0.131 0.298,0.13 0.303,0.124 0.304,0.129 0.31,0.124 0.316,0.13 0.322,0.124 0.323,0.131 0.335,0.13 0.334,0.124 0.341,0.129 0.341,0.125 0.353,0.13 0.354,0.124 0.365,0.13 0.366,0.124 0.366,0.131 0.377,0.123 0.379,0.131 0.39,0.123 0.391,0.131 0.39,0.124 0.403,0.129 0.409,0.124 0.409,0.13 0.415,0.124 0.421,0.124 0.422,0.131 0.434,0.123 0.434,0.131 0.44,0.124 0.446,0.13 0.453,0.124 0.452,0.13 0.465,0.125 0.465,0.122 0.471,0.131 0.47,0.124 0.484,0.13 0.484,0.124 0.489,0.131 1.352,0.322 1.345,0.322 1.338,0.316 1.333,0.31 1.326,0.304 1.314,0.304 1.314,0.291 1.308,0.285 1.295,0.285 1.295,0.272 1.289,0.273 1.283,0.266 1.277,0.261 1.264,0.254 1.265,0.248 1.258,0.241 1.258,0.237 1.246,0.235 1.239,0.223 1.24,0.223 1.227,0.217 1.227,0.211 1.221,0.204 1.221,0.198 1.209,0.199 1.208,0.185 1.197,0.187 1.202,0.179 1.191,0.173 1.189,0.168 1.178,0.161 1.183,0.162 1.171,0.149 1.172,0.148 1.165,0.143 1.165,0.137 1.153,0.135 1.159,0.124 1.147,0.124 1.146,0.119 1.147,0.111 1.134,0.111 1.141,0.1 1.128,0.099 1.133,0.092 1.122,0.094 1.123,0.08 1.121,0.08 1.116,0.074 1.115,0.069 1.109,0.062 1.104,0.062 1.109,0.056 1.097,0.049 1.104,0.044 1.096,0.043 1.098,0.037 1.091,0.032 1.09,0.025 1.085,0.024 1.084,0.019 1.085,0.012 1.085,0.012 h 3.229 l 1.078,-0.012 1.072,-0.012 1.073,-0.019 1.072,-0.018 1.066,-0.026 1.066,-0.031 1.066,-0.037 1.066,-0.037 1.066,-0.043 1.066,-0.043 1.06,-0.057 1.06,-0.055 1.06,-0.056 1.065,-0.062 1.061,-0.068 1.06,-0.074 1.053,-0.074 1.06,-0.081 1.06,-0.087 1.059,-0.086 1.06,-0.094 1.054,-0.093 1.06,-0.099 1.059,-0.105 1.061,-0.106 1.059,-0.111 1.06,-0.118 1.06,-0.118 1.059,-0.124 1.061,-0.13 1.059,-0.13 1.066,-0.131 1.06,-0.142 1.067,-0.136 1.065,-0.149 1.066,-0.149 1.066,-0.148 1.072,-0.161 1.072,-0.156 1.073,-0.167 1.072,-0.168 1.072,-0.167 1.079,-0.173 1.078,-0.18 1.079,-0.18 1.085,-0.185 1.084,-0.186 1.085,-0.192 1.084,-0.193 1.091,-0.198 1.097,-0.204 1.091,-0.205 1.096,-0.204 1.104,-0.211 1.104,-0.218 1.103,-0.216 1.108,-0.216 1.11,-0.23 1.116,-0.224 1.115,-0.229 1.121,-0.235 1.123,-0.236 -1.829,0.23 -1.828,0.222 -1.822,0.211 -1.816,0.199 -1.816,0.185 -1.81,0.18 -1.803,0.175 -1.804,0.154 -1.804,0.148 -1.797,0.137 -1.791,0.13 -1.791,0.118 -1.785,0.106 -1.779,0.098 -1.778,0.087 -1.78,0.081 -1.772,0.068 -1.766,0.056 -1.766,0.05 -1.761,0.037 -1.754,0.03 -1.754,0.019 -1.754,0.006 h -1.748 l -1.741,-0.006 -1.742,-0.019 -1.735,-0.03 -1.735,-0.037 -1.729,-0.05 -1.73,-0.056 -1.723,-0.068 -1.716,-0.075 -1.717,-0.08 -1.718,-0.093 -1.71,-0.105 -1.704,-0.112 -1.704,-0.118 -1.698,-0.13 -1.699,-0.136 -1.692,-0.149 -1.691,-0.155 -1.687,-0.167 -1.685,-0.174 -1.68,-0.18 -1.674,-0.191 -1.68,-0.199 -1.667,-0.204 -1.667,-0.218 -1.667,-0.223 -1.661,-0.235 -1.655,-0.241 -1.654,-0.248 -1.649,-0.261 -1.649,-0.267 -1.649,-0.272 -1.642,-0.285 -1.636,-0.291 -1.637,-0.298 -1.629,-0.303 -1.63,-0.317 -1.63,-0.322 -1.624,-0.329 -1.618,-0.341 -1.618,-0.347 -0.483,-0.149 -0.477,-0.148 -0.471,-0.149 -0.465,-0.149 -0.459,-0.155 -0.452,-0.155 -0.44,-0.148 -0.434,-0.155 -0.434,-0.156 -0.421,-0.154 -0.416,-0.162 -0.402,-0.154 -0.403,-0.156 -0.391,-0.161 -0.39,-0.154 -0.378,-0.161 -0.372,-0.161 -0.366,-0.161 -0.359,-0.161 -0.354,-0.162 -0.347,-0.161 -0.334,-0.168 -0.335,-0.161 -0.322,-0.167 -0.316,-0.161 -0.311,-0.167 -0.302,-0.168 -0.298,-0.167 -0.292,-0.168 -0.285,-0.167 -0.279,-0.167 -0.266,-0.167 -0.267,-0.168 -0.253,-0.167 -0.249,-0.174 -0.247,-0.167 -0.236,-0.173 -0.23,-0.168 -0.222,-0.173 -0.217,-0.174 -0.211,-0.167 -0.198,-0.174 -0.199,-0.174 -0.192,-0.174 -0.18,-0.172 L 52.478,99.221 52.31,99.048 52.143,98.874 51.988,98.7 51.833,98.521 51.69,98.347 51.554,98.174 51.424,97.994 51.3,97.82 51.183,97.646 51.07,97.467 l -0.105,-0.174 -0.099,-0.18 -0.093,-0.173 -0.086,-0.18 -0.082,-0.173 -0.074,-0.18 -0.068,-0.179 -0.062,-0.174 -0.056,-0.179 -0.043,-0.181 -0.043,-0.173 -0.037,-0.18 -0.032,-0.18 -0.018,-0.173 -0.019,-0.18 -0.012,-0.18 -0.006,-0.179 0.006,-0.174 0.006,-0.18 0.013,-0.179 0.025,-0.18 0.024,-0.174 0.031,-0.18 0.037,-0.179 0.044,-0.174 0.056,-0.179 0.055,-0.18 0.062,-0.174 0.068,-0.18 0.075,-0.179 0.081,-0.174 0.086,-0.18 0.093,-0.173 0.099,-0.18 0.106,-0.173 0.111,-0.18 0.118,-0.174 0.124,-0.174 0.13,-0.179 0.136,-0.173 0.136,-0.174 0.149,-0.18 0.149,-0.173 0.161,-0.174 0.162,-0.174 0.173,-0.173 0.173,-0.173 0.187,-0.174 0.186,-0.173 0.192,-0.174 0.198,-0.167 0.205,-0.174 0.21,-0.174 0.217,-0.167 0.223,-0.173 0.223,-0.168 0.236,-0.174 0.242,-0.167 0.241,-0.167 0.248,-0.167 0.261,-0.174 0.26,-0.167 0.266,-0.167 0.273,-0.161 0.279,-0.168 0.285,-0.167 0.285,-0.162 0.298,-0.167 0.297,-0.161 0.31,-0.168 0.31,-0.16 0.316,-0.161 0.323,-0.162 0.328,-0.161 0.335,-0.161 0.334,-0.161 0.347,-0.155 0.347,-0.161 0.359,-0.155 0.36,-0.161 0.366,-0.155 0.371,-0.155 0.373,-0.155 0.384,-0.155 0.384,-0.155 0.397,-0.149 0.397,-0.155 0.403,-0.148 0.409,-0.149 0.408,-0.155 0.422,-0.149 0.421,-0.149 0.428,-0.142 0.44,-0.149 0.434,-0.142 0.446,-0.149 0.453,-0.143 0.452,-0.143 0.458,-0.142 0.466,-0.142 0.47,-0.136 0.478,-0.143 0.483,-0.137 0.484,-0.136 0.489,-0.136 0.496,-0.137 0.503,-0.136 0.501,-0.13 0.515,-0.136 0.514,-0.131 0.52,-0.13 0.527,-0.13 0.527,-0.13 0.54,-0.124 0.539,-0.13 0.545,-0.124 0.552,-0.124 0.551,-0.124 0.564,-0.125 0.564,-0.116 0.57,-0.119 0.57,-0.123 0.583,-0.118 0.583,-0.112 0.588,-0.118 0.596,-0.111 0.594,-0.118 0.608,-0.112 0.608,-0.105 0.613,-0.111 0.613,-0.106 0.62,-0.111 0.632,-0.106 0.626,-0.099 0.639,-0.106 0.638,-0.098 0.651,-0.106 0.645,-0.099 0.657,-0.093 0.656,-0.099 0.664,-0.093 0.669,-0.092 0.675,-0.094 0.676,-0.093 0.682,-0.087 0.688,-0.093 0.688,-0.087 0.694,-0.08 0.7,-0.087 0.707,-0.081 0.706,-0.08 0.713,-0.08 0.719,-0.081 0.726,-0.074 0.724,-0.074 0.732,-0.075 0.731,-0.069 0.744,-0.074 0.744,-0.068 0.744,-0.068 0.755,-0.062 0.756,-0.068 0.764,-0.062 0.762,-0.062 0.768,-0.056 0.774,-0.062 0.782,-0.055 0.78,-0.05 0.787,-0.056 0.787,-0.05 0.8,-0.05 0.8,-0.049 0.799,-0.043 0.806,-0.05 0.812,-0.037 0.818,-0.043 0.818,-0.038 0.825,-0.037 0.83,-0.037 0.83,-0.037 0.837,-0.031 0.837,-0.031 0.844,-0.025 0.848,-0.031 0.855,-0.025 0.856,-0.018 0.861,-0.025 0.862,-0.019 0.867,-0.018 0.873,-0.013 0.875,-0.012 0.88,-0.012 0.881,-0.013 0.891,-0.006 0.887,-0.006 0.899,-0.007 h 2.708 z"
       fill="#d35b2f" />
  </g>
</svg>
