<?xml version="1.0" encoding="UTF-8" standalone="no"?>
<svg
   xmlns:dc="http://purl.org/dc/elements/1.1/"
   xmlns:cc="http://creativecommons.org/ns#"
   xmlns:rdf="http://www.w3.org/1999/02/22-rdf-syntax-ns#"
   xmlns:svg="http://www.w3.org/2000/svg"
   xmlns="http://www.w3.org/2000/svg"
   xmlns:xlink="http://www.w3.org/1999/xlink"
   xmlns:sodipodi="http://sodipodi.sourceforge.net/DTD/sodipodi-0.dtd"
   xmlns:inkscape="http://www.inkscape.org/namespaces/inkscape"
   width="592.14062"
   height="512"
   viewBox="0 0 18.483315 15.978275"
   version="1.1"
   id="svg148"
   sodipodi:docname="ms-windows-2000.svg"
   inkscape:version="0.92.4 (unknown)">
  <metadata
     id="metadata152">
    <rdf:RDF>
      <cc:Work
         rdf:about="">
        <dc:format>image/svg+xml</dc:format>
        <dc:type
           rdf:resource="http://purl.org/dc/dcmitype/StillImage" />
        <dc:title></dc:title>
      </cc:Work>
    </rdf:RDF>
  </metadata>
  <sodipodi:namedview
     pagecolor="#ffffff"
     bordercolor="#666666"
     borderopacity="1"
     objecttolerance="10"
     gridtolerance="10"
     guidetolerance="10"
     inkscape:pageopacity="0"
     inkscape:pageshadow="2"
     inkscape:window-width="1600"
     inkscape:window-height="851"
     id="namedview150"
     showgrid="false"
     inkscape:showpageshadow="false"
     fit-margin-top="0"
     fit-margin-left="0"
     fit-margin-right="0"
     fit-margin-bottom="0"
     inkscape:zoom="1.2597656"
     inkscape:cx="296.07031"
     inkscape:cy="256"
     inkscape:window-x="0"
     inkscape:window-y="24"
     inkscape:window-maximized="1"
     inkscape:current-layer="svg148" />
  <defs
     id="defs3">
    <path
       id="a"
       d="M 34.44,51.565 H 15.284 V 43.368 H 12.229 V 54.426 H 37.496 V 43.377 H 34.44 v 8.188"
       inkscape:connector-curvature="0" />
  </defs>
  <clipPath
     id="b">
    <use
       xlink:href="#a"
       overflow="visible"
       id="use5"
       style="overflow:visible"
       x="0"
       y="0"
       width="100%"
       height="100%" />
  </clipPath>
  <defs
     id="defs13">
    <path
       id="c"
       d="M 34.44,51.565 H 15.284 V 43.368 H 12.229 V 54.426 H 37.496 V 43.377 H 34.44 v 8.188"
       inkscape:connector-curvature="0" />
  </defs>
  <clipPath
     id="d">
    <use
       xlink:href="#c"
       overflow="visible"
       id="use15"
       style="overflow:visible"
       x="0"
       y="0"
       width="100%"
       height="100%" />
  </clipPath>
  <defs
     id="defs23">
    <path
       id="e"
       d="M 39.002,0 H 71.899 V 32.895 H 39.002 Z"
       inkscape:connector-curvature="0" />
  </defs>
  <clipPath
     id="f">
    <use
       xlink:href="#e"
       overflow="visible"
       id="use25"
       style="overflow:visible"
       x="0"
       y="0"
       width="100%"
       height="100%" />
  </clipPath>
  <defs
     id="defs33">
    <path
       id="g"
       d="M 39.002,0 H 71.899 V 32.895 H 39.002 Z"
       inkscape:connector-curvature="0" />
  </defs>
  <clipPath
     id="h">
    <use
       xlink:href="#g"
       overflow="visible"
       id="use35"
       style="overflow:visible"
       x="0"
       y="0"
       width="100%"
       height="100%" />
  </clipPath>
  <defs
     id="defs43">
    <path
       id="i"
       d="M 39.002,0 H 71.899 V 32.895 H 39.002 Z"
       inkscape:connector-curvature="0" />
  </defs>
  <clipPath
     id="j">
    <use
       xlink:href="#i"
       overflow="visible"
       id="use45"
       style="overflow:visible"
       x="0"
       y="0"
       width="100%"
       height="100%" />
  </clipPath>
  <defs
     id="defs53">
    <path
       id="k"
       d="M 39.002,0 H 71.899 V 32.895 H 39.002 Z"
       inkscape:connector-curvature="0" />
  </defs>
  <clipPath
     id="l">
    <use
       xlink:href="#k"
       overflow="visible"
       id="use55"
       style="overflow:visible"
       x="0"
       y="0"
       width="100%"
       height="100%" />
  </clipPath>
  <defs
     id="defs65">
    <path
       id="m"
       d="m 26.762,24.393 h 12.239 v 2.816 H 26.762 Z"
       inkscape:connector-curvature="0" />
  </defs>
  <clipPath
     id="n">
    <use
       xlink:href="#m"
       overflow="visible"
       id="use67"
       style="overflow:visible"
       x="0"
       y="0"
       width="100%"
       height="100%" />
  </clipPath>
  <defs
     id="defs75">
    <path
       id="o"
       d="m 26.762,24.393 h 12.239 v 2.816 H 26.762 Z"
       inkscape:connector-curvature="0" />
  </defs>
  <clipPath
     id="p">
    <use
       xlink:href="#o"
       overflow="visible"
       id="use77"
       style="overflow:visible"
       x="0"
       y="0"
       width="100%"
       height="100%" />
  </clipPath>
  <defs
     id="defs85">
    <path
       id="q"
       d="m 23.192,8.023 v 10.554 h 3.132 V 11.381 H 39.002 V 8.023 h -15.81"
       inkscape:connector-curvature="0" />
  </defs>
  <clipPath
     id="r">
    <use
       xlink:href="#q"
       overflow="visible"
       id="use87"
       style="overflow:visible"
       x="0"
       y="0"
       width="100%"
       height="100%" />
  </clipPath>
  <defs
     id="defs95">
    <path
       id="s"
       d="m 23.192,8.023 v 10.554 h 3.132 V 11.381 H 39.002 V 8.023 h -15.81"
       inkscape:connector-curvature="0" />
  </defs>
  <clipPath
     id="t">
    <use
       xlink:href="#s"
       overflow="visible"
       id="use97"
       style="overflow:visible"
       x="0"
       y="0"
       width="100%"
       height="100%" />
  </clipPath>
  <defs
     id="defs105">
    <path
       id="u"
       d="M 16.508,40.633 H 3.071 V 21.817 h 20.733 v 5.392 h 2.958 V 18.577 H 0 v 24.791 h 16.508 v -2.735"
       inkscape:connector-curvature="0" />
  </defs>
  <clipPath
     id="v">
    <use
       xlink:href="#u"
       overflow="visible"
       id="use107"
       style="overflow:visible"
       x="0"
       y="0"
       width="100%"
       height="100%" />
  </clipPath>
  <defs
     id="defs115">
    <path
       id="w"
       d="M 16.508,40.633 H 3.071 V 21.817 h 20.733 v 5.392 h 2.958 V 18.577 H 0 v 24.791 h 16.508 v -2.735"
       inkscape:connector-curvature="0" />
  </defs>
  <clipPath
     id="x">
    <use
       xlink:href="#w"
       overflow="visible"
       id="use117"
       style="overflow:visible"
       x="0"
       y="0"
       width="100%"
       height="100%" />
  </clipPath>
  <g
     id="g967"
     transform="matrix(0.83805555,0,0,0.83805555,-37.193743,-5.761989)">
    <path
       id="path132"
       d="m 53.694,21.592 2.125,-5.264 c 1.008,-0.053 2.65,0.173 3.668,0.419 l -2.184,5.416 C 56.309,21.915 54.68,21.619 53.694,21.592"
       inkscape:connector-curvature="0"
       style="fill:#30a0de" />
    <path
       id="path134"
       d="m 63.245,18.864 -2.207,5.442 C 60.3,23.697 58.274,22.545 57.304,22.163 l 2.184,-5.416 c 0.989,0.352 3.098,1.41 3.757,2.117"
       inkscape:connector-curvature="0"
       style="fill:#f0ca3d" />
    <path
       id="path136"
       d="m 65.415,13.825 -2.17,5.039 c -0.709,-0.649 -2.758,-1.752 -3.758,-2.117 l 2.193,-5.425 c 0.996,0.333 3.082,1.759 3.735,2.503"
       inkscape:connector-curvature="0"
       style="fill:#8abd5a" />
    <path
       id="path138"
       d="m 55.819,16.328 2.148,-5.326 c 1.014,-0.035 2.695,0.123 3.713,0.32 l -2.193,5.425 c -1.004,-0.279 -2.666,-0.438 -3.668,-0.419"
       inkscape:connector-curvature="0"
       style="fill:#cd5935" />
    <path
       id="path140"
       d="m 48.52,18.284 -1.047,-0.016 c 0.072,-0.211 0.166,-0.446 0.256,-0.643 h 1.051 c -0.074,0.21 -0.166,0.447 -0.26,0.659 m 1.602,0.871 -1.307,-0.006 0.361,-0.892 c 0.434,0 0.871,0 1.311,0.016 l -0.365,0.882 m 2.177,-0.228 c -0.152,0.352 -0.283,0.725 -0.434,1.079 l -1.479,-0.019 0.436,-1.071 1.477,0.011 M 47.12,17.22 46.362,17.215 a 6.18,6.18 0 0 1 0.213,-0.544 c 0.262,-10e-4 0.521,-0.019 0.777,-0.007 L 47.12,17.22 m -1.371,-1.109 c -0.193,0.006 -0.389,0.024 -0.586,0.02 l 0.191,-0.463 c 0.195,-0.005 0.389,-0.018 0.582,-0.018 l -0.187,0.461 m 3.459,0.466 -1.047,-0.014 0.252,-0.639 c 0.352,0.011 0.707,-0.009 1.061,0.001 l -0.266,0.652 m 1.599,0.879 -1.303,-0.005 0.354,-0.888 c 0.438,-10e-4 0.873,-0.005 1.311,0.008 l -0.362,0.885 m 1.754,0.84 -1.478,-0.033 0.425,-1.05 1.477,0.016 -0.424,1.067 M 47.836,15.447 C 47.58,15.439 47.32,15.46 47.068,15.444 l 0.23,-0.572 0.752,0.021 a 4.444,4.444 0 0 1 -0.214,0.554 m -1.373,-1.105 -0.582,0.017 0.176,-0.46 c 0.193,-0.016 0.4,-0.016 0.596,-0.016 l -0.19,0.459"
       inkscape:connector-curvature="0"
       style="fill:#30a0de" />
    <path
       id="path142"
       d="m 50.624,13.06 -1.047,-0.006 0.256,-0.653 c 0.352,0.006 0.705,0 1.059,0.01 l -0.268,0.649 m 0.298,0.881 0.356,-0.894 h 1.301 l -0.354,0.897 -1.303,-0.003 m 3.08,0.782 -1.484,-0.015 0.428,-1.064 1.48,0.006 -0.424,1.073 M 49.26,11.921 c -0.246,0.017 -0.508,0.002 -0.762,0.006 l 0.215,-0.567 c 0.25,-0.019 0.508,0.011 0.762,0.002 l -0.215,0.559 m -1.373,-1.104 c -0.197,0.006 -0.393,0.026 -0.586,0.019 l 0.189,-0.459 0.582,-0.028 -0.185,0.468 m 3.446,0.496 c -0.355,0 -0.705,-0.003 -1.051,-0.019 l 0.26,-0.641 c 0.35,0.006 0.701,-0.005 1.051,0 l -0.26,0.66 m 1.597,0.885 c -0.438,-0.002 -0.877,0.008 -1.314,-0.008 l 0.367,-0.891 c 0.438,-0.003 0.869,0.006 1.311,0.008 l -0.364,0.891 m 1.737,0.851 -1.465,-0.017 0.423,-1.071 1.481,0.011 -0.439,1.077 m -4.704,-2.87 H 49.2 l 0.225,-0.576 c 0.256,0.011 0.51,10e-4 0.766,0.014 l -0.228,0.562 M 48.596,9.062 48.008,9.087 48.192,8.625 C 48.385,8.602 48.583,8.614 48.78,8.599 l -0.184,0.463"
       inkscape:connector-curvature="0"
       style="fill:#cd5935" />
    <path
       id="path144"
       d="m 47.858,20.077 c -0.418,0.003 -0.83,0 -1.248,-0.011 l 0.301,-0.732 c 0.416,0 0.834,0.013 1.25,0.007 l -0.303,0.736 m 9.504,-8.141 -1.862,0.015 0.654,-1.625 c 0.633,-0.07 1.271,-0.14 1.906,-0.116 l -0.698,1.726 m -8.033,-4.54 -0.705,0.017 0.207,-0.528 c 0.236,-0.002 0.477,-0.013 0.711,-0.012 l -0.213,0.523 m 1.398,1.036 C 50.415,8.422 50.102,8.426 49.788,8.409 l 0.248,-0.606 c 0.312,0.012 0.629,-0.003 0.947,0.014 l -0.256,0.615 m 4.738,2.933 -1.757,-0.01 0.511,-1.276 1.764,0.015 -0.518,1.271 m -3.293,-0.891 0.379,-0.968 1.555,0.003 -0.391,0.973 -1.543,-0.008 M 52.094,9.586 50.846,9.578 51.135,8.849 c 0.414,0 0.834,-0.016 1.254,0 l -0.295,0.737 m 4.588,4.039 c -0.621,0.017 -1.246,0.025 -1.863,0.027 l 0.604,-1.499 1.859,-0.009 -0.6,1.481 m -0.699,1.727 -1.859,0.027 -0.01,-0.005 0.603,-1.503 1.871,-0.027 -0.605,1.508 m -9.465,-2.719 0.201,-0.519 0.717,-0.027 -0.207,0.535 -0.711,0.011 m 6.912,4.446 0.6,-1.495 1.859,-0.021 -0.592,1.498 -1.867,0.018 m -4.834,-3.375 -0.943,-0.013 0.252,-0.606 c 0.312,0.011 0.631,-0.004 0.945,0.014 l -0.254,0.605 m 4.746,2.916 -1.752,-0.013 0.504,-1.268 1.764,0.015 -0.516,1.266 m -1.752,-0.868 -1.541,-0.004 -0.011,-0.003 0.394,-0.968 1.549,0.003 -0.391,0.972 m -1.632,-0.888 -1.238,-0.011 0.283,-0.729 c 0.422,-0.006 0.844,-0.003 1.262,0.002 l -0.307,0.738 m 4.634,3.937 -0.006,0.013 -1.863,0.023 0.61,-1.537 1.875,-0.018 -0.616,1.519 m -0.701,1.729 -1.863,0.044 -0.018,-0.006 0.621,-1.518 1.864,-0.017 -0.604,1.497 m -8.805,-2.629 c -0.23,-0.01 -0.465,0.014 -0.705,-0.002 l 0.207,-0.504 c 0.242,-0.018 0.484,-0.014 0.723,-0.023 l -0.225,0.529 m 8.059,4.47 c -0.621,-0.016 -1.24,-0.024 -1.863,0.03 l 0.645,-1.616 1.879,-0.031 -0.661,1.617 m -6.674,-3.385 -0.947,0.005 0.236,-0.607 c 0.322,0 0.641,-0.013 0.957,-0.003 l -0.246,0.605 m 4.766,2.863 -1.756,-0.027 0.514,-1.267 1.754,0.018 -0.512,1.276 m -3.299,-0.892 0.395,-0.973 1.541,0.009 -0.393,0.978 -1.543,-0.014"
       inkscape:connector-curvature="0" />
    <path
       id="path146"
       d="m 64.45,14.1 c -0.648,-0.742 -1.553,-1.268 -2.553,-1.598 l -1.566,3.868 c 0.998,0.366 1.883,0.867 2.588,1.518 z m -2.032,5.05 C 61.764,18.442 60.826,17.939 59.84,17.59 l -1.59,3.954 c 0.969,0.381 1.877,0.832 2.615,1.441 z m 4.018,-5.5 -4.963,12.293 C 60.182,24.187 57.942,23.08 55.696,22.66 A 16.257,16.257 0 0 0 53.37,22.379 l 0.652,-1.597 c 0.988,0.025 1.98,0.144 2.979,0.392 l 1.6,-3.976 C 57.585,16.952 56.57,16.921 55.558,16.974 l 0.521,-1.306 c 1.004,-0.017 2.008,0.044 3.012,0.322 l 1.549,-3.828 a 13.125,13.125 0 0 0 -3.041,-0.231 l 0.693,-1.734 c 2.305,-0.008 4.971,0.633 6.859,2.159 0.474,0.38 0.918,0.802 1.285,1.294"
       inkscape:connector-curvature="0"
       style="clip-rule:evenodd;fill-rule:evenodd" />
  </g>
</svg>
