<?xml version="1.0" encoding="UTF-8" standalone="no"?>
<svg
   xmlns:dc="http://purl.org/dc/elements/1.1/"
   xmlns:cc="http://creativecommons.org/ns#"
   xmlns:rdf="http://www.w3.org/1999/02/22-rdf-syntax-ns#"
   xmlns:svg="http://www.w3.org/2000/svg"
   xmlns="http://www.w3.org/2000/svg"
   xmlns:sodipodi="http://sodipodi.sourceforge.net/DTD/sodipodi-0.dtd"
   xmlns:inkscape="http://www.inkscape.org/namespaces/inkscape"
   width="512"
   version="1.0"
   sodipodi:version="0.32"
   sodipodi:docname="app-7zip.svg"
   inkscape:version="1.0 (1.0+r73+1)"
   inkscape:output_extension="org.inkscape.output.svg.inkscape"
   id="svg2"
   height="292.33292">
  <metadata
     id="metadata82">
    <rdf:RDF>
      <cc:Work
         rdf:about="">
        <dc:title></dc:title>
        <dc:description />
        <dc:subject>
          <rdf:Bag>
            <rdf:li>unsorted</rdf:li>
          </rdf:Bag>
        </dc:subject>
        <dc:publisher>
          <cc:Agent
             rdf:about="http://www.openclipart.org/">
            <dc:title>Open Clip Art Library, Source: Wikimedia Commons, Source: Wikimedia Commons, Source: Wikimedia Commons, Source: Wikimedia Commons</dc:title>
          </cc:Agent>
        </dc:publisher>
        <dc:creator>
          <cc:Agent>
            <dc:title />
          </cc:Agent>
        </dc:creator>
        <dc:rights>
          <cc:Agent>
            <dc:title />
          </cc:Agent>
        </dc:rights>
        <dc:date />
        <dc:format>image/svg+xml</dc:format>
        <dc:type
           rdf:resource="http://purl.org/dc/dcmitype/StillImage" />
        <cc:license
           rdf:resource="http://en.wikipedia.org/wiki/GNU_General_Public_License" />
        <dc:language>en</dc:language>
      </cc:Work>
    </rdf:RDF>
  </metadata>
  <sodipodi:namedview
     inkscape:window-maximized="1"
     fit-margin-bottom="0"
     fit-margin-right="0"
     fit-margin-left="0"
     fit-margin-top="0"
     inkscape:document-rotation="0"
     showgrid="false"
     pagecolor="#ffffff"
     objecttolerance="10.0"
     inkscape:zoom="2.8084419"
     inkscape:window-y="24"
     inkscape:window-x="0"
     inkscape:window-width="1920"
     inkscape:window-height="1033"
     inkscape:pageshadow="2"
     inkscape:pageopacity="0.0"
     inkscape:cy="146.16646"
     inkscape:cx="256"
     inkscape:current-layer="svg2"
     id="base"
     guidetolerance="10.0"
     gridtolerance="10.0"
     borderopacity="1.0"
     bordercolor="#666666" />
  <defs
     id="defs23">
    <clipPath
       id="clipPath">
      <path
         style="fill:#ffffff;fill-opacity:1;fill-rule:evenodd;stroke:none;stroke-width:1px;stroke-linecap:butt;stroke-linejoin:miter;stroke-opacity:1"
         sodipodi:nodetypes="cccccccc"
         id="path2451"
         d="M 49.912147,52.755616 H 218.50427 v 51.021304 c -43.95033,52.89305 -71.72632,113.87327 -74.31363,187.44783 H 86.514387 c 2.26985,-63.39403 8.83583,-125.71401 57.676253,-177.4654 H 49.912147 Z" />
    </clipPath>
    <filter
       y="-0.5"
       x="-0.5"
       width="4"
       id="filter"
       height="2">
      <feGaussianBlur
         stdDeviation="4.0"
         id="feGaussianBlur3988" />
    </filter>
    <clipPath
       id="clipPathN">
      <path
         style="fill:#000000;fill-opacity:1;fill-rule:evenodd;stroke:none;stroke-width:5.48529px;stroke-linecap:butt;stroke-linejoin:miter;stroke-opacity:1"
         id="path3223"
         d="m 415.9375,112.65625 v 175.25 h 36.59375 v -175.25 z M 285.0625,113.75 v 39.9375 h 56.5625 l -58.78125,96.5 V 289 H 390.4375 v -38.8125 h -68.78125 l 71,-100.9375 v -35.5 z m 200.71875,0.0625 v 176.21875 h 39.9375 v -62.0625 h 26.59375 c 42.58932,-0.14551 43.71957,-115.49542 -2.25,-114.15625 z M 523.5,151.53125 h 15.59375 c 17.34763,-0.59446 17.71316,38.93681 0,36.5 L 524.6875,189.25 Z" />
    </clipPath>
    <filter
       y="-0.5"
       x="-0.5"
       width="4"
       id="filterI"
       height="2">
      <feGaussianBlur
         stdDeviation="4.0"
         id="feGaussianBlur2412" />
    </filter>
    <clipPath
       id="clipPatho">
      <path
         style="opacity:1;fill:#000000;fill-opacity:1;stroke:none;stroke-width:1;stroke-linejoin:round;stroke-miterlimit:4;stroke-dasharray:none;stroke-opacity:1"
         id="rect2465"
         d="m 0,-0.0625 v 345.625 H 257.75 268.84375 603.375 V 76.71875 H 268.84375 V -0.0625 Z" />
    </clipPath>
    <filter
       y="-0.5"
       x="-0.5"
       width="4"
       id="filterH"
       height="2">
      <feGaussianBlur
         stdDeviation="4.0"
         id="feGaussianBlur2495" />
    </filter>
    <clipPath
       id="clipPathk">
      <path
         transform="rotate(90)"
         style="fill:#ffffff;fill-opacity:1;stroke:none;stroke-width:1;stroke-linejoin:round;stroke-miterlimit:4;stroke-opacity:1"
         id="rect2467"
         d="M 80.590836,-598.40924 H 341.70515 v 335.6842 H 80.590836 Z" />
    </clipPath>
    <filter
       y="-0.5"
       x="-0.5"
       width="2"
       id="filterHr"
       height="2">
      <feGaussianBlur
         stdDeviation="4.0"
         id="feGaussianBlur3490" />
    </filter>
  </defs>
  <style
     type="text/css"
     id="style4">
path {stroke-width:1px;fill:#000;stroke:#000}
.PF {fill:#fff;stroke:#fff}
</style>
  <g
     transform="matrix(0.84856018,0,0,0.84580953,0,0.0528631)"
     id="g2431">
    <path
       style="opacity:1;fill:#000000;fill-opacity:1;stroke:none;stroke-width:1;stroke-linejoin:round;stroke-miterlimit:4;stroke-dasharray:none;stroke-opacity:1"
       id="path2499"
       d="m 0,-0.0625 v 345.625 H 257.75 268.84375 603.375 V 76.71875 H 268.84375 V -0.0625 Z" />
    <g
       id="g2401">
      <path
         style="fill:#ffffff;fill-opacity:1;fill-rule:evenodd;stroke:none;stroke-width:1px;stroke-linecap:butt;stroke-linejoin:miter;stroke-opacity:1"
         sodipodi:nodetypes="cccccccc"
         id="path3993"
         d="M 49.912147,52.755616 H 218.50427 v 51.021304 c -43.95033,52.89305 -71.72632,113.87327 -74.31363,187.44783 H 86.514387 c 2.26985,-63.39403 8.83583,-125.71401 57.676253,-177.4654 H 49.912147 Z" />
      <g
         id="g3998"
         clip-path="url(#clipPath)">
        <g
           id="g4000">
          <path
             style="fill:none;stroke:#ffffff;stroke-width:10;stroke-opacity:1;filter:url(#filter)"
             sodipodi:nodetypes="cccccccc"
             id="path4002"
             d="M 49.912147,52.755616 H 218.50427 m 0,0 v 51.021304 m 0,0 c -43.95033,52.89305 -71.72632,113.87327 -74.31363,187.44783" />
          <path
             style="fill:none;stroke:#000000;stroke-width:10;stroke-opacity:1;filter:url(#filter)"
             sodipodi:nodetypes="cccccccc"
             id="path4004"
             d="M 144.19064,291.22475 H 86.514387 m 0,0 c 2.26985,-63.39403 8.83583,-125.71401 57.676253,-177.4654 m 0,0 H 49.912147 m 0,0 V 52.755616" />
        </g>
      </g>
    </g>
    <g
       id="g2513"
       clip-path="url(#clipPatho)">
      <g
         id="g2515">
        <path
           style="fill:none;stroke:#ffffff;stroke-width:10;stroke-opacity:1;filter:url(#filterH)"
           id="path2517"
           d="M 603.375,345.5625 V 76.71875 m 0,0 H 268.84375 m 0,0 V -0.0625 m 0,0 H 0" />
        <path
           style="fill:none;stroke:#000000;stroke-width:10;stroke-opacity:1;filter:url(#filterH)"
           id="path2519"
           d="m 0,-0.0625 v 345.625 m 0,0 h 257.75 m 0,0 h 11.09375 m 0,0 H 603.375" />
      </g>
    </g>
    <g
       transform="matrix(0.9942381,0,0,0.9851852,1.5137965,5.0622986)"
       id="g2419">
      <path
         transform="rotate(90)"
         style="fill:#ffffff;fill-opacity:1;stroke:none;stroke-width:1;stroke-linejoin:round;stroke-miterlimit:4;stroke-opacity:1"
         id="path3495"
         d="M 80.590836,-598.40924 H 341.70515 v 335.6842 H 80.590836 Z" />
      <path
         style="opacity:1;fill:#000000;fill-opacity:1;fill-rule:evenodd;stroke:none;stroke-width:5.48529px;stroke-linecap:butt;stroke-linejoin:miter;stroke-opacity:1"
         id="path2416"
         d="m 415.9375,112.65625 v 175.25 h 36.59375 v -175.25 z M 285.0625,113.75 v 39.9375 h 56.5625 l -58.78125,96.5 V 289 H 390.4375 v -38.8125 h -68.78125 l 71,-100.9375 v -35.5 z m 200.71875,0.0625 v 176.21875 h 39.9375 v -62.0625 h 26.59375 c 42.58932,-0.14551 43.71957,-115.49542 -2.25,-114.15625 z M 523.5,151.53125 h 15.59375 c 17.34763,-0.59446 17.71316,38.93681 0,36.5 L 524.6875,189.25 Z" />
      <g
         id="g2424"
         clip-path="url(#clipPathN)">
        <g
           id="g2426">
          <path
             style="fill:none;stroke:#ffffff;stroke-width:10;stroke-opacity:1;filter:url(#filterI)"
             id="path2428"
             d="m 452.53125,287.90625 v -175.25 m 0,0 H 415.9375 M 390.4375,289 v -38.8125 m 0,0 h -68.78125 m 0,0 71,-100.9375 m 0,0 v -35.5 m 0,0 H 285.0625 m 240.65625,176.28125 v -62.0625 m 26.59375,0 c 42.58932,-0.14551 43.71957,-115.49542 -2.25,-114.15625 m 0,0 h -64.28125 m 53.3125,74.21875 -14.40625,1.21875 m 0,0 -1.1875,-37.71875" />
          <path
             style="fill:none;stroke:#000000;stroke-width:10;stroke-opacity:1;filter:url(#filterI)"
             id="path2430"
             d="m 415.9375,112.65625 v 175.25 m 0,0 h 36.59375 M 285.0625,113.75 v 39.9375 m 0,0 h 56.5625 m 0,0 -58.78125,96.5 m 0,0 V 289 m 0,0 H 390.4375 m 95.34375,-175.1875 v 176.21875 m 0,0 h 39.9375 m 0,-62.0625 H 552.3125 M 523.5,151.53125 h 15.59375 m 0,0 c 17.34763,-0.59446 17.71316,38.93681 0,36.5" />
        </g>
      </g>
      <g
         id="g3512"
         clip-path="url(#clipPathk)">
        <g
           id="g3514">
          <path
             transform="rotate(90)"
             style="fill:none;stroke:#ffffff;stroke-width:10;stroke-opacity:1;filter:url(#filterHr)"
             id="path3516"
             d="M 80.590836,-598.40924 H 341.70515 m -261.114314,335.6842 v -335.6842" />
          <path
             transform="rotate(90)"
             style="fill:none;stroke:#000000;stroke-width:10;stroke-opacity:1;filter:url(#filterHr)"
             id="path3518"
             d="m 341.70515,-598.40924 v 335.6842 m 0,0 H 80.590836" />
        </g>
      </g>
    </g>
  </g>
</svg>
