<?xml version="1.0" encoding="UTF-8" standalone="no"?>
<svg
   xmlns:dc="http://purl.org/dc/elements/1.1/"
   xmlns:cc="http://creativecommons.org/ns#"
   xmlns:rdf="http://www.w3.org/1999/02/22-rdf-syntax-ns#"
   xmlns:svg="http://www.w3.org/2000/svg"
   xmlns="http://www.w3.org/2000/svg"
   xmlns:sodipodi="http://sodipodi.sourceforge.net/DTD/sodipodi-0.dtd"
   xmlns:inkscape="http://www.inkscape.org/namespaces/inkscape"
   viewBox="0 0 9.9653021 9.96352"
   width="512"
   height="512"
   version="1.1"
   id="svg6"
   sodipodi:docname="lang-perl.svg"
   inkscape:version="0.92.4 (unknown)">
  <metadata
     id="metadata12">
    <rdf:RDF>
      <cc:Work
         rdf:about="">
        <dc:format>image/svg+xml</dc:format>
        <dc:type
           rdf:resource="http://purl.org/dc/dcmitype/StillImage" />
        <dc:title>perl</dc:title>
      </cc:Work>
    </rdf:RDF>
  </metadata>
  <defs
     id="defs10" />
  <sodipodi:namedview
     pagecolor="#ffffff"
     bordercolor="#666666"
     borderopacity="1"
     objecttolerance="10"
     gridtolerance="10"
     guidetolerance="10"
     inkscape:pageopacity="0"
     inkscape:pageshadow="2"
     inkscape:window-width="1920"
     inkscape:window-height="1032"
     id="namedview8"
     showgrid="false"
     inkscape:showpageshadow="false"
     fit-margin-top="0"
     fit-margin-left="0"
     fit-margin-right="0"
     fit-margin-bottom="0"
     inkscape:zoom="1.6132812"
     inkscape:cx="256"
     inkscape:cy="256"
     inkscape:window-x="0"
     inkscape:window-y="23"
     inkscape:window-maximized="1"
     inkscape:current-layer="svg6" />
  <title
     id="title2">perl</title>
  <circle
     style="opacity:1;fill:none;fill-opacity:1;stroke:none;stroke-width:0.26132113;stroke-linecap:round;stroke-linejoin:round;stroke-miterlimit:4;stroke-dasharray:none;stroke-dashoffset:0;stroke-opacity:1;paint-order:stroke fill markers"
     id="path816"
     cx="4.9826512"
     cy="4.98176"
     r="4.9826512" />
  <path
     d="m 5.8988438,5.4109615 a 12.381914,12.381914 0 0 1 0.1525785,1.3359489 1.3164322,1.3164322 0 0 1 -0.232416,0.7824078 c -0.037258,0.1330619 -0.14903,0 -0.2288676,0 -0.1969326,0 -0.2696734,-0.2129003 -0.3761235,-0.3441892 C 5.1075652,7.0538411 5.183854,6.934972 5.2548214,6.8302957 5.3311104,6.775295 5.3612715,6.652879 5.4712699,6.652879 c 0.1099983,0 0.095805,-0.1508041 0.079837,-0.2306417 0.072741,-0.1117727 0.028387,-0.2767705 0.099353,-0.3991872 0.1277399,-0.056776 0.090482,-0.2554805 0.1348367,-0.3672531 0.035484,-0.079833 0,-0.2324157 0.1011275,-0.2661254 0,0 0.012418,0 0.010645,0.017739 M 5.7746521,0.85135157 C 5.6078804,0.83183541 5.4819145,0.94538284 5.3417553,1.0092529 A 3.1935013,3.1935013 0 0 1 4.9869218,1.1050573 C 4.8999877,1.2824749 4.6995067,1.3871503 4.5912825,1.553922 A 1.7741674,1.7741674 0 0 1 3.9987106,2.3913288 C 3.6048454,2.595358 3.4061387,3.0389001 3.2766244,3.4558296 3.2322705,3.54986 3.2393669,3.6882453 3.1914643,3.7680829 3.0353376,3.8124386 3.118723,3.6084076 3.1009818,3.5108286 3.0779179,3.365347 3.2056577,3.2713157 3.2145285,3.1293827 a 0.58370107,0.58370107 0 0 0 0.06387,-0.3282208 C 3.260657,2.5474554 3.3369461,2.2387508 3.1577552,2.031173 3.0513052,1.9690776 3.0850144,1.8377888 3.0459827,1.7366611 A 1.2898197,1.2898197 0 0 0 2.6503433,1.3818278 C 2.5226033,1.369409 2.4055083,1.2044112 2.2742199,1.2807002 2.1926084,1.3765054 2.0418039,1.3747314 1.9939014,1.5024717 1.9637406,1.662146 1.7845496,1.619566 1.6674545,1.6585983 c -0.14903,0.058543 -0.3406401,0 -0.4630576,0.118869 C 1.0819793,1.8963364 0.88149845,2.0702043 0.94182014,2.2706859 1.0819793,2.5456816 1.4439094,2.4072963 1.6408421,2.5740679 A 5.6773357,5.6773357 0 0 1 1.4261678,3.1169638 3.2041464,3.2041464 0 0 0 1.4119745,3.842598 c 0.037257,0.2412868 -0.024839,0.5517662 0.1774167,0.7220864 0.1153209,0.04258 0.1082242,0.1774167 0.1525784,0.2767696 0.044354,0.099354 0.1295144,-0.035486 0.1649976,0.060319 0.1029017,0.056776 0.010645,0.1774166 0.067418,0.2483831 A 0.48967019,0.48967019 0 0 1 2.2245428,5.2832187 2.0970659,2.0970659 0 0 1 2.5279254,5.540473 C 2.5988924,5.6859546 2.6893747,5.3985392 2.767438,5.5067622 a 0.17741674,0.17741674 0 0 0 0.250158,0.088713 0.90482533,0.90482533 0 0 0 0.3974135,-0.1720941 c 0.076289,0.2714471 0.017741,0.565959 0.051451,0.846278 A 3.7062356,3.7062356 0 0 1 3.5551691,6.8923919 2.9912462,2.9912462 0 0 1 3.6474258,7.5239957 2.2531926,2.2531926 0 0 1 3.4309774,8.8173636 0.31225346,0.31225346 0 0 1 3.1843681,9.0657467 C 3.0956598,9.1065511 2.9111462,9.1792932 2.9732421,9.3070334 3.1790455,9.48445 3.5054924,9.4649348 3.7414566,9.3744548 3.8975834,9.298164 3.7627467,9.1083293 3.8425842,8.9930081 3.9472601,8.5884983 3.8958093,8.1556012 4.0200009,7.7510914 A 1.1922404,1.1922404 0 0 0 4.1246768,7.0964237 C 4.1495155,6.9598124 4.092742,6.7948155 4.1814504,6.6830428 A 0.56950773,0.56950773 0 0 1 4.3251579,6.3104672 4.6908985,4.6908985 0 0 0 4.3695121,5.6806382 0.9669212,0.9669212 0 0 1 4.7562807,5.641609 c 0,0.1170952 -0.083386,0.2519319 -0.058548,0.3832206 A 0.61741025,0.61741025 0 0 1 4.617895,6.4524043 C 4.562897,6.683046 4.525638,6.9669129 4.669346,7.1620709 4.9070844,7.4228738 5.2175638,7.6073869 5.442883,7.8859312 A 0.1632234,0.1632234 0 0 1 5.4535286,8.1307669 0.47192852,0.47192852 0 0 1 5.1519201,8.4518912 C 5.0578892,8.4891531 4.907085,8.6293079 5.0170834,8.7268869 A 1.1727246,1.1727246 0 0 0 5.6823962,8.6825308 C 5.8278779,8.6293054 5.7746527,8.453663 5.8314263,8.3436641 a 3.5022064,3.5022064 0 0 1 0.2164484,0.3317694 c 0.090482,0.1348366 0.2466092,0.023066 0.3548334,-0.019515 A 1.1177254,1.1177254 0 0 0 6.2873865,8.0846321 C 6.23771,7.9675369 6.0443256,7.9639892 6.0531963,7.8202815 6.1490014,7.4654481 6.3867398,7.1886777 6.5748016,6.8888433 6.7309283,6.7398131 6.6138331,6.5180424 6.6227042,6.3299808 a 2.1290008,2.1290008 0 0 1 0.3317693,-1.3767541 4.9942812,4.9942812 0 0 0 0.211126,0.6653127 1.9515842,1.9515842 0 0 0 0.3299951,0.7025702 c 0.072741,0.2519318 0.053225,0.53225 0.1011275,0.793053 a 3.3105964,3.3105964 0 0 1 -0.074515,1.3519153 c 0.012419,0.1614492 -0.1401593,0.2803183 -0.1259659,0.4382197 0.04258,0.1454816 0.2129001,0.028384 0.3016084,0.090482 A 0.33709181,0.33709181 0 0 0 8.1023598,8.8173636 1.9888416,1.9888416 0 0 1 8.0278446,8.4394654 2.3614167,2.3614167 0 0 1 7.9497808,7.2827089 C 7.9639745,7.0733564 8.0899401,6.8178768 7.9267169,6.6386854 7.882363,6.447076 7.958652,6.2394982 7.9125233,6.0425653 A 4.080585,4.080585 0 0 1 7.8752657,4.5079107 c 0.028387,-0.070964 0,-0.2022553 0.076289,-0.2412868 a 0.58370107,0.58370107 0 0 1 0.095805,0.3832207 1.1727246,1.1727246 0 0 1 0.024839,0.6475703 C 7.9426839,5.4624127 8.0225217,5.6859581 8.0384892,5.8722451 8.0597787,6.0035338 8.19639,5.909507 8.2159059,5.8278889 A 3.7133323,3.7133323 0 0 0 8.5033213,5.1306416 c 0.081611,-0.109998 0,-0.239512 0,-0.3548333 C 8.6292871,4.7598364 8.5813851,4.6179078 8.5139664,4.5558115 8.4465476,4.3287184 8.4625151,4.0661417 8.3099371,3.8727574 A 3.2715646,3.2715646 0 0 1 7.7173654,3.0247064 C 7.5559162,2.5155204 7.0946326,2.1766545 6.9385059,1.662146 A 1.1053063,1.1053063 0 0 0 6.4435132,0.94006033 2.3489976,2.3489976 0 0 0 6.0886797,0.81054625 1.9302941,1.9302941 0 0 1 5.7746521,0.84957769"
     id="path4"
     inkscape:connector-curvature="0"
     style="fill:#004065;stroke-width:0.17741674" />
</svg>
