<?xml version="1.0" encoding="UTF-8" standalone="no"?>
<svg
   xmlns:dc="http://purl.org/dc/elements/1.1/"
   xmlns:cc="http://creativecommons.org/ns#"
   xmlns:rdf="http://www.w3.org/1999/02/22-rdf-syntax-ns#"
   xmlns:svg="http://www.w3.org/2000/svg"
   xmlns="http://www.w3.org/2000/svg"
   xmlns:xlink="http://www.w3.org/1999/xlink"
   xmlns:sodipodi="http://sodipodi.sourceforge.net/DTD/sodipodi-0.dtd"
   xmlns:inkscape="http://www.inkscape.org/namespaces/inkscape"
   inkscape:version="1.0 (1.0+r73+1)"
   height="512"
   width="482.70856"
   sodipodi:docname="browser-opera-2.svg"
   y="0px"
   xml:space="preserve"
   x="0px"
   viewBox="0 0 482.70856 512"
   version="1.1"
   id="Layer_1"
   enable-background="new 0 0 256 256"><metadata
   id="metadata171"><rdf:RDF><cc:Work
       rdf:about=""><dc:format>image/svg+xml</dc:format><dc:type
         rdf:resource="http://purl.org/dc/dcmitype/StillImage" /><dc:title></dc:title></cc:Work></rdf:RDF></metadata><defs
   id="defs169" /><sodipodi:namedview
   inkscape:current-layer="Layer_1"
   inkscape:window-maximized="1"
   inkscape:window-y="24"
   inkscape:window-x="0"
   inkscape:cy="256"
   inkscape:cx="241.35428"
   inkscape:zoom="1.6035156"
   fit-margin-bottom="0"
   fit-margin-right="0"
   fit-margin-left="0"
   fit-margin-top="0"
   inkscape:showpageshadow="false"
   showgrid="false"
   id="namedview167"
   inkscape:window-height="1033"
   inkscape:window-width="1920"
   inkscape:pageshadow="2"
   inkscape:pageopacity="0"
   guidetolerance="10"
   gridtolerance="10"
   objecttolerance="10"
   borderopacity="1"
   bordercolor="#666666"
   pagecolor="#ffffff" />



<linearGradient
   y2="241.77139"
   y1="14.8213"
   x2="148.68201"
   x1="108.6646"
   id="SVGID_5_"
   gradientUnits="userSpaceOnUse">
	<stop
   id="stop50"
   stop-color="#FF8C8F"
   offset="0" />
	<stop
   id="stop52"
   stop-color="#F21818"
   offset="0.3804" />
	<stop
   id="stop54"
   stop-color="#E51515"
   offset="0.4461" />
	<stop
   id="stop56"
   stop-color="#C20E0E"
   offset="0.5683" />
	<stop
   id="stop58"
   stop-color="#8A0202"
   offset="0.7324" />
	<stop
   id="stop60"
   stop-color="#800000"
   offset="0.7607" />
</linearGradient>

<linearGradient
   y2="239.29491"
   y1="216.71001"
   x2="127.7759"
   x1="127.7759"
   id="SVGID_6_"
   gradientUnits="userSpaceOnUse">
	<stop
   id="stop65"
   stop-opacity="0"
   stop-color="#FF444C"
   offset="0" />
	<stop
   id="stop67"
   stop-opacity="0.2367"
   stop-color="#FF393F"
   offset="0.2367" />
	<stop
   id="stop69"
   stop-opacity="0.6708"
   stop-color="#FF1B1E"
   offset="0.6708" />
	<stop
   id="stop71"
   stop-color="#F00"
   offset="1" />
</linearGradient>

<linearGradient
   y2="24.047701"
   y1="217.54201"
   x2="129.35651"
   x1="126.9907"
   id="SVGID_7_"
   gradientUnits="userSpaceOnUse">
	<stop
   id="stop76"
   stop-color="#E60000"
   offset="0" />
	<stop
   id="stop78"
   stop-color="#DC0B0A"
   offset="0.3568" />
	<stop
   id="stop80"
   stop-color="#C02825"
   offset="0.9811" />
	<stop
   id="stop82"
   stop-color="#BF2926"
   offset="1" />
</linearGradient>

<linearGradient
   y2="25.653799"
   y1="216.1572"
   x2="128.2973"
   x1="128.29739"
   id="SVGID_8_"
   gradientUnits="userSpaceOnUse">
	<stop
   id="stop87"
   stop-color="#B80000"
   offset="0" />
	<stop
   id="stop89"
   stop-color="#900"
   offset="1" />
</linearGradient>



<linearGradient
   y2="182.15041"
   y1="182.15041"
   x2="234.4102"
   x1="22.3491"
   id="SVGID_13_"
   gradientUnits="userSpaceOnUse">
	<stop
   id="stop152"
   stop-color="#E8000F"
   offset="0" />
	<stop
   id="stop154"
   stop-color="#E0000F"
   offset="1" />
</linearGradient>

<linearGradient
   y2="1.6424"
   y1="104.6548"
   x2="128.2612"
   x1="128.2612"
   id="SVGID_14_"
   gradientUnits="userSpaceOnUse">
	<stop
   id="stop159"
   stop-opacity="0"
   stop-color="#FFF"
   offset="0" />
	<stop
   id="stop161"
   stop-color="#FFF"
   offset="1" />
</linearGradient>
<g
   transform="matrix(2.2224151,0,0,2.2224151,-43.137077,-24.913273)"
   id="g212"><ellipse
     clip-rule="evenodd"
     cx="127.998"
     cy="126"
     fill="#ffffff"
     fill-rule="evenodd"
     opacity="0.01"
     rx="74.075996"
     ry="104"
     id="ellipse2" /><path
     style="fill:url(#SVGID_5_)"
     clip-rule="evenodd"
     d="m 127.58,219.93 c 38.093,0 41.525,-57.701 41.525,-96.527 0,-44.688 -6.686,-93.438 -41.525,-93.438 -34.833,0 -40.667,51.831 -40.667,93.438 -0.005,38.47 3.117,96.53 40.667,96.53 z M 127.57,11.21 c 62.368,0 109.04,45.103 109.04,114.12 0,60.942 -44.215,116.26 -109.03,116.26 C 63.393,241.59 19.41,186.258 19.41,125.33 19.409,56.86 64.637,11.21 127.57,11.21 Z"
     fill="url(#SVGID_5_)"
     fill-rule="evenodd"
     id="path63" /><path
     style="fill:url(#SVGID_6_)"
     clip-rule="evenodd"
     d="m 191.99,216.63 c -16.223,14.319 -37.636,22.453 -64.411,22.453 -26.537,0 -47.842,-8.134 -64.021,-22.453 l 54.895,-0.132 c 2.813,0.777 5.849,1.185 9.126,1.185 3.324,0 6.4,-0.271 9.246,-1.048 h 55.16 z"
     fill="url(#SVGID_6_)"
     fill-rule="evenodd"
     opacity="0.5"
     id="path74" /><path
     style="fill:url(#SVGID_7_)"
     clip-rule="evenodd"
     d="m 127.56,217.11 c -38.832,0 -40.449,-55.159 -40.449,-93.828 0,-45.36 4.392,-88.925 40.449,-88.925 36.061,0 41.547,44.113 41.547,88.88 -0.01,38.74 -2.17,93.87 -41.55,93.87 z m 0.01,-188.49 c -42.417,0 -46.658,56.642 -46.658,94.636 0,43.015 8.46,98.88 46.658,98.88 40.686,0 47.812,-55.944 47.812,-98.88 0,-37.389 -4.52,-94.638 -47.81,-94.638 z"
     fill="url(#SVGID_7_)"
     fill-rule="evenodd"
     opacity="0.8"
     id="path85" /><path
     style="fill:url(#SVGID_8_)"
     clip-rule="evenodd"
     d="m 127.58,215.73 c -37.526,0 -39.021,-54.272 -39.021,-92.309 0,-44.63 4.177,-87.418 39.021,-87.418 34.847,0 40.107,43.33 40.107,87.373 -0.01,38.1 -2.05,92.35 -40.11,92.35 z m 0.01,-185.56 c -41.763,0 -44.731,56.157 -44.731,93.224 0,42.318 7.048,97.28 44.731,97.28 39.314,0 46.143,-55.04 46.143,-97.28 0,-36.472 -4.31,-93.225 -46.14,-93.225 z"
     fill="url(#SVGID_8_)"
     fill-rule="evenodd"
     id="path92" /><g
     opacity="0.5"
     id="g121">
	<defs
   id="defs99"><filter
     filterUnits="userSpaceOnUse"
     height="87.884003"
     id="Adobe_OpacityMaskFilter_2_"
     width="82.723999"
     x="86.783997"
     y="34.521">
			<feFlood
   result="back"
   id="feFlood94" />
			<feBlend
   in="SourceGraphic"
   in2="back"
   mode="normal"
   id="feBlend96" />
		</filter></defs>
	<mask
   height="87.884"
   id="SVGID_9_"
   maskUnits="userSpaceOnUse"
   width="82.724"
   x="86.784"
   y="34.521">
		<g
   filter="url(#Adobe_OpacityMaskFilter_2_)"
   id="g103">
				<image
   height="93"
   overflow="visible"
   transform="translate(84,32)"
   width="88"
   xlink:href="data:image/jpeg;base64,/9j/4AAQSkZJRgABAgEASABIAAD/7AARRHVja3kAAQAEAAAAHgAA/+4AIUFkb2JlAGTAAAAAAQMA EAMCAwYAAAHlAAACegAABTP/2wCEABALCwsMCxAMDBAXDw0PFxsUEBAUGx8XFxcXFx8eFxoaGhoX Hh4jJSclIx4vLzMzLy9AQEBAQEBAQEBAQEBAQEABEQ8PERMRFRISFRQRFBEUGhQWFhQaJhoaHBoa JjAjHh4eHiMwKy4nJycuKzU1MDA1NUBAP0BAQEBAQEBAQEBAQP/CABEIAF0AWAMBIgACEQEDEQH/ xACYAAEBAAMBAQAAAAAAAAAAAAAABQMEBgIHAQEAAAAAAAAAAAAAAAAAAAAAEAABBAEEAgIDAAAA AAAAAAAFAgMEBjAAECABUDQTBxUlNREAAgEDAQUFBAUNAAAAAAAAAQIDERIEIQAxIhMFEDBBURQg cTJ0YYFCtBWRsVKSIzOzJDTUNQYWEgEAAAAAAAAAAAAAAAAAAABQ/9oADAMBAAIRAxEAAAD5+B0G xFL2Tjx1k+HWJLquVAFSXaNPRAACt5l9Ic2DNtZpIAAAtRRkVBhm0poAAABWBhn0poAAABSB5ngA AABQTx//2gAIAQIAAQUA8J//2gAIAQMAAQUA8J//2gAIAQEAAQUA3D0+aQjoR9dj9fkvrbXcOgk9 G6kSENcQ40aKGljJExJ3AWQiCk2MGOkQdwI1qZIMlpJgjxrhxQadYg6Q5LaX12Or3P5lGqnqHFcm SzzzTxjnUZTbJuQw7GkVppzslhtLf7UelKBWEp2l8QlKW67h7TGcqr38HDGbcXX5iUtBMIxxzoeS 9LCN9LH/AP/aAAgBAgIGPwAT/9oACAEDAgY/ABP/2gAIAQEBBj8A7TnZsqdL6attcrJFtwcVVo1a 0FSSoqWA10ru2jaSTL6uzJbIqKYo1cW8dG5DCutBc30+B2/xOX+u391sxxczI6RPI6pFFkLzIl+E XGl3CddWlFDru29YCmX01qGPMgNyFXJsLLvFRTXVdQLj7R67/sMHO51v4Vgs1pnK8RkZKfBu1bSl eE1SrZGdMXNSY4gTy4g1OGNK8I0Hv8an2Fkx3L41SZsRmPLkDUDGn2W0FGp+Uabf9N0Bh+HyEDKx dFbHkYgUC+AuYVXwqCtUOnbJk5ht6bgJ6jMbXjRTwwIaqL5TwrxDxpuptNnZDGrkiKMm4RR1Nka6 DRfdrv3n2uZKpmwJwYs3F0KyxsCNVeqkrWo+sVAJ2bHhk5+JKiz4k9VPMhk+FqoSN4IrpWlaUPbi 4qsVyOqk5eWhDo3IiJjxV32srG9936PkK+36c/tM7oT3oSWLthS8L2rc13La2ugCoBr2QYcRAkyJ EiQtUKGkYIK0B012yjj2enifkY/LJZDDjgQREMWatUQa117iHHnBbF6gGwcmNaVdMgWBa1BAvtJI NdpcadbJoXaORag0dDawqKjeNmzEiEo6dBNnEMSFDY8bPExoykjm2aD81e6OasPp4upQxZ0aXX/1 CB5Nd/7y7y91KbdVyHcKrRw4yLrc0kkyTilBSgTHetT5d10jL55lkWObDkRgaxnHkMqC5t45c6gU 3Up9AldnF2VmRiKPW6mLFJzWOltP5lKa+fdK959Vi55Bj+zy8qEUY6b7sbSh86+G2F83l/w8Pus9 kUsseViNIQCQq2ZaVbyFzAfXt02MuDJNJk5IQVqsbmLHW4kAVLY77j3XWIgxEbYsbMlTaWXKxgpI 8xcae87dJ+Uf73ld11b5RPveL3n/2Q=="
   id="image101">
			</image>
		</g>
	</mask>
	<g
   mask="url(#SVGID_9_)"
   id="g119">
		<linearGradient
   gradientUnits="userSpaceOnUse"
   id="SVGID_10_"
   x1="128.146"
   x2="128.146"
   y1="120.3198"
   y2="32.435501">
			<stop
   offset="0"
   stop-color="#CF0000"
   stop-opacity="0"
   id="stop106" />
			<stop
   offset="0.1308"
   stop-color="#BF0000"
   stop-opacity="0.1308"
   id="stop108" />
			<stop
   offset="0.5151"
   stop-color="#960000"
   stop-opacity="0.5151"
   id="stop110" />
			<stop
   offset="0.8181"
   stop-color="#7C0000"
   stop-opacity="0.8181"
   id="stop112" />
			<stop
   offset="1"
   stop-color="#730000"
   id="stop114" />
		</linearGradient>
		<path
   style="fill:url(#SVGID_10_)"
   clip-rule="evenodd"
   d="m 86.784,122.41 c 0,-39.944 5.349,-86.399 40.79,-86.399 35.444,0 41.934,48.515 41.934,85.77 0,-33.652 -4.562,-87.254 -41.881,-87.254 -37.238,-0.005 -40.836,53.645 -40.836,87.884 z"
   fill="url(#SVGID_10_)"
   fill-rule="evenodd"
   id="path117" />
	</g>
</g><g
     opacity="0.15"
     id="g150">
	<defs
   id="defs128"><filter
     filterUnits="userSpaceOnUse"
     height="87.863998"
     id="Adobe_OpacityMaskFilter_3_"
     width="79.925003"
     x="88.088997"
     y="129.552">
			<feFlood
   result="back"
   id="feFlood123" />
			<feBlend
   in="SourceGraphic"
   in2="back"
   mode="normal"
   id="feBlend125" />
		</filter></defs>
	<mask
   height="87.864"
   id="SVGID_11_"
   maskUnits="userSpaceOnUse"
   width="79.925"
   x="88.089"
   y="129.552">
		<g
   filter="url(#Adobe_OpacityMaskFilter_3_)"
   id="g132">
				<image
   height="93"
   overflow="visible"
   transform="translate(86,127)"
   width="85"
   xlink:href="data:image/jpeg;base64,/9j/4AAQSkZJRgABAgEASABIAAD/7AARRHVja3kAAQAEAAAAHgAA/+4AIUFkb2JlAGTAAAAAAQMA EAMCAwYAAAHvAAACiQAABWn/2wCEABALCwsMCxAMDBAXDw0PFxsUEBAUGx8XFxcXFx8eFxoaGhoX Hh4jJSclIx4vLzMzLy9AQEBAQEBAQEBAQEBAQEABEQ8PERMRFRISFRQRFBEUGhQWFhQaJhoaHBoa JjAjHh4eHiMwKy4nJycuKzU1MDA1NUBAP0BAQEBAQEBAQEBAQP/CABEIAF0AVQMBIgACEQEDEQH/ xACaAAEBAAMBAQAAAAAAAAAAAAAABQMEBgIHAQEAAAAAAAAAAAAAAAAAAAAAEAACAQIEBgMBAAAA AAAAAAADBQQCBgAgMBQQUAESFRY0RSYXEQABAwIEAwYBCAsAAAAAAAABEQIDEgQhMRMFACIUECAw QTIVYfDxI3S0hcUGUXGBoUJSYjMkpEUSAQAAAAAAAAAAAAAAAAAAAFD/2gAMAwEAAhEDEQAAAOJ1 aE8AAAAuMgnz6ksAAAA6BkGjJqSwAABmw1DIji5D2N4kgAAVJdoigdFztQlrkMAHo3vNjmQADos3 L7hr4/qFA+a2MPLnryAH/9oACAECAAEFAOSf/9oACAEDAAEFAOSf/9oACAEBAAEFAJcUYI+j4yD2 MvhaP3LL4Wj9yxoFWm0e2P7cSKSq1dCHFJMl7+J7bBoEZFoW1t6XeLSo3LDQVdduvwvl7KfdEAcF 3nZdDwEPAoyObXzIlnlWTqeNk04W64pTsrltoqUuQYyFIwoptlTkt66BwY06ySkjnjyIxcLbWfMi EKptAZCEKTKs8vuFX9Jx+9xcnvW0yf/aAAgBAgIGPwAT/9oACAEDAgY/ABP/2gAIAQEBBj8AsZWE l11A6WQFEDhPNDy4ZUxjwulqZ1vtnVqsia9fWJklXR4fyr8ceNp+qP8Atd14X3T+FcbT9Uf9ruvC +6fwrjaLmOSpzWXFrLHSRQ+KZ0/qOdTbkZfN4Pt9b6KPadagLqdN7bqUV+mvm9WXx4t7wEacN/PE 4Y1VSwwPamGX0RX9ngwWcRAkuJGRMLlDQ6RwYFQHDHj3LU/w/ceo1Ud/a19SqlKvT5IvG6RmSiaF 9rdMjpJrYx0lu/myCG4aflh4FtPc16NrqXbhGlZ6WN9yAKsMTH83ZcbYI2SO3K0ntozJ6I5Kddkh 5XZOiH6s/Lwd0vqmNcIWWkNTan6l07moVpDfoI5QSozwz7La9o1OmmjmoWmrTcH0qhRU4uWQIbWY i4tXsaGxuimGo3SRWlrVpBGGHgbdtj3EG7LtzkYjaQ2UCG3RwLiTTG5xy9QGY7YJ4WmS72MuhusC 97rSVZIpC8pyx0loaFQK7Ad+K1e7Ttwsl1MTSIoI+aR5ejg3DAE4Ki8XF5DGIYHkNgia0MDIo2iK IUgkA0NCph+jtbcTR69pKx0F3AjTqQyepqPBGYBTBURUPDJ4H9TtdzzWl21HAhwqDHluFSYgjBwx HmB3GxRNL5HkNYxoLnOc4oAAMyeHbUsbt53ELfyMcS+1t+RzLapppV+bk8sCCKXd2Xad3iN7s04K whC+Jx5ljUtwLsUUIeZpBVTuH5euWbtY4mlhAnjwL6XM83BtKjByn0cOguYnwzMSqORpY8KFCtch yPZG23s5GRyAPE8rTHFQ4jnreOYYryqUyB4cyxlF9+ZEMUs6VQWbiOfSqbzOxp88itOLC6WVxfI8 lz3uJc5znFSSTmT3ne0dR1FBr6SvU01CrpY0qnEvVdJ/DR1lP9S0dF++r4J58f8AJ/2eB75rdHjV Rp6XqYmr03L6kpr88vPu/wD/2Q=="
   id="image130">
			</image>
		</g>
	</mask>
	<g
   mask="url(#SVGID_11_)"
   id="g148">
		<linearGradient
   gradientUnits="userSpaceOnUse"
   id="SVGID_12_"
   x1="128.0513"
   x2="128.0513"
   y1="215.33009"
   y2="127.4658">
			<stop
   offset="0"
   stop-color="#730000"
   id="stop135" />
			<stop
   offset="0.1819"
   stop-color="#7C0000"
   stop-opacity="0.8181"
   id="stop137" />
			<stop
   offset="0.4849"
   stop-color="#960000"
   stop-opacity="0.5151"
   id="stop139" />
			<stop
   offset="0.8692"
   stop-color="#BF0000"
   stop-opacity="0.1308"
   id="stop141" />
			<stop
   offset="1"
   stop-color="#CF0000"
   stop-opacity="0"
   id="stop143" />
		</linearGradient>
		<path
   style="fill:url(#SVGID_12_)"
   clip-rule="evenodd"
   d="m 168.01,129.55 c 0,39.944 -5.873,86.379 -40.158,86.379 -34.289,0 -39.767,-45.964 -39.767,-85.749 0,36.186 3.613,87.234 39.714,87.234 36.04,0.01 40.21,-53.63 40.21,-87.86 z"
   fill="url(#SVGID_12_)"
   fill-rule="evenodd"
   id="path146" />
	</g>
</g><path
     style="fill:url(#SVGID_13_)"
     clip-rule="evenodd"
     d="m 22.349,124.62 c 0,58.949 40.173,115.07 105.47,115.07 65.771,0 106.59,-57.72 106.59,-115.07 0,56.832 -41.77,114.15 -106.59,114.15 C 63.485,238.76 22.349,183.02 22.349,124.62 Z"
     fill="url(#SVGID_13_)"
     fill-rule="evenodd"
     opacity="0.8"
     id="path157" /><path
     style="fill:url(#SVGID_14_)"
     clip-rule="evenodd"
     d="m 22.737,121.94 c 0,-48.528 33.292,-108.32 104.84,-108.32 59.595,0 106.21,46.224 106.21,108.32 0,-62.712 -42.592,-110.57 -106.21,-110.57 C 63.462,11.363 22.737,57.92 22.737,121.94 Z"
     fill="url(#SVGID_14_)"
     fill-rule="evenodd"
     opacity="0.65"
     id="path164" /></g>
</svg>
