<?xml version="1.0" encoding="UTF-8" standalone="no"?>
<svg
   xmlns:dc="http://purl.org/dc/elements/1.1/"
   xmlns:cc="http://creativecommons.org/ns#"
   xmlns:rdf="http://www.w3.org/1999/02/22-rdf-syntax-ns#"
   xmlns:svg="http://www.w3.org/2000/svg"
   xmlns="http://www.w3.org/2000/svg"
   xmlns:sodipodi="http://sodipodi.sourceforge.net/DTD/sodipodi-0.dtd"
   xmlns:inkscape="http://www.inkscape.org/namespaces/inkscape"
   inkscape:version="1.0 (1.0+r73+1)"
   sodipodi:docname="db-liquibase.svg"
   id="svg12"
   version="1.1"
   fill="none"
   viewBox="0 0 370.96732 512"
   height="512"
   width="370.96732">
  <metadata
     id="metadata18">
    <rdf:RDF>
      <cc:Work
         rdf:about="">
        <dc:format>image/svg+xml</dc:format>
        <dc:type
           rdf:resource="http://purl.org/dc/dcmitype/StillImage" />
        <dc:title></dc:title>
      </cc:Work>
    </rdf:RDF>
  </metadata>
  <defs
     id="defs16" />
  <sodipodi:namedview
     inkscape:current-layer="svg12"
     inkscape:window-maximized="1"
     inkscape:window-y="24"
     inkscape:window-x="0"
     inkscape:cy="256"
     inkscape:cx="185.48366"
     inkscape:zoom="1.6386719"
     fit-margin-bottom="0"
     fit-margin-right="0"
     fit-margin-left="0"
     fit-margin-top="0"
     inkscape:showpageshadow="false"
     showgrid="false"
     id="namedview14"
     inkscape:window-height="1033"
     inkscape:window-width="1920"
     inkscape:pageshadow="2"
     inkscape:pageopacity="0"
     guidetolerance="10"
     gridtolerance="10"
     objecttolerance="10"
     borderopacity="1"
     bordercolor="#666666"
     pagecolor="#ffffff" />
  <g
     transform="matrix(1.9155848,0,0,1.9155848,-1.4090161e-6,0)"
     id="g10"
     opacity="0.5">
    <path
       id="path2"
       fill="#ff3d00"
       d="m 96.8995,0 c 8.6105,0.478654 15.5355,0.574385 22.3675,1.2445 15.911,1.5317 31.54,4.88228 46.421,11.2005 8.61,3.7335 16.752,8.2329 23.023,15.6041 6.27,7.4671 6.645,15.1255 0.749,22.4968 -2.34,2.8719 -5.148,5.5524 -8.143,7.7542 -9.546,7.1798 -20.496,11.2005 -31.82,14.4554 -20.122,5.6481 -40.618,7.467 -61.3949,6.4139 C 77.9008,78.6908 67.7931,77.0633 57.7791,75.5317 46.3611,73.8085 35.5047,70.2664 25.1163,65.2884 18.0971,62.0336 11.733,58.0129 6.58556,52.2691 0.689418,45.8551 -0.714425,39.0582 3.21634,32.2613 5.27531,28.6235 8.36376,25.3687 11.5458,22.6882 19.1266,16.2742 28.1112,12.1578 37.4701,9.28589 45.7996,6.79689 54.3162,4.78654 62.8329,2.87193 66.2021,2.10608 69.7585,1.81889 73.2213,1.53169 81.738,0.861578 90.1611,0.382923 96.8995,0 Z" />
    <path
       id="path4"
       fill="#ff3d00"
       d="m 192.47,140.361 c 0.093,1.341 0.28,2.298 0.28,3.255 0,7.371 0,14.838 0,22.21 0,8.903 -3.743,15.987 -10.107,21.731 -8.985,8.137 -19.748,13.019 -30.978,16.752 -12.635,4.213 -25.457,7.85 -38.279,11.392 -12.073,3.255 -24.4264,5.936 -36.4995,9.095 -17.0333,4.499 -33.973,9.286 -49.8832,17.231 -3.0885,1.532 -6.0834,3.255 -8.9846,5.074 -1.5911,0.957 -2.9013,1.053 -4.3052,-0.096 -2.9012,-2.584 -6.17687,-4.978 -8.79738,-7.85 -6.36409,-7.084 -5.98973,-15.604 -2.05897,-23.549 4.21153,-8.52 11.60515,-13.786 19.56025,-18.189 11.9794,-6.606 24.8948,-11.009 37.9973,-14.36 13.4769,-3.542 27.0474,-6.701 40.6183,-10.147 10.669,-2.681 21.338,-5.361 32.007,-7.946 12.261,-2.968 24.427,-6.605 35.939,-11.87 6.832,-3.064 13.196,-7.18 19.747,-10.818 0.842,-0.479 1.591,-1.053 2.433,-1.532 0.281,-0.095 0.562,-0.191 1.311,-0.383 z" />
    <path
       id="path6"
       fill="#ff3d00"
       d="m 192.751,93.2607 c 0,3.3506 -0.094,6.7012 0,10.0523 0.561,11.009 -4.586,18.859 -12.916,24.986 -9.452,6.892 -20.122,11.2 -31.072,14.646 -9.358,2.968 -18.811,5.649 -28.264,8.138 -10.762,2.776 -21.5252,5.073 -32.288,7.658 -7.0192,1.723 -14.132,3.447 -21.0576,5.265 -7.3936,1.915 -14.7872,3.925 -22.0872,6.223 -14.7871,4.691 -29.1999,10.339 -41.74091,19.912 -0.74871,0.575 -1.7782,0.766 -2.620504,1.149 C 0.517607,190.333 0.143249,189.375 0.143249,188.322 -0.0439305,175.973 2.3894,164.389 9.22144,154.05 15.024,145.243 22.6983,138.638 31.4022,133.181 c 11.5115,-7.18 23.9589,-12.35 36.8743,-16.083 12.541,-3.638 25.2691,-6.989 37.9035,-10.243 13.103,-3.447 26.392,-6.414 39.495,-9.9565 12.822,-3.4463 25.55,-7.2756 37.062,-14.1683 2.433,-1.436 4.679,-3.1591 7.019,-4.6909 0.655,-0.4786 1.497,-0.6701 2.246,-0.9573 0.281,0.7659 0.655,1.5317 0.749,2.3933 0.093,4.4994 0,9.0945 0,13.7854 z" />
    <path
       id="path8"
       fill="#ff3d00"
       d="m 192.376,202.012 c 0.188,1.244 0.375,2.106 0.375,2.872 0,7.371 0,14.646 0,22.018 -0.094,7.275 -4.212,12.253 -9.266,16.752 -6.551,5.744 -14.132,9.478 -22.087,12.637 -9.546,3.829 -19.466,6.318 -29.481,8.041 -13.196,2.202 -26.485,3.255 -39.7751,2.872 -3.4628,-0.096 -6.8321,-0.191 -10.2949,-0.478 -12.7282,-0.766 -25.2692,-2.777 -37.5294,-6.127 -2.9949,-0.862 -5.9897,-1.915 -8.9846,-2.968 0,-0.287 0,-0.574 0,-0.957 1.9654,-0.957 3.9308,-2.01 5.9897,-2.872 12.2603,-5.074 24.8013,-8.903 37.6231,-12.062 13.3833,-3.351 26.7662,-6.606 40.1502,-10.052 15.442,-4.021 30.884,-8.137 45.671,-14.264 8.704,-3.542 17.127,-7.658 24.614,-13.593 0.749,-0.671 1.779,-1.053 2.995,-1.819 z" />
  </g>
</svg>
