<?xml version="1.0" encoding="UTF-8" standalone="no"?>
<svg
   xmlns:dc="http://purl.org/dc/elements/1.1/"
   xmlns:cc="http://creativecommons.org/ns#"
   xmlns:rdf="http://www.w3.org/1999/02/22-rdf-syntax-ns#"
   xmlns:svg="http://www.w3.org/2000/svg"
   xmlns="http://www.w3.org/2000/svg"
   xmlns:sodipodi="http://sodipodi.sourceforge.net/DTD/sodipodi-0.dtd"
   xmlns:inkscape="http://www.inkscape.org/namespaces/inkscape"
   width="382.30069"
   height="512"
   viewBox="0 0 39.147591 52.4288"
   preserveAspectRatio="xMidYMid"
   version="1.1"
   id="svg13"
   sodipodi:docname="apple-macos_x.svg"
   inkscape:version="0.92.4 (unknown)">
  <metadata
     id="metadata17">
    <rdf:RDF>
      <cc:Work
         rdf:about="">
        <dc:format>image/svg+xml</dc:format>
        <dc:type
           rdf:resource="http://purl.org/dc/dcmitype/StillImage" />
        <dc:title></dc:title>
      </cc:Work>
    </rdf:RDF>
  </metadata>
  <sodipodi:namedview
     pagecolor="#ffffff"
     bordercolor="#666666"
     borderopacity="1"
     objecttolerance="10"
     gridtolerance="10"
     guidetolerance="10"
     inkscape:pageopacity="0"
     inkscape:pageshadow="2"
     inkscape:window-width="1600"
     inkscape:window-height="851"
     id="namedview15"
     showgrid="false"
     inkscape:showpageshadow="false"
     fit-margin-top="0"
     fit-margin-left="0"
     fit-margin-right="0"
     fit-margin-bottom="0"
     inkscape:zoom="1.2597656"
     inkscape:cx="191.15034"
     inkscape:cy="256"
     inkscape:window-x="0"
     inkscape:window-y="24"
     inkscape:window-maximized="1"
     inkscape:current-layer="svg13" />
  <defs
     id="defs7">
    <linearGradient
       x1="148.12979"
       y1="42.522709"
       x2="148.12979"
       y2="178.68871"
       id="a"
       gradientTransform="scale(0.28749903,0.38503593)"
       gradientUnits="userSpaceOnUse">
      <stop
         stop-color="#58B0E3"
         offset="0%"
         id="stop2" />
      <stop
         stop-color="#F44E28"
         offset="100%"
         id="stop4" />
    </linearGradient>
  </defs>
  <path
     d="M 39.147591,0 H 36.561086 L 19.650985,24.43838 H 19.496606 L 2.6250998,0 H 0 L 18.222651,26.29159 0.07685654,52.4288 H 2.6633617 L 19.457679,28.06761 h 0.154379 L 36.406042,52.4288 h 2.625433 L 20.886013,26.29159 39.147259,0 Z"
     id="path11"
     inkscape:connector-curvature="0"
     style="fill:url(#a);stroke-width:0.33271226" />
</svg>
