<?xml version="1.0" encoding="UTF-8" standalone="no"?>
<svg
   xmlns:dc="http://purl.org/dc/elements/1.1/"
   xmlns:cc="http://creativecommons.org/ns#"
   xmlns:rdf="http://www.w3.org/1999/02/22-rdf-syntax-ns#"
   xmlns:svg="http://www.w3.org/2000/svg"
   xmlns="http://www.w3.org/2000/svg"
   xmlns:sodipodi="http://sodipodi.sourceforge.net/DTD/sodipodi-0.dtd"
   xmlns:inkscape="http://www.inkscape.org/namespaces/inkscape"
   height="512"
   width="512"
   inkscape:version="1.0 (1.0+r73+1)"
   sodipodi:docname="db-db2.svg"
   xml:space="preserve"
   viewBox="0 0 511.99999 511.99998"
   y="0px"
   x="0px"
   id="IBM_DB2"
   version="1.1"><metadata
   id="metadata157"><rdf:RDF><cc:Work
       rdf:about=""><dc:format>image/svg+xml</dc:format><dc:type
         rdf:resource="http://purl.org/dc/dcmitype/StillImage" /><dc:title></dc:title></cc:Work></rdf:RDF></metadata><defs
   id="defs155" /><sodipodi:namedview
   fit-margin-bottom="0"
   fit-margin-right="0"
   fit-margin-left="0"
   fit-margin-top="0"
   inkscape:showpageshadow="false"
   inkscape:current-layer="IBM_DB2"
   inkscape:window-maximized="1"
   inkscape:window-y="24"
   inkscape:window-x="0"
   inkscape:cy="256"
   inkscape:cx="256"
   inkscape:zoom="1.6386719"
   showgrid="false"
   id="namedview153"
   inkscape:window-height="1033"
   inkscape:window-width="1920"
   inkscape:pageshadow="2"
   inkscape:pageopacity="0"
   guidetolerance="10"
   gridtolerance="10"
   objecttolerance="10"
   borderopacity="1"
   bordercolor="#666666"
   pagecolor="#ffffff" />
<style
   id="style2"
   type="text/css">
	.st0{fill:#009C49;}
	.st1{fill:#FFFFFF;}
</style>
<g
   transform="translate(463.31897,-40.485668)"
   id="g945"><g
     id="g884"><path
       sodipodi:nodetypes="ssccccs"
       d="M -427.19446,40.485668 H 12.55651 c 20.01298,0 36.12452,16.11154 36.12452,36.12452 V 296.48567 h -512 V 76.610188 c 0,-20.01298 16.11153,-36.12452 36.12451,-36.12452 z"
       style="fill:#000000;fill-rule:evenodd;stroke-width:1.1;stroke-linecap:square;stroke-dashoffset:200;paint-order:stroke fill markers"
       id="rect805" /><g
       transform="matrix(7.7458396,0,0,7.7458396,-891.27661,-138.63687)"
       style="stroke-width:0.129102"
       id="g539"><path
         id="polygon10"
         style="fill:#ffffff;stroke-width:0.129102"
         d="m 109.7,32.2 h -7.1 L 103,31 h 6.7 z"
         class="st1" /><path
         id="polygon12"
         style="fill:#ffffff;stroke-width:0.129102"
         d="m 90.7,31 h 6.6 l 0.5,1.2 h -7.1 z"
         class="st1" /><path
         style="stroke-width:0.129102"
         class="st1"
         d="m 85.5,31 c 1.1,0.1 2,0.5 2.8,1.2 h -12 c 0,0 0,-1.2 0,-1.2 z"
         id="path14" /><path
         class="st1"
         d="m 66.900002,31 h 8.3 v 1.2 h -8.3 z"
         style="fill:#ffffff;stroke-width:0.129102"
         id="rect16" /><path
         style="stroke-width:0.129102"
         id="path18"
         d="M 71.1,31.6"
         class="st1" /><path
         id="polygon22"
         style="fill:#ffffff;stroke-width:0.129102"
         d="m 109.7,34.5 h -7.9 l 0.4,-1.2 h 7.5 z"
         class="st1" /><path
         id="polygon24"
         style="fill:#ffffff;stroke-width:0.129102"
         d="m 98.6,34.5 h -7.9 v -1.2 h 7.4 z"
         class="st1" /><path
         style="stroke-width:0.129102"
         class="st1"
         d="m 89.2,33.3 c 0.2,0.4 0.3,0.7 0.3,1.2 H 76.3 v -1.2 z"
         id="path26" /><path
         class="st1"
         d="m 66.900002,33.299999 h 8.3 v 1.2 h -8.3 z"
         style="fill:#ffffff;stroke-width:0.129102"
         id="rect28" /><path
         style="stroke-width:0.129102"
         id="path30"
         d="M 71.1,33.9"
         class="st1" /><path
         id="polygon34"
         style="fill:#ffffff;stroke-width:0.129102"
         d="m 100.9,36.8 0.5,-1.2 h 5.9 v 1.2 z"
         class="st1" /><path
         id="polygon36"
         style="fill:#ffffff;stroke-width:0.129102"
         d="m 99,35.6 0.4,1.2 h -6.3 v -1.2 z"
         class="st1" /><path
         style="stroke-width:0.129102"
         class="st1"
         d="m 89.7,35.6 c 0,0.4 -0.1,0.9 -0.2,1.2 h -3.6 v -1.2 z"
         id="path38" /><path
         class="st1"
         d="m 69.199997,35.599998 h 3.6 v 1.200001 h -3.6 z"
         style="fill:#ffffff;stroke-width:0.129102"
         id="rect40" /><path
         style="stroke-width:0.129102"
         id="path42"
         d="M 71,36.2"
         class="st1" /><path
         class="st1"
         d="m 78.699997,35.599998 h 3.6 v 1.200001 h -3.6 z"
         style="fill:#ffffff;stroke-width:0.129102"
         id="rect46" /><path
         style="stroke-width:0.129102"
         id="path48"
         d="M 80.5,36.2"
         class="st1" /><path
         id="polygon52"
         style="fill:#ffffff;stroke-width:0.129102"
         d="m 107.3,39.1 h -3.5 v -0.9 l -0.3,0.9 h -6.6 l -0.3,-0.9 v 0.9 h -3.5 v -1.2 h 6.7 l 0.4,1.1 0.4,-1.1 h 6.7 z"
         class="st1" /><path
         style="stroke-width:0.129102"
         class="st1"
         d="M 78.7,37.9 H 89 v 0 c -0.2,0.4 -0.6,0.9 -1,1.2 h -9.2 z"
         id="path54" /><path
         class="st1"
         d="m 69.199997,37.900002 h 3.6 v 1.2 h -3.6 z"
         style="fill:#ffffff;stroke-width:0.129102"
         id="rect56" /><path
         style="stroke-width:0.129102"
         id="path58"
         d="M 71,38.5"
         class="st1" /><path
         class="st1"
         d="m 103.8,40.200001 h 3.5 v 1.2 h -3.5 z"
         style="fill:#ffffff;stroke-width:0.129102"
         id="rect62" /><path
         style="stroke-width:0.129102"
         id="path64"
         d="M 105.6,40.8"
         class="st1" /><path
         style="stroke-width:0.129102"
         class="st1"
         d="m 96.6,40.2 h -3.5 v 1.2 h 3.5 c 0,0 0,-1.2 0,-1.2 z"
         id="path68" /><path
         style="stroke-width:0.129102"
         class="st1"
         d="m 103.1,40.2 c 0,0 -0.4,1.2 -0.4,1.2 h -5 c 0,0 -0.4,-1.2 -0.4,-1.2 z"
         id="path70" /><path
         style="stroke-width:0.129102"
         class="st1"
         d="m 78.7,40.2 h 9.2 c 0.4,0.4 0.8,0.8 1.1,1.2 0,0 -10.3,0 -10.3,0 0,0 0,-1.2 0,-1.2 z"
         id="path72" /><path
         id="rect74"
         style="fill:#ffffff;stroke-width:0.129102"
         d="m 69.199997,40.200001 h 3.6 v 1.2 h -3.6 z"
         class="st1" /><path
         class="st1"
         d="m 103.8,42.5 h 3.5 v 1.2 h -3.5 z"
         style="fill:#ffffff;stroke-width:0.129102"
         id="rect76" /><path
         style="stroke-width:0.129102"
         id="path78"
         d="M 105.6,43.1"
         class="st1" /><path
         class="st1"
         d="m 93.099998,42.5 h 3.5 v 1.2 h -3.5 z"
         style="fill:#ffffff;stroke-width:0.129102"
         id="rect82" /><path
         style="stroke-width:0.129102"
         id="path84"
         d="M 94.8,43.1"
         class="st1" /><path
         style="stroke-width:0.129102"
         class="st1"
         d="m 101.9,43.7 c 0,0 0.4,-1.2 0.4,-1.2 h -4.2 c 0,0 0.4,1.2 0.4,1.2 0,0 3.4,0 3.4,0 z"
         id="path88" /><path
         style="stroke-width:0.129102"
         class="st1"
         d="m 78.7,43.7 c 0,0 0,-1.2 0,-1.2 h 3.6 c 0,0 0,1.2 0,1.2 0,0 -3.6,0 -3.6,0 z"
         id="path90" /><path
         style="stroke-width:0.129102"
         class="st1"
         d="m 89.6,42.5 c 0.2,0.4 0.2,0.8 0.2,1.2 H 86 v -1.2 z"
         id="path92" /><path
         class="st1"
         d="m 69.199997,42.5 h 3.6 v 1.2 h -3.6 z"
         style="fill:#ffffff;stroke-width:0.129102"
         id="rect94" /><path
         style="stroke-width:0.129102"
         id="path96"
         d="M 71,43.1"
         class="st1" /><path
         class="st1"
         d="m 103.8,44.700001 h 5.9 v 1.2 h -5.9 z"
         style="fill:#ffffff;stroke-width:0.129102"
         id="rect100" /><path
         style="stroke-width:0.129102"
         id="path102"
         d="M 106.8,45.3"
         class="st1" /><path
         class="st1"
         d="m 90.699997,44.700001 h 5.9 v 1.2 h -5.9 z"
         style="fill:#ffffff;stroke-width:0.129102"
         id="rect106" /><path
         style="stroke-width:0.129102"
         id="path108"
         d="M 93.6,45.3"
         class="st1" /><path
         id="polygon112"
         style="fill:#ffffff;stroke-width:0.129102"
         d="m 101.1,46 h -1.8 l -0.4,-1.3 h 2.6 z"
         class="st1" /><path
         style="stroke-width:0.129102"
         class="st1"
         d="M 66.9,44.7 V 46 h 8.3 c 0,0 0,-1.2 0,-1.2 0,-0.1 -8.3,-0.1 -8.3,-0.1 z"
         id="path114" /><path
         style="stroke-width:0.129102"
         class="st1"
         d="m 89.6,44.7 c -0.1,0.4 -0.2,0.9 -0.5,1.2 H 89 76.3 v -1.2 z"
         id="path116" /><path
         id="polygon118"
         style="fill:#ffffff;stroke-width:0.129102"
         d="m 100.3,48.3 h -0.2 L 99.7,47 h 1 z"
         class="st1" /><path
         class="st1"
         d="m 103.8,47 h 5.9 v 1.2 h -5.9 z"
         style="fill:#ffffff;stroke-width:0.129102"
         id="rect120" /><path
         style="stroke-width:0.129102"
         id="path122"
         d="M 106.8,47.7"
         class="st1" /><path
         style="stroke-width:0.129102"
         class="st1"
         d="M 76.3,48.3 V 47 c 0,0 12,0 12.1,0 -0.8,0.8 -1.9,1.2 -3.1,1.2 l -9,0.1"
         id="path126" /><path
         class="st1"
         d="m 90.699997,47 h 5.9 v 1.2 h -5.9 z"
         style="fill:#ffffff;stroke-width:0.129102"
         id="rect128" /><path
         style="stroke-width:0.129102"
         id="path130"
         d="M 93.6,47.7"
         class="st1" /><path
         style="stroke-width:0.129102"
         class="st1"
         d="m 75.2,47 c 0,0 0,1.2 0,1.2 0,0 -8.3,0 -8.3,0 0,0 0,-1.2 0,-1.2 0,0 8.3,0 8.3,0 z"
         id="path134" /></g></g><g
     id="g830"><path
       id="path808"
       style="fill:#009c49;fill-opacity:1;fill-rule:evenodd;stroke-width:1.1;stroke-linecap:square;stroke-dashoffset:200;paint-order:stroke fill markers"
       d="M -427.19446,552.48566 H 12.55651 c 20.01298,0 36.12452,-16.11154 36.12452,-36.12452 V 296.48565 h -512 v 219.87549 c 0,20.01298 16.11153,36.12452 36.12451,36.12452 z"
       sodipodi:nodetypes="ssccccs" /><g
       transform="matrix(7.7458396,0,0,7.7458396,-1375.3915,113.8775)"
       style="stroke-width:0.129102"
       id="g547"><path
         style="stroke-width:0.129102"
         class="st1"
         d="m 134.1,32.4 h 5.4 c 1.1,0 1.9,0.2 2.6,0.5 0.7,0.3 1.2,0.8 1.5,1.5 0.4,0.7 0.6,1.5 0.7,2.4 0.1,0.9 0.2,2 0.2,3.2 0,0.4 0,0.9 0,1.4 0,0.5 0,1.1 -0.1,1.7 -0.1,0.6 -0.2,1.2 -0.4,1.7 -0.2,0.6 -0.5,1.1 -0.9,1.5 -0.4,0.4 -0.9,0.8 -1.5,1.1 -0.6,0.3 -1.4,0.4 -2.3,0.4 H 134 V 32.4 Z m 3.2,13.1 h 1.6 c 0.5,0 0.9,-0.1 1.2,-0.3 0.3,-0.2 0.5,-0.5 0.7,-0.9 0.2,-0.4 0.3,-1 0.4,-1.7 0.1,-0.7 0.1,-1.5 0.1,-2.5 0,-0.7 0,-1.4 0,-2 0,-0.6 -0.1,-1.2 -0.2,-1.7 -0.1,-0.5 -0.4,-0.9 -0.7,-1.2 -0.3,-0.3 -0.7,-0.4 -1.3,-0.4 h -1.7 v 10.7 z"
         id="path138" /><path
         style="stroke-width:0.129102"
         class="st1"
         d="M 147,47.8 V 32.4 h 5.7 c 0.6,0 1.2,0.1 1.7,0.2 0.5,0.1 1,0.3 1.4,0.6 0.4,0.3 0.7,0.7 1,1.2 0.2,0.5 0.4,1.2 0.4,2 0,0.9 -0.2,1.6 -0.7,2.2 -0.4,0.6 -1.1,1 -2,1.2 v 0 c 0.6,0.1 1,0.2 1.4,0.4 0.4,0.2 0.7,0.5 0.9,0.8 0.2,0.3 0.4,0.7 0.5,1.2 0.1,0.4 0.1,0.9 0.1,1.5 0,0.7 -0.1,1.2 -0.3,1.7 -0.2,0.5 -0.4,0.8 -0.7,1.1 -0.3,0.3 -0.6,0.5 -0.9,0.7 -0.3,0.2 -0.7,0.3 -1.1,0.4 -0.4,0.1 -0.7,0.1 -1,0.2 -0.3,0 -0.6,0 -0.8,0 H 147 Z m 3.2,-9.1 h 2.2 c 0.2,0 0.4,0 0.6,-0.1 0.2,-0.1 0.4,-0.2 0.6,-0.3 0.2,-0.1 0.3,-0.4 0.4,-0.6 0.1,-0.3 0.2,-0.6 0.2,-0.9 0,-0.6 -0.2,-1 -0.5,-1.4 -0.3,-0.4 -0.8,-0.6 -1.3,-0.6 h -2 v 3.9 z m 0,6.8 h 1.8 c 0.2,0 0.4,0 0.6,0 0.2,0 0.5,-0.1 0.7,-0.2 0.2,-0.1 0.4,-0.4 0.6,-0.7 0.2,-0.3 0.3,-0.7 0.3,-1.2 0,-0.7 -0.2,-1.2 -0.5,-1.6 -0.3,-0.4 -0.9,-0.6 -1.7,-0.6 h -1.9 v 4.3 z"
         id="path140" /><path
         style="stroke-width:0.129102"
         class="st1"
         d="m 158.8,47.8 v -2.6 c 0.8,-1 1.5,-1.9 2,-2.7 0.6,-0.8 1.1,-1.4 1.5,-2 0.4,-0.6 0.8,-1 1,-1.4 0.2,-0.4 0.5,-0.7 0.7,-1 0.2,-0.3 0.3,-0.6 0.3,-0.9 0.1,-0.3 0.1,-0.6 0.1,-0.9 0,-0.4 -0.1,-0.7 -0.2,-1 -0.2,-0.3 -0.5,-0.4 -0.9,-0.4 -0.3,0 -0.6,0.1 -0.7,0.2 -0.2,0.1 -0.3,0.3 -0.4,0.5 -0.1,0.2 -0.1,0.4 -0.2,0.7 0,0.2 0,0.5 0,0.7 h -3 c -0.1,-1.4 0.2,-2.5 0.9,-3.2 0.7,-0.7 1.8,-1.1 3.2,-1.1 0.6,0 1.2,0.1 1.8,0.2 0.5,0.1 1,0.4 1.4,0.7 0.4,0.3 0.7,0.7 0.9,1.2 0.2,0.5 0.3,1.1 0.3,1.8 0,0.6 -0.1,1.1 -0.3,1.7 -0.2,0.6 -0.5,1.1 -0.8,1.7 -0.3,0.6 -0.7,1.1 -1.1,1.6 -0.4,0.5 -0.8,1 -1.2,1.5 -0.4,0.5 -0.8,0.9 -1.2,1.3 -0.4,0.4 -0.7,0.8 -1,1.1 h 5.7 v 2.3 z"
         id="path142" /></g></g></g>

</svg>
