<?xml version="1.0" encoding="UTF-8" standalone="no"?>
<svg
   viewBox="0 0 511.99999 512.00001"
   version="1.1"
   id="svg1273"
   sodipodi:docname="concept-eye-opened.svg"
   xml:space="preserve"
   width="512"
   height="512"
   inkscape:version="1.2.2 (1:1.2.2+202212051552+b0a8486541)"
   xmlns:inkscape="http://www.inkscape.org/namespaces/inkscape"
   xmlns:sodipodi="http://sodipodi.sourceforge.net/DTD/sodipodi-0.dtd"
   xmlns="http://www.w3.org/2000/svg"
   xmlns:svg="http://www.w3.org/2000/svg"><defs
     id="defs1277" /><sodipodi:namedview
     id="namedview1275"
     pagecolor="#ffffff"
     bordercolor="#000000"
     borderopacity="0.25"
     inkscape:showpageshadow="false"
     inkscape:pageopacity="0.0"
     inkscape:pagecheckerboard="0"
     inkscape:deskcolor="#d1d1d1"
     showgrid="false"
     showborder="false"
     inkscape:zoom="1.5234375"
     inkscape:cx="256"
     inkscape:cy="256"
     inkscape:window-width="1920"
     inkscape:window-height="1031"
     inkscape:window-x="0"
     inkscape:window-y="476"
     inkscape:window-maximized="1"
     inkscape:current-layer="svg1273" /><circle
     r="256"
     cy="256"
     cx="256"
     id="path822"
     style="fill:none;fill-opacity:1;stroke:none;stroke-width:7.0415;stroke-linecap:round;stroke-linejoin:round;stroke-miterlimit:4;stroke-dasharray:none;stroke-dashoffset:0;stroke-opacity:1;paint-order:stroke fill markers" /><path
     d="m 256,103.38324 c -97.81615,0 -186.535043,53.50839 -251.9939226,140.44918 a 20.262065,20.262065 0 0 0 0,24.19042 C 69.464957,355.04634 158.16317,408.61677 256,408.61677 c 97.83683,0 186.53505,-53.52908 251.99392,-140.4492 a 20.262065,20.262065 0 0 0 0,-24.19042 C 442.47302,156.89163 353.83683,103.38324 256,103.38324 Z m 7.00902,260.0574 A 107.6784,107.6784 0 1 1 363.45097,262.99868 107.74043,107.74043 0 0 1 263.0297,363.37861 Z m -3.24606,-49.6214 a 57.891613,57.891613 0 1 1 54.14933,-54.14933 57.891613,57.891613 0 0 1 -54.12866,54.08731 z"
     fill="#888888"
     id="path1271"
     style="stroke-width:20.6756;fill:#1a1a1a" /></svg>
