<?xml version="1.0" encoding="UTF-8" standalone="no"?>
<svg
   xmlns:dc="http://purl.org/dc/elements/1.1/"
   xmlns:cc="http://creativecommons.org/ns#"
   xmlns:rdf="http://www.w3.org/1999/02/22-rdf-syntax-ns#"
   xmlns:svg="http://www.w3.org/2000/svg"
   xmlns="http://www.w3.org/2000/svg"
   xmlns:xlink="http://www.w3.org/1999/xlink"
   xmlns:sodipodi="http://sodipodi.sourceforge.net/DTD/sodipodi-0.dtd"
   xmlns:inkscape="http://www.inkscape.org/namespaces/inkscape"
   height="512"
   viewBox="0 0 416.01123 512"
   width="416.01123"
   version="1.1"
   id="svg123"
   sodipodi:docname="libreoffice-basic.svg"
   inkscape:version="0.92.4 (unknown)">
  <metadata
     id="metadata129">
    <rdf:RDF>
      <cc:Work
         rdf:about="">
        <dc:format>image/svg+xml</dc:format>
        <dc:type
           rdf:resource="http://purl.org/dc/dcmitype/StillImage" />
        <dc:title></dc:title>
      </cc:Work>
    </rdf:RDF>
  </metadata>
  <defs
     id="defs127" />
  <sodipodi:namedview
     pagecolor="#ffffff"
     bordercolor="#666666"
     borderopacity="1"
     objecttolerance="10"
     gridtolerance="10"
     guidetolerance="10"
     inkscape:pageopacity="0"
     inkscape:pageshadow="2"
     inkscape:window-width="1600"
     inkscape:window-height="851"
     id="namedview125"
     showgrid="false"
     inkscape:showpageshadow="false"
     fit-margin-top="0"
     fit-margin-left="0"
     fit-margin-right="0"
     fit-margin-bottom="0"
     inkscape:zoom="1.2597656"
     inkscape:cx="208.00562"
     inkscape:cy="256"
     inkscape:window-x="0"
     inkscape:window-y="24"
     inkscape:window-maximized="1"
     inkscape:current-layer="svg123" />
  <linearGradient
     id="a"
     gradientTransform="matrix(0.2,0,0,1,33.8,1176.6227)"
     gradientUnits="userSpaceOnUse"
     x1="370"
     x2="370"
     y1="-985.763"
     y2="-933.638">
    <stop
       offset="0"
       stop-color="#0369a3"
       id="stop2" />
    <stop
       offset="1"
       stop-color="#023f62"
       id="stop4" />
  </linearGradient>
  <linearGradient
     id="b"
     gradientUnits="userSpaceOnUse"
     x1="235"
     x2="25"
     xlink:href="#d"
     y1="256.05078"
     y2="1.050781" />
  <linearGradient
     id="c"
     gradientTransform="matrix(1.004,0,0,1.0093981,64.493,1423.0889)"
     gradientUnits="userSpaceOnUse"
     x1="151.8994"
     x2="-27.383467"
     xlink:href="#d"
     y1="-1166.1295"
     y2="-1398.9415" />
  <linearGradient
     id="d">
    <stop
       offset="0"
       stop-color="#535353"
       id="stop9" />
    <stop
       offset="1"
       stop-color="#7e7e7e"
       id="stop11" />
  </linearGradient>
  <linearGradient
     id="e"
     gradientUnits="userSpaceOnUse"
     x1="217.00002"
     x2="37.000011"
     y1="241.00011"
     y2="11.0001">
    <stop
       offset="0"
       stop-color="#e6e6e6"
       id="stop14" />
    <stop
       offset="1"
       stop-color="#fff"
       id="stop16" />
  </linearGradient>
  <g
     id="g229"
     transform="matrix(2.0000916,0,0,2.0000916,-48.002198,-0.12500572)">
    <text
       id="text19"
       y="1478.8729"
       x="-93.874512" />
    <path
       id="path27"
       d="M 31.93359,0.0625 C 27.80059,0.0625 24,3.74353 24,8.18164 v 239.93945 c 0,3.86723 3.62281,7.92969 7.75781,7.92969 h 191.98438 c 4.627,0 8.25,-3.86992 8.25,-7.74414 V 99.121094 c 0,-4.224155 -0.512,-6.181567 -3.5,-9.167969 L 143.16992,4.66992 c -2.988,-2.9854 -5.274,-4.5253 -9.5,-4.5293 L 31.93359,0.06252 Z m 138.8418,0.0371 c -6.838,0 -7.13748,7.11382 -3.52148,10.74609 v 0.002 l 53.18945,53.431644 c 4.34,4.357128 11.55273,3.321844 11.55273,-3.550781 V 8.29691 c 0,-4.22715 -3.82625,-8.19726 -8.03125,-8.19726 h -53.18945 z"
       style="fill:url(#c);stroke-width:15.99699974"
       inkscape:connector-curvature="0" />
    <path
       id="path29"
       d="m 36.00002,12 v 232 h 184 V 96 l -86,-84 z"
       style="fill:url(#e)"
       inkscape:connector-curvature="0" />
    <g
       id="g177">
      <path
         d="m 80.04,111.05078 h 8 v 4 h -8 z m 36,16 h 8 v 4 h -8 z m -4,16 h 8 v 4 h -8 z m 64,8 h 16 v 4 h -16 z m 8,8 h 4 v 4 h -4 z m -80,16 h 8 v 4 h -8 z"
         id="path31"
         inkscape:connector-curvature="0"
         style="fill:#d36118" />
      <g
         id="g55"
         style="fill:#43c330">
        <path
           d="m 80,103.05078 h 44 v 4 H 80 Z"
           id="path33"
           inkscape:connector-curvature="0" />
        <path
           d="m 80,119.05078 h 24 v 4 H 80 Z"
           id="path35"
           inkscape:connector-curvature="0" />
        <path
           d="m 80,127.05078 h 24 v 4 H 80 Z"
           id="path37"
           inkscape:connector-curvature="0" />
        <path
           d="m 96,151.05078 h 16 v 4 H 96 Z"
           id="path39"
           inkscape:connector-curvature="0" />
        <path
           d="m 96,143.05078 h 4 v 4 h -4 z"
           id="path41"
           inkscape:connector-curvature="0" />
        <path
           d="m 96,159.05078 h 16 v 4 H 96 Z"
           id="path43"
           inkscape:connector-curvature="0" />
        <path
           d="m 172,159.05078 h 8 v 4 h -8 z"
           id="path45"
           inkscape:connector-curvature="0" />
        <path
           d="m 100,167.05078 h 4 v 4 h -4 z"
           id="path47"
           inkscape:connector-curvature="0" />
        <path
           d="m 88,175.05078 h 4 v 4 h -4 z"
           id="path49"
           inkscape:connector-curvature="0" />
        <path
           d="m 96,183.05078 h 16 v 4 H 96 Z"
           id="path51"
           inkscape:connector-curvature="0" />
        <path
           d="m 96,191.05078 h 16 v 4 H 96 Z"
           id="path53"
           inkscape:connector-curvature="0" />
      </g>
      <path
         d="m 116.04,191.03278 h 4 v 4 h -4 z"
         id="path57"
         style="fill:url(#a)"
         inkscape:connector-curvature="0" />
      <path
         d="m 100.04,199.03278 h 8 v 4 h -8 z"
         id="path59"
         inkscape:connector-curvature="0"
         style="fill:#d36118" />
      <g
         id="g117"
         style="fill:#1c99e0">
        <path
           d="m 120,119.05078 h 24 v 4 h -24 z"
           id="path61"
           inkscape:connector-curvature="0" />
        <path
           d="m 64,103.05078 h 12 v 4 H 64 Z"
           id="path63"
           inkscape:connector-curvature="0" />
        <path
           d="m 128,103.05078 h 12 v 4 h -12 z"
           id="path65"
           inkscape:connector-curvature="0" />
        <path
           d="m 64,111.05078 h 12 v 4 H 64 Z"
           id="path67"
           inkscape:connector-curvature="0" />
        <path
           d="m 92,111.05078 h 8 v 4 h -8 z"
           id="path69"
           inkscape:connector-curvature="0" />
        <path
           d="m 104,111.05078 h 24 v 4 h -24 z"
           id="path71"
           inkscape:connector-curvature="0" />
        <path
           d="m 64,119.05078 h 12 v 4 H 64 Z"
           id="path73"
           inkscape:connector-curvature="0" />
        <path
           d="m 108,119.05078 h 8 v 4 h -8 z"
           id="path75"
           inkscape:connector-curvature="0" />
        <path
           d="m 104,143.05078 h 4 v 4 h -4 z"
           id="path77"
           inkscape:connector-curvature="0" />
        <path
           d="m 80,135.05078 h 8 v 4 h -8 z"
           id="path79"
           inkscape:connector-curvature="0" />
        <path
           d="m 92,135.05078 h 16 v 4 H 92 Z"
           id="path81"
           inkscape:connector-curvature="0" />
        <path
           d="m 112,135.05078 h 16 v 4 h -16 z"
           id="path83"
           inkscape:connector-curvature="0" />
        <path
           d="m 152,135.05078 h 11.6 v 4 H 152 Z"
           id="path85"
           inkscape:connector-curvature="0" />
        <path
           d="m 80,143.05078 h 12 v 4 H 80 Z"
           id="path87"
           inkscape:connector-curvature="0" />
        <path
           d="m 124,143.05078 h 4 v 4 h -4 z"
           id="path89"
           inkscape:connector-curvature="0" />
        <path
           d="m 108,127.05078 h 4 v 4 h -4 z"
           id="path91"
           inkscape:connector-curvature="0" />
        <path
           d="m 116,151.04678 h 4 v 4 h -4 z"
           id="path93"
           inkscape:connector-curvature="0" />
        <path
           d="m 188,159.05078 h 4 v 4 h -4 z"
           id="path95"
           inkscape:connector-curvature="0" />
        <path
           d="m 80,167.05078 h 16 v 4 H 80 Z"
           id="path97"
           inkscape:connector-curvature="0" />
        <path
           d="m 80,175.05078 h 4 v 4 h -4 z"
           id="path99"
           inkscape:connector-curvature="0" />
        <path
           d="m 96,175.05078 h 4 v 4 h -4 z"
           id="path101"
           inkscape:connector-curvature="0" />
        <path
           d="m 116,183.05078 h 4 v 4 h -4 z"
           id="path103"
           inkscape:connector-curvature="0" />
        <path
           d="m 80,199.05078 h 8 v 4 h -8 z"
           id="path105"
           inkscape:connector-curvature="0" />
        <path
           d="m 92,199.05078 h 4 v 4 h -4 z"
           id="path107"
           inkscape:connector-curvature="0" />
        <path
           d="m 64,207.05078 h 8 v 4 h -8 z"
           id="path109"
           inkscape:connector-curvature="0" />
        <path
           d="m 76,207.05078 h 8 v 4 h -8 z"
           id="path111"
           inkscape:connector-curvature="0" />
        <path
           d="m 112,199.05078 h 12 v 4 h -12 z"
           id="path113"
           inkscape:connector-curvature="0" />
        <path
           d="m 172,199.05078 h 12 v 4 h -12 z"
           id="path115"
           inkscape:connector-curvature="0" />
      </g>
      <path
         d="m 160.04,199.03278 h 8 v 4 h -8 z"
         id="path119"
         inkscape:connector-curvature="0"
         style="fill:#d36118" />
      <path
         d="m 136.46357,140.2148 -0.002,0.002 c -5.2706,1.653 -10.04061,4.43989 -14.00781,8.08789 l 5.21094,11.85156 c -1.4117,1.8107 -2.57142,3.82397 -3.44922,5.98047 l -12.87695,1.4082 c -0.57761,2.603 -0.88282,5.31205 -0.88282,8.08985 0,2.774 0.30332,5.48489 0.88282,8.08789 l 12.87695,1.41015 c 0.8797,2.1584 2.03752,4.16782 3.44922,5.97852 l -5.20899,11.84961 c 3.971,3.648 8.73912,6.43874 14.00782,8.08984 l 7.6582,-10.44336 c 1.1286,0.152 2.27882,0.23633 3.44922,0.23633 1.1666,0 2.31866,-0.0824 3.44726,-0.23633 l 7.65821,10.44336 c 5.2725,-1.653 10.03871,-4.44184 14.00781,-8.08984 l -5.20899,-11.85156 c 1.4098,-1.8126 2.56952,-3.82207 3.44922,-5.98047 l 12.87696,-1.40625 c 0.5795,-2.603 0.88476,-5.31395 0.88476,-8.08985 0,-2.7778 -0.30336,-5.48874 -0.88476,-8.08984 l -12.875,-1.4082 c -0.8778,-2.1565 -2.03942,-4.16977 -3.44922,-5.98047 l 5.21093,-11.85156 c -3.971,-3.648 -8.73721,-6.43679 -14.00781,-8.08789 l -7.65625,10.44335 c -1.1286,-0.15199 -2.28077,-0.23632 -3.45117,-0.23632 -1.1723,0 -2.32252,0.0805 -3.44922,0.23632 z m 11.08984,21.89257 c 6.422,0 11.69726,5.21852 11.69726,11.63672 0,6.422 -5.27711,11.69922 -11.69531,11.69922 l -0.004,-0.004 c -6.4182,0 -11.63672,-5.27717 -11.63672,-11.69727 0,-6.4163 5.21857,-11.63477 11.63867,-11.63477 z"
         id="path121"
         style="fill:url(#b)"
         inkscape:connector-curvature="0" />
    </g>
  </g>
</svg>
