<?xml version="1.0" encoding="UTF-8" standalone="no"?>
<!-- Generator: Adobe Illustrator 19.0.0, SVG Export Plug-In . SVG Version: 6.00 Build 0)  -->

<svg
   xmlns:dc="http://purl.org/dc/elements/1.1/"
   xmlns:cc="http://creativecommons.org/ns#"
   xmlns:rdf="http://www.w3.org/1999/02/22-rdf-syntax-ns#"
   xmlns:svg="http://www.w3.org/2000/svg"
   xmlns="http://www.w3.org/2000/svg"
   xmlns:xlink="http://www.w3.org/1999/xlink"
   xmlns:sodipodi="http://sodipodi.sourceforge.net/DTD/sodipodi-0.dtd"
   xmlns:inkscape="http://www.inkscape.org/namespaces/inkscape"
   version="1.1"
   id="Layer_1"
   x="0px"
   y="0px"
   viewBox="0 0 511.99998 512"
   xml:space="preserve"
   sodipodi:docname="softplan.svg"
   width="512"
   height="512"
   inkscape:version="0.92.4 (unknown)"><metadata
   id="metadata71"><rdf:RDF><cc:Work
       rdf:about=""><dc:format>image/svg+xml</dc:format><dc:type
         rdf:resource="http://purl.org/dc/dcmitype/StillImage" /><dc:title></dc:title></cc:Work></rdf:RDF></metadata><defs
   id="defs69"><linearGradient
     inkscape:collect="always"
     xlink:href="#SVGID_2_"
     id="linearGradient3828"
     gradientUnits="userSpaceOnUse"
     x1="32.133701"
     y1="58.6558"
     x2="32.133701"
     y2="4.0927262e-11" /></defs><sodipodi:namedview
   pagecolor="#ffffff"
   bordercolor="#666666"
   borderopacity="1"
   objecttolerance="10"
   gridtolerance="10"
   guidetolerance="10"
   inkscape:pageopacity="0"
   inkscape:pageshadow="2"
   inkscape:window-width="1920"
   inkscape:window-height="1032"
   id="namedview67"
   showgrid="false"
   showborder="true"
   fit-margin-top="0"
   fit-margin-left="0"
   fit-margin-right="0"
   fit-margin-bottom="0"
   inkscape:zoom="1.6132812"
   inkscape:cx="256"
   inkscape:cy="256"
   inkscape:window-x="0"
   inkscape:window-y="23"
   inkscape:window-maximized="1"
   inkscape:current-layer="Layer_1"
   inkscape:showpageshadow="false" />
<style
   type="text/css"
   id="style2">
	.st0{fill:url(#SVGID_1_);}
	.st1{fill:url(#SVGID_2_);}
	.st2{fill:url(#SVGID_3_);}
	.st3{fill:url(#SVGID_4_);}
	.st4{fill:url(#SVGID_5_);}
	.st5{fill:url(#SVGID_6_);}
	.st6{fill:#58595B;}
</style>
<circle
   style="opacity:1;fill:none;fill-opacity:1;stroke:none;stroke-width:13.42622757;stroke-linecap:round;stroke-linejoin:round;stroke-miterlimit:4;stroke-dasharray:none;stroke-dashoffset:0;stroke-opacity:1;paint-order:stroke fill markers"
   id="path816"
   cx="256"
   cy="256"
   r="256" /><g
   id="g58"
   transform="matrix(7.9792143,0,0,7.9792143,10.887061,36.463461)">
		<linearGradient
   y2="-0.0030041621"
   x2="32.136398"
   y1="58.6591"
   x1="32.136398"
   gradientUnits="userSpaceOnUse"
   id="SVGID_1_">
			<stop
   id="stop4"
   style="stop-color:#3CA5D5"
   offset="0" />
			<stop
   id="stop6"
   style="stop-color:#0886BC"
   offset="0.343" />
			<stop
   id="stop8"
   style="stop-color:#005C97"
   offset="1" />
		</linearGradient>
		<path
   style="fill:url(#SVGID_1_)"
   inkscape:connector-curvature="0"
   id="path11"
   d="m 37.4,58.7 c 3,-2 6.4,-6 5.8,-13 -0.5,-4.8 -3.8,-8 -3.8,-8 0.1,-0.1 8.8,-5.6 12.4,-13.1 2.5,-5.1 3.2,-9 2.1,-11.8 C 53.2,10.9 51.6,9.4 49.3,8.4 45.2,6.7 39.6,5.9 30.6,5.9 26.2,5.9 21.9,6.5 18,7.8 c -4,1.2 -6.2,3 -6.7,5.3 -0.6,2.8 1.4,6.3 5.9,10.4 3.2,2.9 8.9,6.8 13.4,9.2 5.7,3 9.9,7.2 11,11.1 0.6,2 0.6,3.7 -0.1,5 -0.6,1.1 -1.6,1.8 -3.1,2.3 -1.2,0.3 -2.5,0.5 -3.9,0.5 0,0 0,0 0,0 C 27,51.6 17.7,47.2 11.4,40.7 7.3,36.5 -1.6,20.3 7.3,8.1 10.7,3.1 19.7,0 30.1,0 c 0,0 0.4,0 1.1,0 3.5,0 15.3,0.4 21.5,5.1 6.1,4.6 8.4,10.2 8.2,19.4 -0.4,18 -12.5,30.3 -23.5,34.2 z"
   class="st0" />
		<linearGradient
   y2="4.0927262e-11"
   x2="32.133701"
   y1="58.6558"
   x1="32.133701"
   gradientUnits="userSpaceOnUse"
   id="SVGID_2_">
			<stop
   id="stop13"
   style="stop-color:#3CA5D5"
   offset="0" />
			<stop
   id="stop15"
   style="stop-color:#0886BC"
   offset="0.343" />
			<stop
   id="stop17"
   style="stop-color:#005C97"
   offset="1" />
		</linearGradient>
		<path
   style="fill:url(#linearGradient3828)"
   inkscape:connector-curvature="0"
   id="path20"
   d="m 37.4,58.7 c 1.8,-1.2 6.6,-4.9 5.8,-13 -0.5,-4.8 -3.8,-8 -3.8,-8 0,0 8.7,-5.5 12.4,-13.1 3,-6.2 4.7,-13.2 -2.5,-16.2 C 44.8,6.5 38.8,5.9 30.6,5.9 25.8,5.9 21.5,6.6 18,7.8 c -8.3,2.6 -9.6,7.8 -0.8,15.8 3.2,2.9 8.8,6.7 13.4,9.2 5.9,3.1 9.9,7.2 11,11.1 1,3.2 0.4,6.2 -3.2,7.2 -6.9,2 -19,-2.1 -27,-10.4 C 6.6,35.7 -1.5,19.8 7.2,7.9 10.9,2.8 20.5,0 30.1,0 c 0,0 15.2,-0.5 22.6,5.1 6.7,5.1 8.4,11.1 8.2,19.4 -0.4,18.3 -13,30.5 -23.5,34.2 z"
   class="st1" />
		<linearGradient
   y2="29.773399"
   x2="41.9258"
   y1="29.773399"
   x1="-0.002971411"
   gradientUnits="userSpaceOnUse"
   id="SVGID_3_">
			<stop
   id="stop22"
   style="stop-color:#3CA5D5"
   offset="0" />
			<stop
   id="stop24"
   style="stop-color:#0886BC"
   offset="0.343" />
			<stop
   id="stop26"
   style="stop-color:#005C97"
   offset="1" />
		</linearGradient>
		<path
   style="fill:url(#SVGID_3_)"
   inkscape:connector-curvature="0"
   id="path29"
   d="m 29.6,59.5 c -5.2,0 -11,-2.6 -17.4,-7.6 C 6.6,47.4 0.3,36.4 0,24.9 -0.2,17.2 2.3,10.8 7.3,6.4 13.9,0.5 25.9,0 29.4,0 c 0.5,0 0.7,0 0.7,0 -10.4,0 -19.4,3.2 -23,8 -8.5,11.5 -0.6,27.7 4.1,32.6 6.4,6.5 15.6,10.8 23,10.8 1.4,0 2.7,-0.2 3.9,-0.5 3.6,-1 3.8,-3.7 3.7,-4.5 0.3,3.4 -0.9,6.9 -3.2,9.3 -1.5,1.8 -4.4,3.8 -9,3.8 z"
   class="st2" />
		<linearGradient
   y2="29.773199"
   x2="41.927502"
   y1="29.773199"
   x1="0"
   gradientUnits="userSpaceOnUse"
   id="SVGID_4_">
			<stop
   id="stop31"
   style="stop-color:#3CA5D5"
   offset="0" />
			<stop
   id="stop33"
   style="stop-color:#0886BC"
   offset="0.343" />
			<stop
   id="stop35"
   style="stop-color:#005C97"
   offset="1" />
		</linearGradient>
		<path
   style="fill:url(#SVGID_4_)"
   inkscape:connector-curvature="0"
   id="path38"
   d="M 30.1,0 C 20.4,0 10.9,2.9 7.1,8 -1.5,19.6 6.7,35.9 11.2,40.6 19.3,48.8 31,52.9 38.1,51 41.4,50.1 41.9,47.7 41.8,46.5 42.5,56 31.7,67.5 12.1,52 2,44 -6.9,19 7.1,6.5 15,-0.5 30.1,0 30.1,0 Z"
   class="st3" />
		<linearGradient
   y2="26.5576"
   x2="50.719101"
   y1="12.7518"
   x1="26.8067"
   gradientUnits="userSpaceOnUse"
   id="SVGID_5_">
			<stop
   id="stop40"
   style="stop-color:#3CA5D5"
   offset="0" />
			<stop
   id="stop42"
   style="stop-color:#0886BC"
   offset="0.343" />
			<stop
   id="stop44"
   style="stop-color:#005C97"
   offset="1" />
		</linearGradient>
		<path
   style="fill:url(#SVGID_5_)"
   inkscape:connector-curvature="0"
   id="path47"
   d="m 39,37.2 c -3.1,-3.1 -6.4,-4.9 -6.5,-5 0.1,-0.1 9.3,-4.9 15.1,-11.2 2,-2.2 4.2,-5.3 3.4,-8.2 -0.6,-2.1 -2.7,-3.8 -6.3,-5 -6,-2 -12.6,-2 -13.8,-2 h -0.1 c 0,0 0.4,0 1.1,0 3.6,0 12.3,0.2 17,2.2 1.4,0.6 4.1,1.8 5.2,4.8 1.1,3.1 0.2,7.3 -2.7,12.6 -3.7,6.8 -11.9,12.1 -12,12.2 v 0 z"
   class="st4" />
		<linearGradient
   y2="26.5585"
   x2="50.7155"
   y1="12.7534"
   x1="26.8043"
   gradientUnits="userSpaceOnUse"
   id="SVGID_6_">
			<stop
   id="stop49"
   style="stop-color:#3CA5D5"
   offset="0" />
			<stop
   id="stop51"
   style="stop-color:#0886BC"
   offset="0.343" />
			<stop
   id="stop53"
   style="stop-color:#005C97"
   offset="1" />
		</linearGradient>
		<path
   style="fill:url(#SVGID_6_)"
   inkscape:connector-curvature="0"
   id="path56"
   d="m 39,37.2 c -3.1,-3.1 -6.5,-5 -6.5,-5 0,0 9.3,-4.8 15.1,-11.2 4,-4.4 6.5,-10.2 -2.9,-13.2 -6.6,-2.1 -14,-2 -14,-2 0,0 12.3,-0.3 18.2,2.2 3,1.3 9.5,4.4 2.5,17.4 -3.7,6.9 -12,12.1 -12,12.1 z"
   class="st5" />
	</g>
</svg>