<?xml version="1.0" encoding="UTF-8" standalone="no"?>
<svg
   xmlns:dc="http://purl.org/dc/elements/1.1/"
   xmlns:cc="http://creativecommons.org/ns#"
   xmlns:rdf="http://www.w3.org/1999/02/22-rdf-syntax-ns#"
   xmlns:svg="http://www.w3.org/2000/svg"
   xmlns="http://www.w3.org/2000/svg"
   xmlns:sodipodi="http://sodipodi.sourceforge.net/DTD/sodipodi-0.dtd"
   xmlns:inkscape="http://www.inkscape.org/namespaces/inkscape"
   width="472.33563"
   height="512"
   viewBox="0 0 204.7402 221.98067"
   version="1.1"
   id="svg4"
   sodipodi:docname="ms-edge.svg"
   inkscape:version="0.92.4 (unknown)">
  <metadata
     id="metadata10">
    <rdf:RDF>
      <cc:Work
         rdf:about="">
        <dc:format>image/svg+xml</dc:format>
        <dc:type
           rdf:resource="http://purl.org/dc/dcmitype/StillImage" />
        <dc:title></dc:title>
      </cc:Work>
    </rdf:RDF>
  </metadata>
  <defs
     id="defs8" />
  <sodipodi:namedview
     pagecolor="#ffffff"
     bordercolor="#666666"
     borderopacity="1"
     objecttolerance="10"
     gridtolerance="10"
     guidetolerance="10"
     inkscape:pageopacity="0"
     inkscape:pageshadow="2"
     inkscape:window-width="1600"
     inkscape:window-height="851"
     id="namedview6"
     showgrid="false"
     inkscape:showpageshadow="false"
     fit-margin-top="0"
     fit-margin-left="0"
     fit-margin-right="0"
     fit-margin-bottom="0"
     inkscape:zoom="1.2597656"
     inkscape:cx="236.16782"
     inkscape:cy="256"
     inkscape:window-x="0"
     inkscape:window-y="24"
     inkscape:window-maximized="1"
     inkscape:current-layer="svg4" />
  <path
     d="m 64.771537,89.44774 h 78.600333 c 0,-27.90514 -12.17634,-46.93017 -45.376342,-46.93017 C 58.760646,42.51737 18.861395,68.05919 -0.106846,99.90668 5.7685468,44.62875 45.403362,0 105.07441,0 156.21956,0 204.6771,39.10451 204.6771,104.10855 v 24.71408 H 65.190329 c 0,33.63744 29.343756,46.96504 60.076101,46.96504 37.39982,0 60.56091,-16.806 60.56091,-16.806 v 47.1171 c 0,0 -26.14593,15.8819 -67.821,15.8819 -54.157458,0 -92.385845,-38.8126 -92.385845,-87.07704 0,-37.8836 22.915303,-68.13013 54.65579,-80.61088 C 64.825859,71.26112 64.771332,89.44774 64.771332,89.44774 Z"
     id="path2"
     inkscape:connector-curvature="0"
     style="fill:#3277bc;stroke-width:0.20498894" />
</svg>
