<?xml version="1.0" encoding="UTF-8" standalone="no"?>
<svg
   xmlns:dc="http://purl.org/dc/elements/1.1/"
   xmlns:cc="http://creativecommons.org/ns#"
   xmlns:rdf="http://www.w3.org/1999/02/22-rdf-syntax-ns#"
   xmlns:svg="http://www.w3.org/2000/svg"
   xmlns="http://www.w3.org/2000/svg"
   xmlns:sodipodi="http://sodipodi.sourceforge.net/DTD/sodipodi-0.dtd"
   xmlns:inkscape="http://www.inkscape.org/namespaces/inkscape"
   height="512"
   viewBox="0 0.4 51.488744 49.299304"
   width="540.39404"
   version="1.1"
   id="svg4"
   sodipodi:docname="banco-santander.svg"
   inkscape:version="0.92.4 (unknown)">
  <metadata
     id="metadata10">
    <rdf:RDF>
      <cc:Work
         rdf:about="">
        <dc:format>image/svg+xml</dc:format>
        <dc:type
           rdf:resource="http://purl.org/dc/dcmitype/StillImage" />
        <dc:title></dc:title>
      </cc:Work>
    </rdf:RDF>
  </metadata>
  <defs
     id="defs8" />
  <sodipodi:namedview
     pagecolor="#ffffff"
     bordercolor="#666666"
     borderopacity="1"
     objecttolerance="10"
     gridtolerance="10"
     guidetolerance="10"
     inkscape:pageopacity="0"
     inkscape:pageshadow="2"
     inkscape:window-width="1600"
     inkscape:window-height="851"
     id="namedview6"
     showgrid="false"
     inkscape:showpageshadow="false"
     fit-margin-top="0"
     fit-margin-left="0"
     fit-margin-right="0"
     fit-margin-bottom="0"
     inkscape:zoom="1.2597656"
     inkscape:cx="270.19702"
     inkscape:cy="256"
     inkscape:window-x="0"
     inkscape:window-y="24"
     inkscape:window-maximized="1"
     inkscape:current-layer="svg4" />
  <path
     d="m 37.190751,23.089559 c -0.118794,-1.781902 -0.593968,-3.563805 -1.544316,-5.10812 L 27.568477,3.8450116 C 26.974509,2.77587 26.499335,1.587935 26.261748,0.4 l -0.35638,0.5939675 c -2.01949,3.4450116 -2.01949,7.8403712 0,11.2853825 l 6.533642,11.285383 c 2.01949,3.445012 2.01949,7.840371 0,11.285383 l -0.35638,0.593968 c -0.237587,-1.187935 -0.712761,-2.37587 -1.306729,-3.445012 L 24.836226,21.664037 21.034834,15.011601 c -0.593967,-1.069142 -1.069141,-2.257077 -1.306728,-3.445012 l -0.356381,0.593968 c -2.01949,3.445011 -2.01949,7.721578 0,11.285383 l 6.533643,11.285383 c 2.019489,3.445011 2.019489,7.840371 0,11.285382 l -0.356381,0.593968 C 25.3114,45.422738 24.836226,44.234803 24.242259,43.165661 L 16.045507,29.029234 c -1.069142,-1.900696 -1.544316,-4.038979 -1.544316,-6.177262 -8.6719255,2.257077 -14.7303942,7.12761 -14.7303942,12.710905 0,7.840371 11.6417642,14.136427 26.0157772,14.136427 14.374014,0 26.015777,-6.296056 26.015777,-14.136427 0.118794,-5.345708 -5.820881,-10.216241 -14.6116,-12.473318 z"
     id="path2"
     inkscape:connector-curvature="0"
     style="fill:#ea1d25;stroke-width:1.18793499"
     sodipodi:nodetypes="cccccccccccccccccccccsscc" />
</svg>
