<?xml version="1.0" encoding="UTF-8" standalone="no"?>
<svg
   xmlns:dc="http://purl.org/dc/elements/1.1/"
   xmlns:cc="http://creativecommons.org/ns#"
   xmlns:rdf="http://www.w3.org/1999/02/22-rdf-syntax-ns#"
   xmlns:svg="http://www.w3.org/2000/svg"
   xmlns="http://www.w3.org/2000/svg"
   xmlns:sodipodi="http://sodipodi.sourceforge.net/DTD/sodipodi-0.dtd"
   xmlns:inkscape="http://www.inkscape.org/namespaces/inkscape"
   inkscape:version="1.0 (1.0+r73+1)"
   sodipodi:docname="hw-xbox-2.svg"
   id="svg180"
   version="1.1"
   viewBox="0 0 38.875136 38.875136"
   height="512"
   width="512">
  <metadata
     id="metadata186">
    <rdf:RDF>
      <cc:Work
         rdf:about="">
        <dc:format>image/svg+xml</dc:format>
        <dc:type
           rdf:resource="http://purl.org/dc/dcmitype/StillImage" />
        <dc:title></dc:title>
      </cc:Work>
    </rdf:RDF>
  </metadata>
  <defs
     id="defs184" />
  <sodipodi:namedview
     inkscape:current-layer="svg180"
     inkscape:window-maximized="1"
     inkscape:window-y="24"
     inkscape:window-x="0"
     inkscape:cy="256"
     inkscape:cx="256"
     inkscape:zoom="1.6035156"
     fit-margin-bottom="0"
     fit-margin-right="0"
     fit-margin-left="0"
     fit-margin-top="0"
     inkscape:showpageshadow="false"
     showgrid="false"
     id="namedview182"
     inkscape:window-height="1033"
     inkscape:window-width="1920"
     inkscape:pageshadow="2"
     inkscape:pageopacity="0"
     guidetolerance="10"
     gridtolerance="10"
     objecttolerance="10"
     borderopacity="1"
     bordercolor="#666666"
     pagecolor="#ffffff" />
  <linearGradient
     y2="49.625999"
     x2="89.074997"
     y1="91.839996"
     x1="46.861"
     gradientUnits="userSpaceOnUse"
     id="a">
    <stop
       id="stop6"
       stop-color="#c9ca4c"
       offset=".17" />
    <stop
       id="stop8"
       stop-color="#c8c94c"
       offset=".418" />
    <stop
       id="stop10"
       stop-color="#c2c74d"
       offset=".578" />
    <stop
       id="stop12"
       stop-color="#b9c350"
       offset=".713" />
    <stop
       id="stop14"
       stop-color="#abbd52"
       offset=".834" />
    <stop
       id="stop16"
       stop-color="#9ab656"
       offset=".944" />
    <stop
       id="stop18"
       stop-color="#90b258"
       offset="1" />
  </linearGradient>
  <linearGradient
     y2="91.713997"
     x2="141.224"
     y1="49.681999"
     x1="99.192001"
     gradientUnits="userSpaceOnUse"
     id="b">
    <stop
       id="stop23"
       stop-color="#637e3e"
       offset="0" />
    <stop
       id="stop25"
       stop-color="#78974a"
       offset=".077" />
    <stop
       id="stop27"
       stop-color="#89ab54"
       offset=".151" />
    <stop
       id="stop29"
       stop-color="#90b258"
       offset=".192" />
    <stop
       id="stop31"
       stop-color="#93b357"
       offset=".197" />
    <stop
       id="stop33"
       stop-color="#a3ba54"
       offset=".229" />
    <stop
       id="stop35"
       stop-color="#b2c051"
       offset=".266" />
    <stop
       id="stop37"
       stop-color="#bdc54f"
       offset=".309" />
    <stop
       id="stop39"
       stop-color="#c4c84d"
       offset=".362" />
    <stop
       id="stop41"
       stop-color="#c8ca4c"
       offset=".437" />
    <stop
       id="stop43"
       stop-color="#c9ca4c"
       offset=".644" />
  </linearGradient>
  <linearGradient
     y2="124.205"
     x2="139.121"
     y1="80.681"
     x1="95.597"
     gradientUnits="userSpaceOnUse"
     id="c">
    <stop
       id="stop48"
       stop-color="#66813f"
       offset="0" />
    <stop
       id="stop50"
       stop-color="#90b258"
       offset=".226" />
    <stop
       id="stop52"
       stop-color="#96b457"
       offset=".259" />
    <stop
       id="stop54"
       stop-color="#a8bc53"
       offset=".379" />
    <stop
       id="stop56"
       stop-color="#b7c250"
       offset=".507" />
    <stop
       id="stop58"
       stop-color="#c1c74e"
       offset=".644" />
    <stop
       id="stop60"
       stop-color="#c8c94c"
       offset=".798" />
    <stop
       id="stop62"
       stop-color="#c9ca4c"
       offset="1" />
  </linearGradient>
  <linearGradient
     y2="124.565"
     x2="49.484001"
     y1="81.041"
     x1="93.008003"
     gradientUnits="userSpaceOnUse"
     id="d">
    <stop
       id="stop67"
       stop-color="#577036"
       offset="0" />
    <stop
       id="stop69"
       stop-color="#90b258"
       offset=".271" />
    <stop
       id="stop71"
       stop-color="#9ab656"
       offset=".316" />
    <stop
       id="stop73"
       stop-color="#abbd53"
       offset=".409" />
    <stop
       id="stop75"
       stop-color="#b9c350"
       offset=".511" />
    <stop
       id="stop77"
       stop-color="#c2c74d"
       offset=".623" />
    <stop
       id="stop79"
       stop-color="#c8c94c"
       offset=".756" />
    <stop
       id="stop81"
       stop-color="#c9ca4c"
       offset=".961" />
  </linearGradient>
  <linearGradient
     y2="41.834"
     x2="77.689003"
     y1="41.834"
     x1="44.610001"
     gradientUnits="userSpaceOnUse"
     id="e">
    <stop
       id="stop86"
       offset="0" />
    <stop
       id="stop88"
       stop-color="#839363"
       offset="0" />
    <stop
       id="stop90"
       stop-color="#707e57"
       offset=".234" />
    <stop
       id="stop92"
       stop-color="#586346"
       offset=".575" />
    <stop
       id="stop94"
       stop-color="#475039"
       offset=".842" />
    <stop
       id="stop96"
       stop-color="#404934"
       offset="1" />
  </linearGradient>
  <linearGradient
     y2="42.835999"
     x2="136.326"
     y1="42.835999"
     x1="94.156998"
     gradientUnits="userSpaceOnUse"
     id="f">
    <stop
       id="stop101"
       stop-color="#49503d"
       offset="0" />
    <stop
       id="stop103"
       stop-color="#78875b"
       offset="1" />
  </linearGradient>
  <linearGradient
     y2="92.877998"
     x2="156.77299"
     y1="92.877998"
     x1="108.454"
     gradientUnits="userSpaceOnUse"
     id="g">
    <stop
       id="stop108"
       stop-color="#434a39"
       offset="0" />
    <stop
       id="stop110"
       stop-color="#4b533f"
       offset=".165" />
    <stop
       id="stop112"
       stop-color="#5e684d"
       offset=".46" />
    <stop
       id="stop114"
       stop-color="#78865d"
       offset=".847" />
    <stop
       id="stop116"
       stop-color="#839363"
       offset="1" />
  </linearGradient>
  <g
     transform="scale(0.2048)"
     id="g372">
    <path
       d="M 0,0 H 189.82 V 189.82 H 0 Z"
       id="path2" />
    <g
       id="g326"
       transform="translate(-0.5145,1.1185387)">
      <g
         id="g286">
        <path
           d="M 172.542,134.464 V 12.473 H 18.339 v 121.991 z"
           id="path4" />
        <path
           style="fill:url(#a)"
           d="M 94.247,55.859 51.707,35.977 v 59.646 l 42.54,-0.154 z"
           fill="url(#a)"
           id="path21" />
        <path
           style="fill:url(#b)"
           d="M 136.4,35.978 94.223,55.859 V 95.624 H 136.4 Z"
           fill="url(#b)"
           id="path46" />
        <path
           style="fill:url(#c)"
           d="m 143.662,118.728 v -5.239 L 108.675,68.792 v 49.937 h 34.987 z"
           fill="url(#c)"
           id="path65" />
        <path
           style="fill:url(#d)"
           d="M 79.992,119.024 V 69.088 l -34.987,44.697 v 5.239 z"
           fill="url(#d)"
           id="path84" />
        <path
           style="fill:url(#e)"
           d="m 42.229,27.809 7.167,6.628 c 10.327,7.552 25.277,14.641 44.852,21.423 v -3.7 z"
           fill="url(#e)"
           id="path99" />
        <path
           style="fill:url(#f)"
           d="m 136.4,35.978 5.086,-6.165 -47.276,22.339 0.01,3.707 c 20.654,-8.478 34.705,-15.105 42.18,-19.881 z"
           fill="url(#f)"
           id="path106" />
        <path
           style="fill:url(#g)"
           d="m 108.518,64.325 0.153,4.855 c 11.251,16.184 23.351,31.674 36.143,46.547 l 12.023,5.703 z"
           fill="url(#g)"
           id="path119" />
        <g
           id="g128">
          <linearGradient
             id="h"
             gradientUnits="userSpaceOnUse"
             x1="24.454"
             y1="93.350998"
             x2="70.417999"
             y2="93.350998">
            <stop
               offset="0"
               stop-color="#739148"
               id="stop121" />
            <stop
               offset="1"
               stop-color="#64724c"
               id="stop123" />
          </linearGradient>
          <path
             style="fill:url(#h)"
             d="m 79.983,69.423 0.077,-5.009 -45.774,57.874 8.554,-5.165 c 10.48,-9.939 22.887,-25.814 37.143,-47.7 z"
             fill="url(#h)"
             id="path126" />
        </g>
        <g
           id="g149">
          <radialGradient
             id="i"
             cx="94.217003"
             cy="76.235001"
             r="106.617"
             gradientUnits="userSpaceOnUse">
            <stop
               offset="0"
               stop-color="#fff"
               id="stop130" />
            <stop
               offset=".012"
               stop-color="#f4f5f5"
               id="stop132" />
            <stop
               offset=".122"
               stop-color="#b6b8ba"
               id="stop134" />
            <stop
               offset=".226"
               stop-color="#86888a"
               id="stop136" />
            <stop
               offset=".32"
               stop-color="#636466"
               id="stop138" />
            <stop
               offset=".402"
               stop-color="#464547"
               id="stop140" />
            <stop
               offset=".47"
               stop-color="#212122"
               id="stop142" />
            <stop
               offset=".514"
               id="stop144" />
          </radialGradient>
          <path
             style="fill:url(#i)"
             d="m 127.769,91.154 c 8.786,11.328 18.727,22.272 30.054,32.905 l -1.694,-110.2 c -24.121,26.433 -39.996,43.311 -47.625,50.476 7.861,11.406 14.255,20.346 19.265,26.819 z"
             fill="url(#i)"
             id="path147" />
        </g>
        <g
           id="g160">
          <radialGradient
             id="j"
             cx="94.342003"
             cy="76.196999"
             r="108.175"
             gradientUnits="userSpaceOnUse">
            <stop
               offset="0"
               stop-color="#fff"
               id="stop151" />
            <stop
               offset=".25"
               stop-color="#87888b"
               id="stop153" />
            <stop
               offset=".441"
               id="stop155" />
          </radialGradient>
          <path
             style="fill:url(#j)"
             d="M 128.743,37.596 C 139.377,32.2 146.159,26.961 149.242,22.107 l -58.06,-6.896 -54.685,4.813 c 4.778,6.551 13.178,12.871 25.2,18.804 4.546,2.312 9.941,4.701 16.336,7.243 2.544,1.003 8.015,3.161 16.184,6.319 15.105,-5.778 26.588,-10.633 34.526,-14.794 z"
             fill="url(#j)"
             id="path158" />
        </g>
        <g
           id="g164">
          <path
             d="m 33.444,12.473 h -3.777 l 0.309,112.435 C 36.141,120.363 43.308,113.195 51.63,103.332 60.954,92.311 70.356,79.364 80.067,64.415 L 66.196,51.005 C 61.187,45.995 56.948,41.757 53.634,38.058 46.236,30.12 39.531,21.565 33.444,12.473 Z"
             id="path162" />
        </g>
        <g
           id="g168">
          <path
             d="m 18.307,129.67 v 4.777 H 172.51 v -3.469 c -11.868,-6.78 -22.271,-13.1 -31.21,-18.88 C 124.114,100.77 108.394,88.902 94.214,76.34 80.266,90.136 64.776,102.388 47.591,113.101 c -7.86,4.933 -17.031,10.095 -27.589,15.721 z"
             id="path166" />
        </g>
      </g>
      <g
         transform="translate(2.029)"
         id="g174"
         fill="#9abf5e">
        <path
           sodipodi:nodetypes="cccccccccccccsccsccssccccsccsccccccccccccccccccccccc"
           id="path170"
           d="m 160.97,132.863 -11.931,9.655 -11.873,-9.655 h -6.715 l 15.289,12.353 -15.289,12.351 h 6.715 l 11.873,-9.713 11.931,9.713 h 6.655 l -15.23,-12.351 15.23,-12.353 z m -32.498,12.353 c 0,-5.516 -1.439,-9.594 -4.196,-12.353 H 99.873 c -2.879,2.759 -4.318,6.837 -4.318,12.353 0,5.516 1.439,9.593 4.318,12.352 h 24.403 c 2.757,-2.759 4.196,-6.896 4.196,-12.352 z m -4.078,0 c 0,1.859 -0.418,3.776 -1.199,5.757 l -1.139,2.577 H 102.03 l -1.14,-2.577 c -0.839,-1.98 -1.199,-3.897 -1.199,-5.757 0,-2.938 0.78,-5.696 2.339,-8.275 h 20.026 c 1.559,2.579 2.338,5.337 2.338,8.275 z m -35.075,1.019 v -2.037 l 1.799,-0.962 c -0.42,-4.616 -1.799,-8.093 -4.137,-10.373 H 62.577 c -2.339,2.22 -3.778,5.698 -4.138,10.313 h -3.957 v 4.078 h 3.957 c 0.36,4.616 1.799,8.034 4.138,10.312 H 86.98 c 2.338,-2.339 3.717,-5.755 4.137,-10.312 z m -4.557,-9.295 c 1.127493,1.91949 1.880164,4.03565 2.218,6.236 H 62.577 c 0.36,-2.338 1.079,-4.376 2.218,-6.236 z m 2.218,10.315 c -0.337369,2.21902 -1.089828,4.35461 -2.218,6.295 H 64.795 c -1.14,-1.858 -1.858,-3.956 -2.218,-6.295 z" />
        <path
           id="path172"
           d="m 41.052,145.216 15.229,-12.353 h -6.716 l -11.872,9.655 -11.932,-9.655 h -6.595 l 15.17,12.353 -15.17,12.351 h 6.595 l 11.932,-9.713 11.872,9.713 h 6.716 z" />
      </g>
    </g>
  </g>
  <g
     id="g178"
     fill="#90b258" />
</svg>
