<?xml version="1.0" encoding="UTF-8" standalone="no"?>
<svg
   xmlns:dc="http://purl.org/dc/elements/1.1/"
   xmlns:cc="http://creativecommons.org/ns#"
   xmlns:rdf="http://www.w3.org/1999/02/22-rdf-syntax-ns#"
   xmlns:svg="http://www.w3.org/2000/svg"
   xmlns="http://www.w3.org/2000/svg"
   xmlns:sodipodi="http://sodipodi.sourceforge.net/DTD/sodipodi-0.dtd"
   xmlns:inkscape="http://www.inkscape.org/namespaces/inkscape"
   enable-background="new 0 0 128 128"
   height="512"
   id="Layer_1"
   version="1.1"
   viewBox="0 0 512 512"
   width="512"
   xml:space="preserve"
   sodipodi:docname="tag.svg"
   inkscape:version="0.92.4 (unknown)"><metadata
     id="metadata19"><rdf:RDF><cc:Work
         rdf:about=""><dc:format>image/svg+xml</dc:format><dc:type
           rdf:resource="http://purl.org/dc/dcmitype/StillImage" /><dc:title></dc:title></cc:Work></rdf:RDF></metadata><defs
     id="defs17" /><sodipodi:namedview
     pagecolor="#ffffff"
     bordercolor="#666666"
     borderopacity="1"
     objecttolerance="10"
     gridtolerance="10"
     guidetolerance="10"
     inkscape:pageopacity="0"
     inkscape:pageshadow="2"
     inkscape:window-width="1920"
     inkscape:window-height="1032"
     id="namedview15"
     showgrid="false"
     inkscape:showpageshadow="false"
     fit-margin-top="0"
     fit-margin-left="0"
     fit-margin-right="0"
     fit-margin-bottom="0"
     inkscape:zoom="1.6132812"
     inkscape:cx="256"
     inkscape:cy="256"
     inkscape:window-x="0"
     inkscape:window-y="23"
     inkscape:window-maximized="1"
     inkscape:current-layer="Layer_1" /><circle
     style="opacity:1;fill:none;fill-opacity:1;stroke:none;stroke-width:13.42622757;stroke-linecap:round;stroke-linejoin:round;stroke-miterlimit:4;stroke-dasharray:none;stroke-dashoffset:0;stroke-opacity:1;paint-order:stroke fill markers"
     id="path816"
     cx="256"
     cy="256"
     r="256" /><g
     id="g27"
     transform="matrix(4.1507738,0,0,4.1507738,-15.077484,-2.1264399)"><path
       id="path2"
       d="m 123.1,41.4 c -0.2,-2.2 -1.9,-5.1 -4,-6.4 L 96.2,21.4 c -2,-1.2 -4.9,-1.9 -7.5,-1.9 -1.4,0 -2.7,0.2 -3.8,0.6 L 7.4,51.2 c -3.1,1.2 -4.3,5.4 -2.8,9 l 18.3,45.6 c 1.2,2.9 3.8,4.8 6.4,4.8 0.6,0 1.3,-0.1 1.9,-0.4 L 108.6,79 c 3.1,-1.2 6.3,-5.2 7.3,-8.7 L 123,45.2 v 0 c 0,0.2 0.4,-1.7 0.1,-3.8 z m -4,3 -7.1,24.9 c -0.7,2.6 -3.2,5.4 -4.9,6 l -77.4,31.2 c -0.1,0 -0.2,0.1 -0.4,0.1 -0.9,0 -2.1,-0.9 -2.7,-2.3 L 8.3,58.7 C 7.6,57 8.2,55.3 8.9,55 L 86.3,23.8 c 0.5,-0.2 1.4,-0.3 2.3,-0.3 2,0 4.1,0.5 5.5,1.3 L 117,38.4 c 1,0.6 2,2.3 2.1,3.4 0.2,1.2 0,2.3 0,2.6 z"
       inkscape:connector-curvature="0"
       style="fill:#2c3e50" /><path
       id="path4"
       d="m 96.2,38.3 c -6.2,0 -11.2,5 -11.2,11.2 0,6.2 5,11.2 11.2,11.2 6.2,0 11.2,-5 11.2,-11.2 0.1,-6.1 -4.9,-11.2 -11.2,-11.2 z m 0,18.5 c -4,0 -7.2,-3.3 -7.2,-7.2 0,-3.9 3.3,-7.2 7.2,-7.2 3.9,0 7.2,3.3 7.2,7.2 0,3.9 -3.2,7.2 -7.2,7.2 z"
       inkscape:connector-curvature="0"
       style="fill:#3b97d3" /><path
       id="path6"
       d="m 28,74.7 c -0.4,0 -0.8,-0.2 -0.9,-0.6 -0.2,-0.5 0,-1.1 0.6,-1.3 l 43,-17 c 0.5,-0.2 1.1,0 1.3,0.6 0.2,0.5 0,1.1 -0.6,1.3 l -43,17 c -0.2,-0.1 -0.3,0 -0.4,0 z"
       inkscape:connector-curvature="0"
       style="fill:#3b97d3" /><path
       id="path8"
       d="m 31,82.3 c -0.4,0 -0.8,-0.2 -0.9,-0.6 -0.2,-0.5 0,-1.1 0.6,-1.3 l 43,-17 c 0.5,-0.2 1.1,0 1.3,0.6 0.2,0.5 0,1.1 -0.6,1.3 l -43,17 c -0.2,0 -0.3,0 -0.4,0 z"
       inkscape:connector-curvature="0"
       style="fill:#3b97d3" /><path
       id="path10"
       d="m 34,90 c -0.4,0 -0.8,-0.2 -0.9,-0.6 -0.2,-0.5 0,-1.1 0.6,-1.3 l 43,-17 c 0.5,-0.2 1.1,0 1.3,0.6 0.2,0.5 0,1.1 -0.6,1.3 l -43,17 c -0.2,0 -0.3,0 -0.4,0 z"
       inkscape:connector-curvature="0"
       style="fill:#3b97d3" /><path
       id="path12"
       d="m 24,67 c -0.4,0 -0.8,-0.2 -0.9,-0.6 -0.2,-0.5 0,-1.1 0.6,-1.3 l 43,-17 c 0.5,-0.2 1.1,0 1.3,0.6 0.2,0.5 0,1.1 -0.6,1.3 l -43,17 c -0.2,0 -0.3,0 -0.4,0 z"
       inkscape:connector-curvature="0"
       style="fill:#3b97d3" /></g></svg>