<?xml version="1.0" encoding="UTF-8" standalone="no"?>
<svg
   xmlns:dc="http://purl.org/dc/elements/1.1/"
   xmlns:cc="http://creativecommons.org/ns#"
   xmlns:rdf="http://www.w3.org/1999/02/22-rdf-syntax-ns#"
   xmlns:svg="http://www.w3.org/2000/svg"
   xmlns="http://www.w3.org/2000/svg"
   xmlns:xlink="http://www.w3.org/1999/xlink"
   xmlns:sodipodi="http://sodipodi.sourceforge.net/DTD/sodipodi-0.dtd"
   xmlns:inkscape="http://www.inkscape.org/namespaces/inkscape"
   height="512"
   width="504.44391"
   inkscape:version="1.0 (1.0+r73+1)"
   sodipodi:docname="browser-camino.svg"
   id="svg97"
   version="1.1"
   preserveAspectRatio="xMinYMin"
   viewBox="0 0 504.44391 512">
  <metadata
     id="metadata101">
    <rdf:RDF>
      <cc:Work
         rdf:about="">
        <dc:format>image/svg+xml</dc:format>
        <dc:type
           rdf:resource="http://purl.org/dc/dcmitype/StillImage" />
        <dc:title>camino</dc:title>
      </cc:Work>
    </rdf:RDF>
  </metadata>
  <sodipodi:namedview
     fit-margin-bottom="0"
     fit-margin-right="0"
     fit-margin-left="0"
     fit-margin-top="0"
     inkscape:showpageshadow="false"
     inkscape:current-layer="svg97"
     inkscape:window-maximized="1"
     inkscape:window-y="24"
     inkscape:window-x="0"
     inkscape:cy="256"
     inkscape:cx="252.22195"
     inkscape:zoom="1.6035156"
     showgrid="false"
     id="namedview99"
     inkscape:window-height="1033"
     inkscape:window-width="1920"
     inkscape:pageshadow="2"
     inkscape:pageopacity="0"
     guidetolerance="10"
     gridtolerance="10"
     objecttolerance="10"
     borderopacity="1"
     bordercolor="#666666"
     pagecolor="#ffffff" />
  <title
     id="title2">camino</title>
  <desc
     id="desc4">Created with Sketch.</desc>
  <defs
     id="defs59">
    <linearGradient
       gradientUnits="userSpaceOnUse"
       gradientTransform="matrix(0.99252038,0,0,1.007536,4,0)"
       id="linearGradient-1"
       y2="438.51083"
       x2="323.87033"
       y1="-13.019124"
       x1="22.763758">
      <stop
         id="stop6"
         offset="0%"
         stop-color="#FFF" />
      <stop
         id="stop8"
         offset="100%"
         stop-color="#E3E3E3" />
    </linearGradient>
    <linearGradient
       gradientUnits="userSpaceOnUse"
       id="linearGradient-3"
       y2="190.30992"
       x2="119.75972"
       y1="4.5097599"
       x1="66.516327">
      <stop
         id="stop24"
         offset="0%"
         stop-color="#0038A5" />
      <stop
         id="stop26"
         offset="36.4%"
         stop-color="#114AAF" />
      <stop
         id="stop28"
         offset="100%"
         stop-color="#8CCEFE" />
    </linearGradient>
    <circle
       r="97.5"
       cy="97.5"
       cx="97.5"
       id="path-4" />
    <radialGradient
       gradientUnits="userSpaceOnUse"
       gradientTransform="scale(1.1338934,0.8819171)"
       id="radialGradient-6"
       r="8.0331354"
       fy="95.247047"
       fx="9.701088"
       cy="95.247047"
       cx="9.701088">
      <stop
         id="stop32"
         offset="0%"
         stop-color="#FFF" />
      <stop
         id="stop34"
         offset="100%"
         stop-opacity="0"
         stop-color="#FFF" />
    </radialGradient>
    <radialGradient
       id="radialGradient-7"
       r="0.43542001"
       fy="0.5"
       fx="0.5"
       cy="0.5"
       cx="0.5">
      <stop
         id="stop37"
         offset="0%"
         stop-color="#FFF" />
      <stop
         id="stop39"
         offset="100%"
         stop-opacity="0"
         stop-color="#FFF" />
    </radialGradient>
    <radialGradient
       id="radialGradient-8"
       r="0.43542001"
       fy="0.5"
       fx="0.5"
       cy="0.5"
       cx="0.5">
      <stop
         id="stop42"
         offset="0%"
         stop-opacity=".67"
         stop-color="#FFF" />
      <stop
         id="stop44"
         offset="100%"
         stop-opacity="0"
         stop-color="#FFF" />
    </radialGradient>
    <radialGradient
       gradientUnits="userSpaceOnUse"
       gradientTransform="matrix(1.2608473,0,0,0.79311743,4,0)"
       id="radialGradient-9"
       r="102.37769"
       fy="201.20924"
       fx="127.5506"
       cy="201.20924"
       cx="127.5506">
      <stop
         id="stop47"
         offset="0%"
         stop-opacity="0"
         stop-color="#FFF" />
      <stop
         id="stop49"
         offset="65.191%"
         stop-opacity=".135"
         stop-color="#FFF" />
      <stop
         id="stop51"
         offset="100%"
         stop-opacity=".765"
         stop-color="#FFF" />
    </radialGradient>
    <linearGradient
       id="linearGradient-10"
       y2="1"
       x2="0.5"
       y1="0"
       x1="0.5">
      <stop
         id="stop54"
         offset="0%"
         stop-opacity=".017"
         stop-color="#FFF" />
      <stop
         id="stop56"
         offset="100%"
         stop-opacity=".326"
         stop-color="#FFF" />
    </linearGradient>
    <radialGradient
       gradientUnits="userSpaceOnUse"
       gradientTransform="scale(1.1339183,0.88189777)"
       r="5.0034671"
       fy="41.954975"
       fx="35.275909"
       cy="41.954975"
       cx="35.275909"
       id="radialGradient103"
       xlink:href="#radialGradient-7"
       inkscape:collect="always" />
    <radialGradient
       gradientUnits="userSpaceOnUse"
       gradientTransform="scale(1.1339021,0.88191033)"
       r="7.1501064"
       fy="10.205119"
       fx="74.080467"
       cy="10.205119"
       cx="74.080467"
       id="radialGradient105"
       xlink:href="#radialGradient-7"
       inkscape:collect="always" />
    <radialGradient
       gradientUnits="userSpaceOnUse"
       gradientTransform="scale(1.1339046,0.88190842)"
       r="5.5810642"
       fy="24.500277"
       fx="103.18329"
       cy="24.500277"
       cx="103.18329"
       id="radialGradient107"
       xlink:href="#radialGradient-7"
       inkscape:collect="always" />
    <radialGradient
       gradientUnits="userSpaceOnUse"
       gradientTransform="scale(1.1339046,0.88190842)"
       r="5.5810642"
       fy="63.053028"
       fx="134.93199"
       cy="63.053028"
       cx="134.93199"
       id="radialGradient109"
       xlink:href="#radialGradient-7"
       inkscape:collect="always" />
    <radialGradient
       gradientUnits="userSpaceOnUse"
       gradientTransform="scale(1.1338647,0.88193942)"
       r="8.66259"
       fy="119.74405"
       fx="140.35008"
       cy="119.74405"
       cx="140.35008"
       id="radialGradient111"
       xlink:href="#radialGradient-7"
       inkscape:collect="always" />
    <radialGradient
       gradientUnits="userSpaceOnUse"
       gradientTransform="scale(1.1339384,0.88188209)"
       r="9.6703815"
       fy="153.76997"
       fx="57.444035"
       cy="153.76997"
       cx="57.444035"
       id="radialGradient113"
       xlink:href="#radialGradient-8"
       inkscape:collect="always" />
    <radialGradient
       gradientUnits="userSpaceOnUse"
       gradientTransform="scale(1.1339238,0.8818935)"
       r="6.1469769"
       fy="114.62042"
       fx="32.57362"
       cy="114.62042"
       cx="32.57362"
       id="radialGradient115"
       xlink:href="#radialGradient-8"
       inkscape:collect="always" />
    <radialGradient
       gradientUnits="userSpaceOnUse"
       gradientTransform="scale(1.1339238,0.8818935)"
       r="6.1469769"
       fy="83.622345"
       fx="94.240906"
       cy="83.622345"
       cx="94.240906"
       id="radialGradient117"
       xlink:href="#radialGradient-8"
       inkscape:collect="always" />
    <linearGradient
       gradientUnits="userSpaceOnUse"
       gradientTransform="scale(1.0029985,0.99701047)"
       y2="194.48718"
       x2="97.685486"
       y1="0.35361239"
       x1="97.685486"
       id="linearGradient119"
       xlink:href="#linearGradient-10"
       inkscape:collect="always" />
    <linearGradient
       gradientUnits="userSpaceOnUse"
       gradientTransform="scale(1.0029985,0.99701047)"
       y2="194.48718"
       x2="97.685486"
       y1="0.35361239"
       x1="97.685486"
       id="linearGradient121"
       xlink:href="#linearGradient-10"
       inkscape:collect="always" />
    <linearGradient
       y2="438.51083"
       x2="323.87033"
       y1="-13.019124"
       x1="22.763758"
       gradientTransform="matrix(0.99252038,0,0,1.007536,4.0000102,0.3525168)"
       gradientUnits="userSpaceOnUse"
       id="linearGradient1001"
       xlink:href="#linearGradient-1"
       inkscape:collect="always" />
  </defs>
  <g
     transform="matrix(1.5112238,0,0,1.5112238,-3.930498,1.2009192)"
     id="g1100">
    <path
       style="mix-blend-mode:normal;fill:url(#linearGradient1001);fill-rule:evenodd;stroke:#9f9f9f;stroke-width:1"
       d="m 187.3543,278.55735 c 46.13674,-8.36112 82.43273,-44.984 90.30755,-91.28823 l 57.08621,-17.42833 -56.82107,-18.76502 v 0 C 270.63047,103.96305 233.97144,66.553005 187.23891,58.134638 v 0 L 169.75196,0.8564228 151.0385,57.521388 C 102.05929,64.623685 63.346226,103.4226 56.373726,152.44372 v 0 l -52.1217658,15.9127 52.3248958,17.28016 c 7.47966,48.29659 45.816014,86.39685 94.229184,93.52091 l 17.46155,57.19502 z"
       id="path999" />
    <g
       id="g1071">
      <g
         transform="translate(70,70)"
         id="Oval-lines"
         style="fill:none;fill-rule:evenodd;stroke:none;stroke-width:1">
        <mask
           fill="#ffffff"
           id="mask-5">
          <use
             height="100%"
             width="100%"
             y="0"
             x="0"
             id="use62"
             xlink:href="#path-4" />
        </mask>
        <use
           height="100%"
           width="100%"
           y="0"
           x="0"
           style="fill:url(#linearGradient-3)"
           xlink:href="#path-4"
           fill="url(#linearGradient-3)"
           stroke="#979797"
           id="Mask" />
        <path
           mask="url(#mask-5)"
           fill="#b1d1ea"
           opacity="0.313"
           id="Shape"
           d="M 67.179687,157.60547 C 98.53968,157.60547 120.5,124.42713 120.5,79.5 120.5,33.722449 92.797334,0.6640625 51.431641,0.6640625 c -16.228444,0 -25.83727,3.5456364 -31.514757,11.4790225 -4.734099,6.615152 -6.544636,14.753277 -8.478323,33.479977 0.09624,-0.931979 -1.036781,10.274151 -1.395999,13.587972 -0.6031105,5.563764 -1.2097226,10.478459 -1.9235501,15.405942 -3.3745356,23.294097 2.2657441,44.369394 14.8567961,60.067164 11.555805,14.40708 28.083286,22.92133 44.203879,22.92133 z m 0,-3 c -15.177576,0 -30.858929,-8.07836 -41.863662,-21.7984 C 13.248415,117.7619 7.831999,97.523084 11.088019,75.047086 c 0.719486,-4.96654 1.330358,-9.91575 1.937071,-15.512747 0.360595,-3.326527 1.494849,-14.544904 1.397605,-13.60314 1.8774,-18.181598 3.61999,-26.014312 7.93382,-32.042205 C 27.376166,6.8748303 36.077483,3.6640625 51.431641,3.6640625 91.011523,3.6640625 117.5,35.273521 117.5,79.5 c 0,43.46785 -20.940539,75.10547 -50.320313,75.10547 z" />
        <path
           mask="url(#mask-5)"
           fill="#b1d1ea"
           opacity="0.313"
           id="path67"
           d="M 179.95847,186.49198 C 194.14382,170.73754 195.89764,144.12505 187.0111,113.6294 179.0649,86.360659 163.31675,59.299456 146.85917,44.480984 130.77906,30.002393 101.18845,18.342171 71.320624,14.37694 39.105893,10.100136 11.891962,15.268813 -1.5639353,30.213101 -15.295626,45.463689 -24.459366,82.232058 -25.659748,122.99557 c -1.24589,42.30893 6.250929,79.85091 21.2605084,97.89342 14.9123986,17.92569 50.0429876,20.35739 93.2240986,9.84626 38.384571,-9.34357 76.135341,-27.58601 91.133611,-44.24327 z m -2.22944,-2.00739 c -14.5189,16.12488 -51.76168,34.12184 -89.613712,43.33577 -42.158211,10.26215 -76.273344,7.90073 -90.2082698,-8.84998 C -16.51766,201.63093 -23.887298,164.72584 -22.661047,123.08387 -21.479858,82.972117 -12.465784,46.80426 0.6654992,32.220493 13.304187,18.183808 39.592102,13.191007 70.92581,17.350847 c 29.31335,3.89162 58.34732,15.332492 73.92597,29.359572 16.01435,14.419392 31.4805,40.996008 39.27912,67.758281 8.62609,29.60188 6.93918,55.19915 -6.40187,70.01589 z" />
        <path
           mask="url(#mask-5)"
           fill="#b1d1ea"
           opacity="0.313"
           id="path69"
           d="m 189.17969,164.14844 c 15.24567,0 26.21526,-9.89599 33.08131,-27.86291 5.81655,-15.22063 8.583,-35.97999 8.583,-59.949593 0,-6.520176 0.95885,-13.620793 2.79643,-21.615233 1.50357,-6.541346 3.39683,-13.014864 6.43193,-22.425133 0.23738,-0.735972 2.72263,-8.378874 3.41656,-10.553517 1.25106,-3.920573 2.19713,-7.03893 2.99585,-9.926174 1.96705,-7.1105892 2.96079,-12.60745277 2.96079,-17.2062572 0,-11.2943468 -6.24898,-17.0979038 -20.10156,-17.0979038 -24.06696,0 -47.37102,5.08064 -66.26593,15.7442144 -22.92224,12.9364498 -38.38849,33.4192346 -44.32967,61.9006526 -5.89411,28.255778 1.45743,55.646234 18.43751,77.494594 14.83452,19.08767 35.5777,31.49726 51.99378,31.49726 z m 0,-3 c -15.3828,0 -35.3136,-11.92358 -49.62504,-30.3382 -16.46144,-21.18103 -23.57552,-47.686752 -17.86946,-75.041045 5.7611,-27.618136 20.68377,-47.3810346 42.86736,-59.9006166 18.40166,-10.3852004 41.20584,-15.3568594 64.79145,-15.3568594 12.24326,0 17.10156,4.512005 17.10156,14.0979037 0,4.2733387 -0.95104,9.5340069 -2.85219,16.4063883 -0.78665,2.843619 -1.72226,5.927481 -2.96247,9.81405 -0.69092,2.165224 -3.17407,9.801663 -3.4137,10.544629 -3.05946,9.485757 -4.97326,16.029521 -6.50053,22.673969 -1.88455,8.19882 -2.87267,15.516153 -2.87267,22.287278 0,51.975333 -12.5487,84.812503 -38.66431,84.812503 z" />
        <path
           mask="url(#mask-5)"
           fill="#b1d1ea"
           opacity="0.313"
           id="path71"
           d="M 98.479335,281.54946 C 124.28836,262.79811 99.811475,164.05616 60.597591,123.83124 20.978603,83.190771 -5.7067997,73.385475 -31.02282,91.77864 c -25.796549,18.74229 -25.414086,62.84535 0.504343,98.51901 13.970275,19.22844 40.0664922,46.38201 63.892941,65.71317 29.618891,24.03075 52.910776,34.39817 65.104871,25.53864 z m -1.763356,-2.42705 c -10.54344,7.66026 -32.938825,-2.30813 -61.451377,-25.44127 -23.628614,-19.17064 -49.543529,-46.13557 -63.356028,-65.14684 -25.04767,-34.47516 -25.413957,-76.71292 -1.168038,-94.328609 23.7572596,-17.260659 49.002689,-7.984468 87.70891,31.719699 38.120122,39.10295 62.108624,135.87473 38.266533,153.19702 z" />
        <path
           mask="url(#mask-5)"
           fill="#b1d1ea"
           opacity="0.313"
           id="path73"
           d="m -25.132812,72.001954 c 0,18.153267 17.5136257,39.522216 44.409834,55.773106 27.835471,16.81841 60.824492,25.31845 88.910018,21.45115 27.61689,-3.80276 54.88037,-19.78496 76.72047,-42.89234 19.44478,-20.573076 32.00069,-44.422237 32.00069,-60.570739 0,-15.428848 -17.05143,-41.0415506 -41.65187,-64.099354 -25.92192,-24.296416 -54.13554,-40.214557 -74.71922,-40.214557 -20.62873,0 -50.878706,20.510316 -79.444685,51.434578 -27.1418975,29.382615 -46.225237,61.278325 -46.225237,79.118156 z m 3,0 c 0,-16.852027 18.7678582,-48.220445 45.428919,-77.0825268 C 51.33141,-35.430348 81.006358,-55.55078 100.53711,-55.55078 c 19.63543,0 47.25139,15.580945 72.66764,39.403395 24.03723,22.5299096 40.70345,47.563999 40.70345,61.910516 0,15.243821 -12.21278,38.441239 -31.18095,58.510039 -21.40335,22.6453 -48.075,38.28056 -74.94944,41.98109 -27.347448,3.76566 -59.66469,-4.56129 -86.949364,-21.0469 C -5.2622654,109.44315 -22.132812,88.85885 -22.132812,72.001954 Z" />
        <path
           mask="url(#mask-5)"
           fill="#b1d1ea"
           opacity="0.313"
           id="path75"
           d="m 36.236747,211.85752 c 15.150149,12.67415 67.001663,23.16679 118.212913,24.70266 57.32554,1.71924 95.90386,-7.81156 95.90386,-28.84924 0,-6.50671 -0.1686,-3.7201 1.83779,-33.74299 1.62883,-24.37322 2.22368,-41.18779 1.63582,-58.64021 C 252.89019,87.512199 248.76089,64.744476 240.42961,47.156796 230.44949,26.088367 214.67145,13.202789 192.23677,9.7982294 153.00213,3.844203 118.42771,7.6783239 90.028182,20.036695 64.447484,31.168421 44.696419,48.957542 32.757364,70.567595 21.469143,90.99962 14.513717,119.68163 14.269349,146.5916 c -0.264291,29.10377 7.18652,52.9007 21.967398,65.26592 z m 1.924944,-2.301 C 24.202738,197.8789 17.012282,174.91351 17.269225,146.61884 17.509233,120.18906 24.346105,91.99593 35.383261,72.018342 46.999783,50.992083 66.246309,33.657383 91.225236,22.787524 119.08716,10.663097 153.09181,6.8921604 191.78666,12.764271 c 21.39378,3.246599 36.359,15.468363 45.93175,35.676819 8.1244,17.150941 12.18607,39.545755 13.11042,66.98765 0.58367,17.32806 -0.008,34.05862 -1.63084,58.33917 -2.01679,30.17846 -1.84447,27.33037 -1.84447,33.94303 0,18.27817 -37.38062,27.51308 -92.81392,25.85059 C 103.98389,232.04532 52.619138,221.65118 38.161691,209.55652 Z" />
        <path
           mask="url(#mask-5)"
           fill="#b1d1ea"
           opacity="0.313"
           id="path77"
           d="m 37.978516,236.77343 c 20.347326,0 72.168064,-6.9964 112.122844,-16.41593 56.12069,-13.23071 89.73848,-29.97235 89.73848,-50.35164 0,-7.47443 0.19078,-10.8434 1.77626,-34.84821 0.94816,-14.35546 1.44338,-23.7301 1.67095,-33.50331 C 243.86009,77.044343 242.27612,58.005273 237.6486,43.441867 231.95678,25.528959 221.71934,15.22462 206.09249,13.828219 155.34314,9.2933007 89.123323,42.193162 60.436085,84.305905 46.891444,104.18938 33.019522,141.56774 26.470242,175.02483 c -7.315235,37.36998 -4.256244,61.7486 11.508274,61.7486 z m 0,-3 c -12.65096,0 -15.502676,-22.72673 -8.564151,-58.17229 6.477241,-33.08907 20.212052,-70.09798 33.501114,-89.60627 28.086958,-41.231533 93.266671,-73.614642 142.910001,-69.178558 14.26979,1.275137 23.60628,10.672633 28.96399,27.534044 4.50412,14.175064 6.06434,32.928681 5.49839,57.234144 -0.22633,9.72013 -0.71969,19.05946 -1.66524,33.37543 -1.59218,24.10622 -1.78278,27.4721 -1.78278,35.04593 0,18.19752 -32.88104,34.57226 -87.42688,47.43169 -39.74384,9.3698 -91.340007,16.33588 -111.434444,16.33588 z" />
        <path
           mask="url(#mask-5)"
           fill="#b1d1ea"
           opacity="0.313"
           id="path79"
           d="m -41.324219,201.05859 c 0,20.93494 8.336254,32.672 26.023644,38.35558 7.7842997,2.50137 17.4698994,3.90879 30.251282,4.58202 9.873561,0.52008 18.322637,0.59556 40.335351,0.5281 C 61.082656,244.50653 63.999871,244.5 67.5,244.5 c 37.51486,0 78.64276,-5.9471 107.16425,-16.53295 34.99039,-12.98679 49.82161,-32.06195 37.57471,-56.10682 -14.18253,-27.84516 -31.08161,-50.23832 -51.43333,-66.41461 -23.55676,-18.723782 -51.24518,-28.666323 -83.563443,-28.666323 -31.757465,0 -61.721866,16.914369 -85.057676,45.010163 -20.553057,24.74542 -33.50873,55.77309 -33.50873,79.26913 z m 3,0 c 0,-22.73764 12.682787,-53.11177 32.8165154,-77.35233 C 17.300827,96.245301 46.470932,79.779297 77.242187,79.779297 c 31.630593,0 58.663523,9.707165 81.696763,28.014833 19.97961,15.88053 36.62523,37.93783 50.62678,65.42767 11.20014,21.98971 -2.4008,39.48255 -35.94536,51.93273 C 145.47061,235.6024 104.68506,241.5 67.5,241.5 c -3.50412,0 -6.423578,0.007 -12.223135,0.0243 -21.951948,0.0673 -30.371984,-0.008 -40.168357,-0.52395 -12.5455322,-0.66082 -21.9972879,-2.03426 -29.491297,-4.44235 -16.432083,-5.2802 -23.94143,-15.85301 -23.94143,-35.49941 z" />
      </g>
      <g
         transform="translate(82,81)"
         id="highlights"
         style="fill:none;fill-rule:evenodd;stroke:none;stroke-width:1">
        <ellipse
           style="fill:url(#radialGradient-6)"
           ry="7"
           rx="9"
           cy="84"
           cx="11"
           transform="rotate(20,11,84)"
           fill="url(#radialGradient-6)"
           id="Oval-11" />
        <ellipse
           style="fill:url(#radialGradient103)"
           ry="5.0669999"
           rx="6.5149999"
           cy="37"
           cx="40"
           transform="rotate(30,40,37)"
           fill="url(#radialGradient-7)"
           id="Oval-11-Copy" />
        <ellipse
           style="fill:url(#radialGradient105)"
           ry="7.2410002"
           rx="9.3100004"
           cy="9"
           cx="84"
           transform="rotate(-10,84,9)"
           fill="url(#radialGradient-7)"
           id="Oval-11-Copy-2" />
        <ellipse
           style="fill:url(#radialGradient107)"
           ry="5.652"
           rx="7.2670002"
           cy="21.607"
           cx="117"
           transform="rotate(-10,117,21.60665)"
           fill="url(#radialGradient-7)"
           id="Oval-11-Copy-3" />
        <ellipse
           style="fill:url(#radialGradient109)"
           ry="5.652"
           rx="7.2670002"
           cy="55.606998"
           cx="153"
           transform="rotate(-10,153,55.60665)"
           fill="url(#radialGradient-7)"
           id="Oval-11-Copy-4" />
        <ellipse
           style="fill:url(#radialGradient111)"
           ry="8.7729998"
           rx="11.279"
           cy="105.607"
           cx="159.138"
           transform="rotate(-10,159.13761,105.60665)"
           fill="url(#radialGradient-7)"
           id="Oval-11-Copy-5" />
        <ellipse
           style="fill:url(#radialGradient113)"
           ry="9.7930002"
           rx="12.592"
           cy="135.60699"
           cx="65.138"
           transform="rotate(-10,65.137614,135.60665)"
           fill="url(#radialGradient-8)"
           id="Oval-11-Copy-6" />
        <ellipse
           style="fill:url(#radialGradient115)"
           ry="6.2249999"
           rx="8.0039997"
           cy="101.083"
           cx="36.936001"
           transform="rotate(28,36.935853,101.08311)"
           fill="url(#radialGradient-8)"
           id="Oval-11-Copy-7" />
        <ellipse
           style="fill:url(#radialGradient117)"
           ry="6.2249999"
           rx="8.0039997"
           cy="73.746002"
           cx="106.862"
           transform="rotate(-30,106.86239,73.74601)"
           fill="url(#radialGradient-8)"
           id="Oval-11-Copy-8" />
      </g>
      <path
         style="fill:url(#radialGradient-9);fill-rule:evenodd;stroke:none;stroke-width:1"
         fill="url(#radialGradient-9)"
         id="Path-5"
         d="m 82.333216,173.31638 c -1.238281,-9.28516 -2.183594,-73.81836 59.085934,-94.1084 61.26953,-20.29004 96.87794,39.06543 96.87794,45.0714 -3.69043,1e-5 -50.8291,-7.39855 -85.38672,4.95887 -34.55762,12.35743 -62.11817,34.79297 -70.577154,44.07813 z" />
      <g
         style="fill:url(#linearGradient121);fill-rule:evenodd;stroke:none;stroke-width:1"
         fill="url(#linearGradient-10)"
         transform="translate(58,59)"
         id="coutries">
        <path
           style="fill:url(#linearGradient119)"
           id="Path-6"
           d="m 26.546875,113.59961 c 4.955078,-4.38672 12.853211,-3.13572 11.337891,-11.58887 -0.468016,-2.610802 -3.849884,-9.055662 -1.161133,-9.055661 4.475586,10e-7 12.08789,-0.131836 33.546875,-10.510742 1.898351,-0.918162 3.194449,-4.839695 2.453125,-6.822267 -2.453121,-6.560546 -3.531254,-9.567382 -4.59375,-15.487304 -2.452441,-13.664293 9.587133,0.522147 11.554684,-10.196289 1.041296,-5.672572 -0.340286,-11.249529 0,-17.006835 0.07181,-1.214983 2.576567,-1.664042 3.670898,-2.211915 13.607422,-6.8125 2.067024,10.52275 13.607422,6.873047 4.754353,-1.503585 9.769523,-6.342193 14.813473,-6.873047 11.59864,-1.220703 10.29194,3.236977 19.59278,-13.928711 1.10367,-2.036947 0.45761,-4.679108 0,-6.9501957 -0.34535,-1.7139375 -1.20923,-3.3627664 -2.3457,-4.6914062 C 126.31664,1.9849159 119.76711,1.0319146 116.51367,0.89257813 103.86969,0.35106752 91.19364,0.13431886 78.547852,0.63183594 26.865327,2.6651562 -6.2531668,31.870222 1.8330078,78.457032 4.6472905,94.670936 10.673828,89.067384 21.174805,100.56836 c 0,0 1.90039,9.78516 5.37207,13.03125 z M 86.716797,56.52246 c -2.065942,-3.495979 -7.059082,-7.687499 3.001953,-11.656737 2.994422,-1.181347 5.806899,4.570759 8.633301,3.334472 2.840159,-1.242306 2.908789,-12.00563 3.469729,-8.628418 3.87158,23.309571 -3.142905,14.399029 -6.976566,20.484863 -1.497163,2.376707 0.762619,4.943521 0,7.646972 -1.093515,3.876467 -4.810225,0.975507 -5.647948,10e-7 -1.379739,-1.606666 -2.05599,-3.703125 -3.083985,-5.554687 z m 6.810085,132.3485 c -3.495979,2.06594 -7.6875,7.05908 -11.656738,-3.00196 -1.181347,-2.99442 4.57076,-5.80689 3.334473,-8.6333 -1.242306,-2.84016 -12.00563,-2.90879 -8.628418,-3.46972 23.309571,-3.87159 14.399028,3.1429 20.484862,6.97656 2.376708,1.49716 4.943519,-0.76262 7.646969,0 3.87647,1.09351 0.97551,4.81022 0,5.64795 -1.60666,1.37974 -3.70312,2.05599 -5.554683,3.08398 z M 188.95996,56.056641 C 178.09431,43.650292 152.24136,27.14322 133.96728,32.600098 c -17.70668,5.287449 -8.02443,39.186584 -7.94921,48.987304 0.0166,2.162427 -3.73053,4.497138 -2.25879,6.081543 5.00134,5.384206 13.45225,6.519467 18.72168,11.641602 6.61779,6.432813 -4.87106,15.183913 2.94873,21.279293 3.6151,2.81791 12.81721,5.82522 14.85058,11.59815 1.0223,2.90239 0.84732,6.13757 0.65137,9.20849 -0.42934,6.72845 -6.00778,14.29924 -2.51953,20.06885 1.24392,2.05747 15.80282,-0.97635 19.50391,-3.25781 14.37472,-8.86101 1.51968,-2.72878 7.64501,-20.80713 1.78874,-5.27929 12.0962,-9.08076 9.2959,-13.90039 l -0.52148,-2.95361 c -8.25083,-14.20062 -10.54732,-28.868591 -9.64307,-45.599613 0.43774,-8.099341 4.24054,5.934827 4.77832,-13.764648 z M 44.21875,104.7041 c -18.344238,14.29395 9.012774,11.01228 8.779785,29.61475 -0.03056,2.43986 -1.41635,5.94251 -2.694824,7.91943 -10.664551,16.49072 -16.455385,7.77056 11.032716,44.48633 1.697077,2.26678 6.055275,7.0997 9.282225,7.18115 2.01172,-2.50147 -11.744881,-22.91241 -6.444824,-25.30859 8.916071,-4.031 19.941772,-2.85848 28.224121,-8.06885 3.989868,-2.51 4.133292,-8.53105 5.386231,-13.0752 0.713016,-2.58596 2.205935,-6.02122 0.43457,-8.03564 -4.288001,-4.87636 -11.250871,-7.31966 -16.544434,-10.28467 -12.051066,-6.75 7.361328,-10.15625 -32.340332,-24.75927 0,0 -3.108398,-0.68799 -5.115234,0.33056 z" />
      </g>
    </g>
  </g>
</svg>
