<?xml version="1.0" encoding="UTF-8" standalone="no"?>
<svg
   xmlns:dc="http://purl.org/dc/elements/1.1/"
   xmlns:cc="http://creativecommons.org/ns#"
   xmlns:rdf="http://www.w3.org/1999/02/22-rdf-syntax-ns#"
   xmlns:svg="http://www.w3.org/2000/svg"
   xmlns="http://www.w3.org/2000/svg"
   xmlns:sodipodi="http://sodipodi.sourceforge.net/DTD/sodipodi-0.dtd"
   xmlns:inkscape="http://www.inkscape.org/namespaces/inkscape"
   sodipodi:docname="telecom-nextel.svg"
   inkscape:version="1.0 (1.0+r73+1)"
   id="svg2"
   height="137.29219"
   width="512"
   version="1.1">
  <sodipodi:namedview
     inkscape:showpageshadow="false"
     inkscape:document-rotation="0"
     inkscape:current-layer="Camada_x0020_1"
     inkscape:window-maximized="1"
     inkscape:window-y="24"
     inkscape:window-x="0"
     inkscape:cy="68.646095"
     inkscape:cx="256"
     inkscape:zoom="3.5917969"
     fit-margin-bottom="0"
     fit-margin-right="0"
     fit-margin-left="0"
     fit-margin-top="0"
     showgrid="false"
     id="namedview27"
     inkscape:window-height="1033"
     inkscape:window-width="1920"
     inkscape:pageshadow="2"
     inkscape:pageopacity="0"
     guidetolerance="10"
     gridtolerance="10"
     objecttolerance="10"
     borderopacity="1"
     bordercolor="#666666"
     pagecolor="#ffffff" />
  <defs
     id="defs4">
    <style
       id="style2989"
       type="text/css" />
  </defs>
  <metadata
     id="metadata7">
    <rdf:RDF>
      <cc:Work
         rdf:about="">
        <dc:format>image/svg+xml</dc:format>
        <dc:type
           rdf:resource="http://purl.org/dc/dcmitype/StillImage" />
        <dc:title></dc:title>
      </cc:Work>
    </rdf:RDF>
  </metadata>
  <g
     id="layer1"
     transform="translate(-168.50826,-201.60573)">
    <g
       style="fill-rule:evenodd"
       id="g3032"
       transform="matrix(3.543307,0,0,3.543307,9.5040098,-33.64549)">
      <g
         id="Camada_x0020_1">
        <metadata
           id="CorelCorpID_0Corel-Layer" />
        <g
           transform="matrix(1.0473883,0,0,1.0473883,10.682535,-59.584542)"
           id="g34">
          <path
             d="m 39.6582,142.084 c 0.5945,-6.3814 10.1783,-7.2633 9.7014,0 v 13.7584 c 0,0 0.0882,0.882 0.7938,0.882 l 5.3799,0.0882 c 0,0 0.9701,-0.2647 0.9701,-0.9702 0,-0.7055 -0.1764,-16.1396 -0.1764,-16.1396 -0.2897,-8.602 -10.9025,-11.3654 -16.4924,-5.9091 l -0.7937,-2.4694 h -6.35 v 24.6945 c 0,0 -0.441,0.7056 1.4111,0.7056 h 4.5861 c 0,0 0.7857,-0.1163 0.9701,-0.6174 z"
             id="path3013"
             style="fill:#e05206;stroke:none"
             inkscape:connector-curvature="0" />
          <path
             d="m 70.1736,131.06 c -8.0772,0.7498 -12.1866,6.715 -10.9206,15.6841 0.1213,0.8598 0.2922,1.7473 0.5136,2.6604 3.057,10.6502 21.6074,10.3856 22.4897,-0.1764 l -6.7028,-0.0882 c -1.6225,3.1383 -8.9722,3.1383 -9.0841,-2.9104 l 16.6688,0.0882 c 0.6803,-9.4979 -3.847,-15.6128 -12.9646,-15.2577 z m -3.5278,10.407 c -0.253,-5.7638 8.8016,-6.1165 8.9077,0 z"
             id="path3015"
             style="fill:#e05206;stroke:none"
             inkscape:connector-curvature="0" />
          <path
             style="fill:#e05206;stroke:none"
             d="M 98.2195,143.319 89.3118,131.413 H 83.932 l 0.1764,4.85 5.909,8.026 -5.909,7.673 v 4.675 l 5.2916,0.088 8.8195,-11.73 z"
             id="polygon3017"
             inkscape:connector-curvature="0" />
          <path
             style="fill:#e05206;stroke:none"
             d="m 107.392,144.201 5.909,-8.026 0.176,-4.85 h -5.38 l -8.9955,11.906 0.0881,1.676 8.8194,11.73 5.292,-0.089 v -4.674 z"
             id="polygon3019"
             inkscape:connector-curvature="0" />
          <path
             d="m 114.8,131.413 v 5.8208 h 3.2632 l 0.0882,13.141 c 0.6059,3.9485 3.1048,6.1828 5.909,6.4383 l 6.8792,0.0882 v -6.0855 h -4.1451 c -1.0258,0.1394 -1.4962,-0.4486 -1.4111,-1.7639 v -11.9063 h 5.7326 v -5.7326 h -5.8208 v -6.35 h -7.232 v 6.35 z"
             id="path3021"
             style="fill:#e05206;stroke:none"
             inkscape:connector-curvature="0" />
          <path
             d="m 143.331,131.016 c -8.0772,0.7498 -12.1866,6.715 -10.9206,15.6841 0.1213,0.8598 0.2922,1.7473 0.5136,2.6604 3.057,10.6502 21.6074,10.3856 22.4897,-0.1764 l -6.7028,-0.0882 c -1.6225,3.1383 -8.9722,3.1383 -9.0841,-2.9104 l 16.6688,0.0882 c 0.6803,-9.4979 -3.847,-15.6128 -12.9646,-15.2577 z m -3.5251,10.3862 c -0.253,-5.7638 8.8016,-6.1165 8.9077,0 z"
             id="path3023"
             style="fill:#e05206;stroke:none"
             inkscape:connector-curvature="0" />
          <path
             d="m 158.787,120.322 0.1323,29.104 c 0.0102,4.2079 2.4209,6.6774 5.6004,7.4084 h 6.0854 v -5.9091 h -3.0868 c -0.8992,-0.1651 -1.4284,-0.7237 -1.5875,-1.6757 l 0.044,-28.9717 z"
             id="path3025"
             style="fill:#e05206;stroke:none"
             inkscape:connector-curvature="0" />
        </g>
      </g>
    </g>
  </g>
</svg>
