<?xml version="1.0" encoding="UTF-8" standalone="no"?>
<svg
   xmlns:dc="http://purl.org/dc/elements/1.1/"
   xmlns:cc="http://creativecommons.org/ns#"
   xmlns:rdf="http://www.w3.org/1999/02/22-rdf-syntax-ns#"
   xmlns:svg="http://www.w3.org/2000/svg"
   xmlns="http://www.w3.org/2000/svg"
   xmlns:sodipodi="http://sodipodi.sourceforge.net/DTD/sodipodi-0.dtd"
   xmlns:inkscape="http://www.inkscape.org/namespaces/inkscape"
   width="1091.5652"
   height="512"
   viewBox="0 0 84.162293 39.476429"
   version="1.1"
   id="svg28"
   sodipodi:docname="samba.svg"
   inkscape:version="0.92.4 (unknown)">
  <metadata
     id="metadata34">
    <rdf:RDF>
      <cc:Work
         rdf:about="">
        <dc:format>image/svg+xml</dc:format>
        <dc:type
           rdf:resource="http://purl.org/dc/dcmitype/StillImage" />
        <dc:title></dc:title>
      </cc:Work>
    </rdf:RDF>
  </metadata>
  <defs
     id="defs32" />
  <sodipodi:namedview
     pagecolor="#ffffff"
     bordercolor="#666666"
     borderopacity="1"
     objecttolerance="10"
     gridtolerance="10"
     guidetolerance="10"
     inkscape:pageopacity="0"
     inkscape:pageshadow="2"
     inkscape:window-width="1600"
     inkscape:window-height="851"
     id="namedview30"
     showgrid="false"
     inkscape:showpageshadow="false"
     fit-margin-top="0"
     fit-margin-left="0"
     fit-margin-right="0"
     fit-margin-bottom="0"
     inkscape:zoom="1.2597656"
     inkscape:cx="545.78259"
     inkscape:cy="256"
     inkscape:window-x="0"
     inkscape:window-y="24"
     inkscape:window-maximized="1"
     inkscape:current-layer="svg28" />
  <g
     id="g48"
     transform="matrix(0.44985332,0,0,0.44985332,-1.2751961,-23.617299)">
    <path
       id="path4"
       d="m 30.105,94.087 -1.8,-1.135 A 9.675,9.675 0 0 0 25.577,91.78 c -1.004,-0.264 -2.104,-0.396 -3.304,-0.396 a 6.36,6.36 0 0 0 -1.646,0.202 h 0.008 a 3.146,3.146 0 0 0 -0.279,0.088 l 0.015,0.012 c 0.313,0.25 0.791,0.535 1.43,0.859 a 134.53,134.53 0 0 1 2.613,1.32 c 0.668,0.351 1.132,0.613 1.394,0.79 0.813,0.525 1.442,1.078 1.894,1.654 0.513,0.652 0.806,1.34 0.888,2.053 v 0.008 c 0.133,1.213 -0.225,2.289 -1.078,3.24 -0.756,0.842 -1.911,1.568 -3.466,2.188 l 0.004,-0.004 c -1.312,0.523 -2.762,0.918 -4.345,1.178 -1.575,0.26 -3.271,0.391 -5.087,0.391 -2.524,0 -4.8,-0.207 -6.828,-0.621 -1.333,-0.275 -2.356,-0.572 -3.064,-0.893 -0.985,-0.445 -1.522,-1.018 -1.609,-1.725 l 0.007,0.059 a 1.402,1.402 0 0 1 -0.007,-0.508 v -0.004 c 0.02,-0.117 0.051,-0.219 0.091,-0.322 l 1.24,-3.84 0.444,-1.375 1.154,0.861 c 0.922,0.686 1.856,1.197 2.796,1.537 a 8.2,8.2 0 0 0 2.812,0.502 c 0.258,0 0.402,0.186 0.396,0.111 l 0.008,0.033 a 1.476,1.476 0 0 0 -0.31,-0.713 c -0.223,-0.297 -0.557,-0.596 -1.007,-0.898 l 0.016,0.012 C 10.467,97.393 10.052,97.122 9.509,96.763 9.114,96.501 8.536,96.115 7.738,95.58 L 7.718,95.572 C 7.006,95.073 6.461,94.517 6.085,93.892 A 4.083,4.083 0 0 1 5.488,91.74 c 0,-1.339 0.532,-2.495 1.599,-3.464 0.954,-0.867 2.347,-1.568 4.18,-2.1 a 25.422,25.422 0 0 1 3.94,-0.796 36.211,36.211 0 0 1 4.479,-0.262 c 1.696,0 3.307,0.121 4.828,0.364 1.516,0.243 2.925,0.607 4.226,1.096 l 0.596,0.225 0.067,0.637 0.477,4.534 z M 27.628,90.29 27.419,88.3 a 20.131,20.131 0 0 0 -3.226,-0.779 c -1.386,-0.222 -2.888,-0.332 -4.504,-0.332 -1.502,0 -2.914,0.083 -4.229,0.246 a 23.315,23.315 0 0 0 -3.617,0.724 C 10.322,88.6 9.201,89.15 8.48,89.805 c -0.614,0.558 -0.919,1.204 -0.919,1.936 0,0.395 0.099,0.755 0.297,1.084 0.22,0.365 0.57,0.712 1.051,1.049 l -0.02,-0.008 a 269.216,269.216 0 0 0 2.986,1.976 l 0.016,0.012 c 0.644,0.434 1.145,0.891 1.509,1.375 0.407,0.541 0.643,1.109 0.714,1.707 l 0.008,0.033 c 0.126,1.426 -0.697,2.139 -2.467,2.139 -1.179,0 -2.351,-0.207 -3.508,-0.625 A 12.041,12.041 0 0 1 5.993,99.448 l -0.797,2.467 c 0.051,0.002 0.172,-0.043 0.38,0.051 0.579,0.262 1.456,0.512 2.627,0.754 1.869,0.381 4.008,0.572 6.415,0.572 1.726,0 3.311,-0.119 4.755,-0.357 1.432,-0.234 2.735,-0.588 3.908,-1.057 l 0.004,-0.004 c 1.248,-0.496 2.141,-1.043 2.683,-1.646 0.444,-0.494 0.633,-1.039 0.568,-1.637 v 0.008 c -0.038,-0.328 -0.19,-0.666 -0.46,-1.01 -0.315,-0.4 -0.779,-0.801 -1.397,-1.199 l -0.024,-0.018 c -0.178,-0.121 -0.576,-0.344 -1.194,-0.668 -0.693,-0.363 -1.55,-0.797 -2.577,-1.306 l -0.008,-0.004 c -0.771,-0.391 -1.367,-0.751 -1.789,-1.088 -0.589,-0.469 -0.916,-0.959 -0.98,-1.479 v -0.004 c -0.072,-0.602 0.13,-1.118 0.602,-1.543 h -0.004 c 0.327,-0.296 0.792,-0.527 1.392,-0.691 h 0.008 a 8.416,8.416 0 0 1 2.172,-0.274 c 1.365,0 2.641,0.156 3.83,0.469 0.523,0.136 1.032,0.306 1.521,0.506 z m 24.921,2.653 c -0.318,0.833 -0.68,1.62 -1.08,2.36 -0.41,0.759 -0.859,1.466 -1.34,2.119 l -0.008,0.016 c -0.698,0.92 -1.424,1.623 -2.179,2.107 -0.817,0.523 -1.659,0.787 -2.523,0.787 -1.645,0 -2.467,-1.002 -2.467,-3.004 0,-1.234 0.374,-2.623 1.123,-4.121 v 0.004 c 0.595,-1.203 1.333,-2.113 2.216,-2.732 v -0.004 c 0.918,-0.644 1.971,-0.964 3.165,-0.964 h 4.407 l -0.537,1.403 z m -1.933,-0.735 0.239,-0.625 h -1.399 c -0.754,0 -1.412,0.197 -1.976,0.592 V 92.17 c -0.598,0.419 -1.114,1.071 -1.552,1.956 v 0.004 c -0.603,1.206 -0.905,2.284 -0.905,3.198 0,0.621 0.132,0.932 0.396,0.932 0.465,0 0.934,-0.152 1.407,-0.455 0.54,-0.346 1.088,-0.887 1.645,-1.621 L 48.463,96.2 c 0.426,-0.576 0.823,-1.202 1.187,-1.875 0.352,-0.656 0.677,-1.362 0.966,-2.117 z m -4.462,-4.98 c -1.75,0 -3.383,0.202 -4.904,0.6 A 16.364,16.364 0 0 0 37,89.604 L 37.008,89.6 c -1.51,0.918 -2.639,1.988 -3.382,3.207 -0.726,1.19 -1.091,2.546 -1.091,4.064 a 8.032,8.032 0 0 0 0.067,1.004 l 0.004,0.043 c 0.094,0.906 0.342,1.697 0.746,2.367 0.394,0.654 0.946,1.209 1.66,1.656 v -0.004 a 7.732,7.732 0 0 0 2.213,0.932 c 0.847,0.215 1.793,0.322 2.844,0.322 1.898,0 3.596,-0.367 5.09,-1.1 1.491,-0.73 2.795,-1.83 3.907,-3.299 l 1.812,0.926 -0.997,3.215 h 9.59 l 4.787,-15.311 a 212.04,212.04 0 0 0 -7.02,-0.275 460.686,460.686 0 0 0 -11.084,-0.119 z m 0,-2.071 c 4.172,0 7.885,0.04 11.134,0.119 3.293,0.081 6.102,0.2 8.42,0.358 l 1.311,0.089 -0.392,1.253 -5.408,17.298 -0.228,0.729 H 47.079 l 0.415,-1.338 0.211,-0.684 a 12.2,12.2 0 0 1 -1.639,0.971 c -1.78,0.873 -3.78,1.311 -5.996,1.311 -1.216,0 -2.328,-0.131 -3.345,-0.389 a 9.715,9.715 0 0 1 -2.812,-1.182 v -0.004 c -0.991,-0.623 -1.767,-1.406 -2.332,-2.344 -0.561,-0.934 -0.903,-2.008 -1.029,-3.217 l 0.004,0.045 a 8.156,8.156 0 0 1 -0.075,-0.67 10.251,10.251 0 0 1 -0.017,-0.633 c 0,-1.9 0.468,-3.614 1.398,-5.14 0.917,-1.504 2.276,-2.804 4.07,-3.895 L 35.94,87.83 a 18.455,18.455 0 0 1 4.792,-2.002 21.404,21.404 0 0 1 5.422,-0.671 z m 129.293,7.795 0.004,-0.008 a 20.373,20.373 0 0 1 -1.088,2.388 16.305,16.305 0 0 1 -1.34,2.102 v 0.004 c -0.697,0.918 -1.424,1.621 -2.176,2.105 -0.814,0.525 -1.65,0.789 -2.508,0.789 -1.668,0 -2.486,-1.002 -2.486,-3.004 0,-1.234 0.375,-2.623 1.123,-4.121 v 0.004 c 0.598,-1.207 1.334,-2.118 2.217,-2.736 v 0.004 c 0.92,-0.646 1.973,-0.968 3.164,-0.968 h 4.439 l -0.555,1.412 z m -1.929,-0.744 0.004,-0.008 0.242,-0.617 h -1.406 c -0.76,0 -1.416,0.196 -1.977,0.588 v 0.004 c -0.6,0.421 -1.115,1.071 -1.551,1.952 v 0.004 c -0.604,1.206 -0.906,2.284 -0.906,3.198 0,0.621 0.137,0.932 0.416,0.932 0.455,0 0.92,-0.152 1.393,-0.457 0.535,-0.344 1.084,-0.885 1.641,-1.619 v 0.004 c 0.426,-0.566 0.816,-1.177 1.17,-1.834 0.354,-0.664 0.681,-1.38 0.974,-2.147 z m -4.461,-4.98 c -1.744,0 -3.371,0.2 -4.885,0.596 -1.52,0.397 -2.936,0.992 -4.25,1.78 h 0.004 c -1.514,0.916 -2.639,1.981 -3.379,3.193 -0.727,1.192 -1.09,2.551 -1.09,4.074 0,0.363 0.018,0.707 0.051,1.051 v -0.004 c 0.094,0.9 0.344,1.689 0.752,2.363 0.398,0.658 0.953,1.211 1.67,1.656 l 0.01,0.004 c 0.645,0.41 1.381,0.721 2.205,0.93 0.846,0.213 1.789,0.32 2.828,0.32 1.896,0 3.594,-0.367 5.09,-1.098 1.496,-0.732 2.807,-1.834 3.93,-3.305 l 1.809,0.934 -1.01,3.211 h 9.584 l 4.787,-15.311 a 212.219,212.219 0 0 0 -7.021,-0.275 460.894,460.894 0 0 0 -11.085,-0.119 z m 0,-2.071 c 4.172,0 7.885,0.04 11.133,0.119 3.295,0.081 6.102,0.2 8.422,0.358 l 1.311,0.089 -0.393,1.253 -5.408,17.298 -0.229,0.729 h -13.92 l 0.424,-1.342 0.211,-0.676 c -0.523,0.367 -1.068,0.689 -1.639,0.969 -1.783,0.871 -3.781,1.309 -5.996,1.309 -1.203,0 -2.314,-0.131 -3.33,-0.387 a 9.56,9.56 0 0 1 -2.812,-1.188 l 0.008,0.004 c -1.004,-0.623 -1.785,-1.404 -2.35,-2.336 -0.566,-0.932 -0.908,-2.01 -1.035,-3.229 v -0.004 a 12.57,12.57 0 0 1 -0.066,-1.254 c 0,-1.903 0.465,-3.621 1.396,-5.15 0.916,-1.502 2.273,-2.8 4.076,-3.889 h 0.004 a 18.188,18.188 0 0 1 4.791,-2.007 21.4,21.4 0 0 1 5.402,-0.666 z M 142.979,72.3 l -6.922,-15.554 -13.344,15.903 3.338,-0.059 1.396,-0.024 -0.385,1.343 -8.33,29.024 h 9.969 l 0.381,-0.988 0.566,-1.467 1.119,1.104 c 0.57,0.561 1.367,0.986 2.391,1.279 1.096,0.314 2.438,0.469 4.023,0.469 1.738,0 3.363,-0.205 4.877,-0.621 a 15.118,15.118 0 0 0 4.189,-1.857 v -0.004 c 2.863,-1.824 4.295,-4.277 4.295,-7.357 0,-0.365 -0.018,-0.728 -0.053,-1.072 v 0.004 c -0.172,-1.694 -0.975,-2.964 -2.408,-3.809 -1.566,-0.923 -3.887,-1.386 -6.963,-1.386 -1.656,0 -3.662,0.288 -6.02,0.863 l -1.666,0.406 0.42,-1.661 3.42,-13.541 0.189,-0.751 0.77,-0.034 z m 2.503,0.547 0.617,1.389 -1.516,0.067 -5.494,0.244 -2.82,11.166 c 1.836,-0.371 3.453,-0.556 4.85,-0.556 3.441,0 6.111,0.56 8.008,1.677 2.035,1.199 3.176,2.993 3.42,5.377 v 0.004 c 0.045,0.451 0.066,0.883 0.066,1.274 0,3.84 -1.75,6.875 -5.248,9.105 v -0.004 a 17.278,17.278 0 0 1 -4.764,2.115 c -1.691,0.465 -3.498,0.695 -5.42,0.695 -1.773,0 -3.305,-0.184 -4.59,-0.551 a 8.584,8.584 0 0 1 -2.078,-0.879 l -0.143,0.369 -0.256,0.662 h -14.131 l 0.379,-1.318 8.324,-28.999 -4.211,0.075 -2.27,0.04 1.461,-1.739 15.867,-18.909 1.062,-1.268 0.672,1.51 z m -5.662,22.36 v 0.004 c -0.715,1.875 -1.543,3.297 -2.482,4.268 -1.049,1.088 -2.229,1.629 -3.535,1.629 -0.863,0 -1.602,-0.123 -2.238,-0.367 l -0.117,-0.057 a 13.844,13.844 0 0 0 -0.42,-0.209 c -0.146,-0.07 -0.293,-0.141 -0.494,-0.248 l -0.793,-0.422 0.307,-0.84 0.459,-1.254 -0.006,0.004 c 0.514,-1.423 1.018,-2.613 1.516,-3.571 0.529,-1.016 1.059,-1.788 1.592,-2.321 l -0.008,0.012 a 4.626,4.626 0 0 1 1.801,-1.14 c 0.664,-0.235 1.41,-0.349 2.24,-0.349 h 4.021 l -0.529,1.4 z m -1.933,-0.733 v 0.004 l 0.781,-2.061 h -1.027 c -0.604,0 -1.119,0.075 -1.553,0.229 -0.4,0.141 -0.736,0.349 -1.008,0.63 l -0.01,0.012 c -0.383,0.384 -0.789,0.987 -1.217,1.811 -0.455,0.875 -0.922,1.978 -1.402,3.313 l -0.004,0.004 -0.143,0.387 0.031,0.018 c 0.393,0.145 0.875,0.215 1.467,0.215 0.727,0 1.41,-0.328 2.047,-0.988 0.743,-0.769 1.422,-1.958 2.038,-3.574 z"
       inkscape:connector-curvature="0"
       style="fill:#ce3729" />
    <path
       id="path6"
       d="m 114.979,90.911 c -0.125,-1.221 -0.643,-2.13 -1.553,-2.728 -1.008,-0.663 -2.508,-0.994 -4.498,-0.994 -2.727,0 -5.088,0.13 -7.084,0.396 -1.963,0.261 -3.588,0.652 -4.875,1.178 l -0.524,0.214 -0.467,-0.335 c -0.655,-0.47 -1.541,-0.825 -2.656,-1.069 -1.175,-0.257 -2.589,-0.383 -4.238,-0.383 -5.413,0 -11.339,0.148 -17.762,0.443 l -4.791,15.302 h 9.93 l 0.401,-1.059 c 1.029,-2.732 2.003,-4.943 2.926,-6.631 0.972,-1.777 1.908,-3.003 2.81,-3.677 h 0.004 a 5.983,5.983 0 0 1 1.964,-0.94 8.71,8.71 0 0 1 2.349,-0.3 h 1.549 l -0.595,1.432 a 37.88,37.88 0 0 0 -0.649,1.664 25.305,25.305 0 0 0 -0.487,1.472 l -0.004,0.02 -2.536,8.019 h 10.083 l 0.401,-1.059 0.004,-0.016 a 311.831,311.831 0 0 1 1.621,-4.012 c 0.453,-1.092 0.802,-1.899 1.052,-2.417 l 0.004,-0.004 c 0.447,-0.927 0.889,-1.698 1.324,-2.314 0.473,-0.667 0.959,-1.182 1.461,-1.55 l -0.004,0.004 a 5.945,5.945 0 0 1 1.932,-0.936 c 0.705,-0.201 1.49,-0.304 2.361,-0.304 h 1.527 l -0.568,1.419 a 65.75,65.75 0 0 0 -0.672,1.745 c -0.188,0.517 -0.346,0.984 -0.469,1.403 l -0.004,0.02 -8.093,25.331 -0.235,0.738 -0.768,-0.014 -4.544,-0.072 6.875,15.465 12.568,-15.199 -2.727,-0.033 -1.398,-0.018 0.428,-1.334 8.172,-25.511 v -0.004 c 0.211,-0.641 0.352,-1.24 0.426,-1.8 a 6.604,6.604 0 0 0 0.029,-1.552 z m 2.054,-0.21 a 8.686,8.686 0 0 1 -0.035,2.031 c -0.092,0.698 -0.26,1.421 -0.506,2.172 V 94.9 l -7.746,24.177 3.494,0.043 2.164,0.025 -1.379,1.67 -15.012,18.152 -1.065,1.287 -0.679,-1.529 -8.212,-18.471 -0.657,-1.479 1.62,0.025 5.396,0.086 7.857,-24.595 -0.004,0.02 c 0.135,-0.455 0.307,-0.963 0.51,-1.524 l 0.082,-0.225 c -0.076,0.018 -0.15,0.037 -0.223,0.058 a 3.927,3.927 0 0 0 -1.268,0.604 l -0.004,0.004 c -0.314,0.229 -0.643,0.588 -0.992,1.08 -0.383,0.541 -0.768,1.212 -1.154,2.015 l 0.004,-0.004 c -0.248,0.517 -0.584,1.29 -1.012,2.319 -0.41,0.99 -0.947,2.324 -1.605,3.979 l 0.004,-0.016 -0.656,1.73 -0.255,0.67 H 81.367 l 0.426,-1.346 2.962,-9.366 -0.004,0.02 a 27.987,27.987 0 0 1 0.585,-1.751 7,7 0 0 0 -0.219,0.056 3.913,3.913 0 0 0 -1.285,0.608 h 0.004 c -0.668,0.5 -1.413,1.501 -2.235,3.005 -0.872,1.594 -1.806,3.717 -2.805,6.373 L 78.14,104.33 77.885,105 H 63.716 l 0.42,-1.342 5.428,-17.339 0.217,-0.694 0.722,-0.035 c 6.7,-0.318 12.901,-0.477 18.58,-0.477 1.791,0 3.351,0.142 4.675,0.432 1.147,0.251 2.128,0.616 2.939,1.1 1.345,-0.489 2.972,-0.858 4.878,-1.112 2.119,-0.282 4.57,-0.42 7.352,-0.42 2.406,0 4.287,0.445 5.639,1.334 1.452,0.958 2.276,2.374 2.467,4.254 z"
       inkscape:connector-curvature="0"
       style="fill:#ce3729" />
    <path
       id="path8"
       d="m 28.179,90.925 c -1.829,-1.153 -4.017,-1.73 -6.562,-1.73 -0.676,0 -1.332,0.1 -1.929,0.259 -0.875,0.239 -1.292,0.597 -1.233,1.113 0.06,0.478 0.795,1.054 2.207,1.75 2.167,1.094 3.46,1.77 3.917,2.048 1.432,0.955 2.207,1.928 2.307,2.983 0.198,1.789 -1.094,3.24 -3.897,4.355 -2.485,0.994 -5.508,1.471 -9.047,1.471 -2.446,0 -4.672,-0.199 -6.622,-0.598 -2.505,-0.496 -3.777,-1.072 -3.857,-1.729 -0.02,-0.1 0,-0.199 0.04,-0.299 l 1.253,-3.857 c 2.028,1.492 4.116,2.246 6.224,2.246 1.034,0 1.511,-0.338 1.432,-1.014 -0.1,-0.834 -0.676,-1.631 -1.75,-2.366 C 10.085,95.219 9.091,94.543 7.66,93.588 6.447,92.753 5.85,91.759 5.85,90.606 c 0,-2.088 1.67,-3.599 5.031,-4.593 2.326,-0.675 5.05,-1.013 8.132,-1.013 3.3,0 6.203,0.478 8.689,1.392 z"
       inkscape:connector-curvature="0"
       style="clip-rule:evenodd;fill-rule:evenodd" />
    <path
       id="path10"
       d="m 28.929,92.13 -1.08,-0.681 c -1.727,-1.088 -3.804,-1.633 -6.231,-1.633 a 6.643,6.643 0 0 0 -1.771,0.237 h 0.004 c -0.344,0.094 -0.584,0.198 -0.716,0.316 -0.046,0.041 -0.067,0.083 -0.062,0.127 v -0.005 c 0.008,0.068 0.13,0.194 0.366,0.38 0.339,0.268 0.838,0.563 1.499,0.889 l 0.005,0.002 c 1.134,0.572 2.001,1.015 2.607,1.332 0.654,0.342 1.104,0.588 1.354,0.74 l 0.022,0.013 c 0.767,0.511 1.366,1.038 1.796,1.59 0.459,0.589 0.721,1.204 0.782,1.851 v -0.01 c 0.12,1.08 -0.205,2.051 -0.976,2.914 -0.713,0.797 -1.815,1.492 -3.31,2.086 l 0.002,-0.002 c -1.285,0.514 -2.706,0.895 -4.262,1.145 -1.549,0.25 -3.221,0.373 -5.016,0.373 -2.48,0 -4.749,-0.203 -6.745,-0.611 l 0.005,0.002 C 5.906,102.929 4.917,102.646 4.229,102.337 3.393,101.96 2.936,101.501 2.852,100.958 a 1.109,1.109 0 0 1 0.062,-0.607 L 4.167,96.5 4.432,95.683 5.123,96.191 c 0.965,0.709 1.942,1.244 2.926,1.598 0.971,0.352 1.95,0.527 2.931,0.527 0.568,0 0.84,-0.107 0.815,-0.322 v 0.002 C 11.758,97.684 11.627,97.373 11.399,97.066 11.15,96.73 10.789,96.398 10.314,96.072 9.829,95.783 9.097,95.295 8.095,94.625 L 7.314,94.104 7.307,94.099 C 6.626,93.63 6.114,93.11 5.768,92.538 a 3.67,3.67 0 0 1 -0.54,-1.931 c 0,-1.226 0.485,-2.279 1.459,-3.166 0.907,-0.827 2.246,-1.498 4.018,-2.022 h 0.002 a 24.956,24.956 0 0 1 3.875,-0.782 35.786,35.786 0 0 1 4.43,-0.259 c 1.665,0 3.24,0.121 4.722,0.358 1.503,0.241 2.897,0.6 4.181,1.072 l 0.362,0.133 0.041,0.386 0.478,4.533 z m -1.491,-2.324 -0.312,-2.961 a 21.346,21.346 0 0 0 -3.586,-0.884 28.583,28.583 0 0 0 -4.527,-0.34 c -1.519,0 -2.947,0.083 -4.279,0.25 -1.33,0.166 -2.559,0.412 -3.682,0.738 h 0.002 c -1.588,0.47 -2.765,1.052 -3.533,1.751 -0.702,0.639 -1.051,1.387 -1.051,2.248 0,0.462 0.119,0.892 0.36,1.29 0.255,0.422 0.646,0.815 1.177,1.181 l 0.776,0.518 c 1.013,0.677 1.745,1.167 2.19,1.428 l 0.037,0.022 c 0.591,0.405 1.051,0.833 1.383,1.282 0.361,0.488 0.571,0.996 0.633,1.523 v 0.002 c 0.134,1.137 -0.549,1.705 -2.048,1.705 a 9.767,9.767 0 0 1 -3.349,-0.6 12.293,12.293 0 0 1 -2.543,-1.283 l -0.995,3.064 -0.013,0.035 c 0.013,0.096 0.23,0.24 0.654,0.432 0.596,0.268 1.496,0.521 2.705,0.762 l 0.005,0.002 c 1.901,0.387 4.086,0.582 6.498,0.582 1.745,0 3.354,-0.117 4.822,-0.354 1.461,-0.236 2.794,-0.592 3.995,-1.072 l 0.002,-0.002 c 1.309,-0.52 2.254,-1.107 2.839,-1.762 0.526,-0.588 0.749,-1.238 0.67,-1.947 v -0.01 C 26.232,97 26.056,96.6 25.746,96.2 25.405,95.762 24.9,95.325 24.236,94.882 l 0.021,0.012 a 28.528,28.528 0 0 0 -1.281,-0.697 c -0.695,-0.363 -1.557,-0.804 -2.587,-1.325 l -0.005,-0.002 0.005,0.002 -0.005,-0.002 c -0.749,-0.369 -1.321,-0.709 -1.718,-1.022 -0.5,-0.395 -0.775,-0.795 -0.827,-1.206 v -0.005 c -0.054,-0.473 0.104,-0.868 0.47,-1.195 0.281,-0.25 0.687,-0.444 1.217,-0.588 h 0.004 a 8.44,8.44 0 0 1 1.043,-0.208 7.987,7.987 0 0 1 1.044,-0.072 c 2.187,0 4.128,0.41 5.821,1.232 z"
       inkscape:connector-curvature="0"
       style="fill:#fff22d" />
    <path
       id="path12"
       d="m 50.907,91.422 c -0.617,1.63 -1.372,3.042 -2.287,4.235 -1.252,1.671 -2.545,2.505 -3.857,2.505 -0.975,0 -1.452,-0.656 -1.452,-1.988 0,-1.073 0.338,-2.286 1.014,-3.638 1.034,-2.088 2.506,-3.122 4.454,-3.122 h 2.923 z m -5.429,-6.363 c -3.658,0 -6.88,0.835 -9.663,2.525 -3.321,2.008 -4.971,4.713 -4.971,8.133 0,0.378 0.02,0.775 0.06,1.173 0.219,2.107 1.173,3.697 2.903,4.771 1.472,0.955 3.341,1.412 5.587,1.412 4.116,0 7.397,-1.592 9.843,-4.793 l -1.432,4.535 h 11.751 l 5.408,-17.3 C 60.292,85.218 53.79,85.059 45.478,85.059 Z"
       inkscape:connector-curvature="0"
       style="clip-rule:evenodd;fill:#3a3e93;fill-rule:evenodd" />
    <path
       id="path14"
       d="m 51.484,91.65 0.003,-0.009 a 19.426,19.426 0 0 1 -1.066,2.357 15.254,15.254 0 0 1 -1.308,2.036 l 0.002,-0.004 c -0.67,0.893 -1.358,1.568 -2.062,2.025 -0.749,0.486 -1.514,0.73 -2.291,0.73 -0.699,0 -1.229,-0.25 -1.594,-0.75 -0.321,-0.439 -0.479,-1.059 -0.479,-1.861 0,-1.17 0.36,-2.476 1.08,-3.915 v 0.002 c 0.564,-1.139 1.257,-1.997 2.083,-2.577 v -0.002 c 0.847,-0.594 1.821,-0.89 2.927,-0.89 h 3.837 l -0.336,0.85 z m -1.157,-0.446 0.002,-0.01 0.459,-1.159 h -2.009 c -0.842,0 -1.579,0.222 -2.213,0.667 V 90.7 c -0.655,0.459 -1.215,1.162 -1.685,2.111 v 0.002 c -0.632,1.265 -0.949,2.386 -0.949,3.362 0,0.531 0.08,0.906 0.242,1.127 0.117,0.16 0.312,0.24 0.589,0.24 0.537,0 1.076,-0.176 1.616,-0.525 0.583,-0.379 1.165,-0.955 1.746,-1.73 l 0.003,-0.004 a 13.9,13.9 0 0 0 1.201,-1.871 c 0.368,-0.685 0.699,-1.42 0.998,-2.208 z m -4.849,-5.523 c -1.781,0 -3.45,0.202 -5.004,0.607 a 16.192,16.192 0 0 0 -4.336,1.828 h -0.002 c -1.575,0.952 -2.748,2.062 -3.522,3.328 -0.766,1.254 -1.147,2.678 -1.147,4.273 0,0.369 0.018,0.748 0.055,1.113 v -0.002 c 0.099,0.957 0.364,1.795 0.8,2.514 0.432,0.713 1.036,1.311 1.814,1.793 l 0.01,0.008 c 0.675,0.439 1.448,0.764 2.316,0.982 0.88,0.221 1.859,0.328 2.934,0.328 1.965,0 3.725,-0.377 5.279,-1.133 1.551,-0.754 2.908,-1.893 4.071,-3.414 l 1.085,0.562 -1.177,3.725 H 59.103 L 64.138,86.089 A 225.442,225.442 0 0 0 56.492,85.795 479.194,479.194 0 0 0 45.478,85.681 Z m 0,-1.243 a 474,474 0 0 1 11.04,0.115 c 3.31,0.078 6.139,0.193 8.485,0.342 l 0.789,0.051 -0.236,0.755 -5.408,17.299 -0.136,0.438 H 46.957 l 0.255,-0.809 0.607,-1.922 a 11.97,11.97 0 0 1 -2.609,1.73 c -1.727,0.84 -3.666,1.258 -5.817,1.258 -1.171,0 -2.251,-0.121 -3.235,-0.367 a 8.875,8.875 0 0 1 -2.689,-1.146 l 0.009,0.008 c -0.951,-0.59 -1.69,-1.324 -2.222,-2.203 -0.529,-0.871 -0.85,-1.883 -0.97,-3.033 v -0.002 c -0.042,-0.43 -0.064,-0.848 -0.064,-1.234 0,-1.825 0.443,-3.464 1.332,-4.919 0.881,-1.441 2.194,-2.689 3.94,-3.745 h -0.003 a 17.427,17.427 0 0 1 4.671,-1.965 c 1.668,-0.435 3.44,-0.651 5.316,-0.651 z"
       inkscape:connector-curvature="0"
       style="fill:#fff22d" />
    <path
       id="path16"
       d="m 173.809,91.422 c -0.617,1.63 -1.373,3.042 -2.268,4.235 -1.271,1.671 -2.564,2.505 -3.877,2.505 -0.975,0 -1.451,-0.656 -1.451,-1.988 0,-1.073 0.338,-2.286 1.014,-3.638 1.035,-2.088 2.525,-3.122 4.455,-3.122 h 2.922 z m -5.428,-6.363 c -3.658,0 -6.881,0.835 -9.664,2.525 -3.32,2.008 -4.971,4.713 -4.971,8.133 0,0.378 0.02,0.775 0.059,1.173 0.219,2.107 1.193,3.697 2.904,4.771 1.471,0.955 3.34,1.412 5.586,1.412 4.117,0 7.398,-1.592 9.844,-4.793 l -1.432,4.535 h 11.771 l 5.389,-17.3 c -4.674,-0.297 -11.176,-0.456 -19.486,-0.456 z"
       inkscape:connector-curvature="0"
       style="clip-rule:evenodd;fill:#3a3e93;fill-rule:evenodd" />
    <path
       id="path18"
       d="m 174.387,91.65 0.002,-0.009 c -0.637,1.684 -1.42,3.147 -2.352,4.389 l -0.002,0.004 c -1.398,1.834 -2.855,2.752 -4.371,2.752 -0.697,0 -1.229,-0.25 -1.594,-0.75 -0.32,-0.439 -0.479,-1.059 -0.479,-1.861 0,-1.17 0.359,-2.476 1.08,-3.915 v 0.002 c 0.564,-1.14 1.26,-1.998 2.086,-2.576 0.85,-0.596 1.826,-0.893 2.924,-0.893 h 3.836 l -0.336,0.85 z m -1.158,-0.446 0.002,-0.01 0.459,-1.159 h -2.008 c -0.836,0 -1.574,0.223 -2.211,0.669 -0.656,0.461 -1.221,1.162 -1.688,2.105 v 0.002 c -0.633,1.265 -0.949,2.386 -0.949,3.362 0,0.531 0.08,0.906 0.242,1.127 0.115,0.16 0.312,0.24 0.588,0.24 1.109,0 2.236,-0.754 3.385,-2.26 l -0.002,0.004 c 0.857,-1.142 1.586,-2.503 2.182,-4.08 z m -4.848,-5.523 c -1.783,0 -3.451,0.202 -5.006,0.607 a 16.206,16.206 0 0 0 -4.336,1.828 h -0.002 c -1.574,0.952 -2.748,2.062 -3.521,3.328 -0.766,1.254 -1.148,2.678 -1.148,4.273 0,0.369 0.018,0.748 0.055,1.113 v -0.002 c 0.1,0.957 0.367,1.795 0.803,2.51 0.434,0.715 1.039,1.314 1.814,1.801 l 0.006,0.004 c 0.676,0.439 1.449,0.764 2.316,0.982 0.881,0.221 1.859,0.328 2.934,0.328 1.965,0 3.725,-0.377 5.279,-1.133 1.551,-0.754 2.908,-1.893 4.072,-3.414 l 1.084,0.562 -1.176,3.725 h 10.467 l 5.018,-16.104 a 225.683,225.683 0 0 0 -7.648,-0.294 c -3.23,-0.075 -6.902,-0.114 -11.011,-0.114 z m 0,-1.243 c 4.129,0 7.811,0.039 11.039,0.115 3.309,0.078 6.139,0.193 8.484,0.342 l 0.789,0.051 -0.234,0.755 -5.389,17.299 -0.137,0.438 h -13.074 l 0.256,-0.809 0.605,-1.924 a 11.918,11.918 0 0 1 -2.607,1.732 c -1.727,0.84 -3.666,1.258 -5.818,1.258 -1.172,0 -2.25,-0.121 -3.234,-0.367 a 8.875,8.875 0 0 1 -2.689,-1.146 l 0.008,0.006 c -0.939,-0.59 -1.678,-1.324 -2.213,-2.205 -0.531,-0.873 -0.857,-1.883 -0.977,-3.029 v -0.002 c -0.043,-0.43 -0.064,-0.848 -0.064,-1.234 0,-1.825 0.443,-3.464 1.332,-4.919 0.881,-1.441 2.193,-2.689 3.939,-3.745 h -0.002 a 17.407,17.407 0 0 1 4.67,-1.965 c 1.665,-0.435 3.439,-0.651 5.316,-0.651 z"
       inkscape:connector-curvature="0"
       style="fill:#fff22d" />
    <path
       id="path20"
       d="m 143.863,72.115 -8.191,-18.452 -15.867,18.93 5.586,-0.1 -8.709,30.324 h 12.051 l 0.637,-1.631 c 1.391,1.371 3.777,2.047 7.156,2.047 3.641,0 6.842,-0.873 9.605,-2.645 3.182,-2.047 4.791,-4.792 4.791,-8.231 0,-0.377 -0.02,-0.775 -0.059,-1.173 -0.438,-4.076 -3.898,-6.125 -10.4,-6.125 -1.75,0 -3.838,0.298 -6.283,0.875 l 3.42,-13.541 z m -5.687,21.593 c -1.332,3.481 -3.002,5.229 -5.049,5.229 -0.736,0 -1.354,-0.098 -1.869,-0.318 -0.299,-0.139 -0.598,-0.297 -0.916,-0.436 l 0.457,-1.254 c 0.994,-2.764 1.949,-4.613 2.863,-5.527 0.777,-0.775 1.869,-1.173 3.322,-1.173 h 2.504 z"
       inkscape:connector-curvature="0"
       style="clip-rule:evenodd;fill-rule:evenodd" />
    <path
       id="path22"
       d="m 142.926,71.534 -7.418,-16.71 -14.354,17.123 4.227,-0.075 0.84,-0.015 -0.232,0.806 -8.482,29.531 h 10.803 l 0.482,-1.234 0.342,-0.877 0.67,0.662 c 0.619,0.609 1.477,1.07 2.568,1.383 1.137,0.324 2.521,0.484 4.154,0.484 1.766,0 3.422,-0.211 4.969,-0.637 a 15.603,15.603 0 0 0 4.301,-1.908 c 1.51,-0.971 2.643,-2.102 3.393,-3.389 0.74,-1.274 1.113,-2.714 1.113,-4.321 0,-0.37 -0.018,-0.747 -0.055,-1.112 v 0.005 c -0.197,-1.833 -1.072,-3.209 -2.625,-4.125 -1.635,-0.962 -4.02,-1.444 -7.158,-1.444 -0.852,0 -1.783,0.072 -2.795,0.214 a 37.353,37.353 0 0 0 -3.348,0.644 l -0.992,0.234 0.25,-0.989 3.42,-13.541 0.113,-0.45 0.463,-0.021 z m 1.506,0.331 0.369,0.831 -0.91,0.041 -5.803,0.257 -3.059,12.113 a 35.561,35.561 0 0 1 2.469,-0.44 21.577,21.577 0 0 1 2.965,-0.229 c 3.359,0 5.953,0.54 7.783,1.619 1.916,1.127 2.992,2.815 3.232,5.061 v 0.005 c 0.043,0.43 0.064,0.848 0.064,1.233 0,1.828 -0.43,3.475 -1.283,4.942 -0.852,1.461 -2.117,2.732 -3.795,3.811 a 16.763,16.763 0 0 1 -4.646,2.064 c -1.652,0.455 -3.418,0.682 -5.293,0.682 -1.746,0 -3.244,-0.178 -4.494,-0.535 -0.936,-0.268 -1.734,-0.637 -2.398,-1.107 l -0.322,0.828 -0.156,0.396 h -13.297 l 0.229,-0.791 8.477,-29.518 -4.748,0.084 -1.361,0.024 0.875,-1.044 15.867,-18.929 0.639,-0.763 0.404,0.911 z m -5.676,22.062 v 0.002 c -0.695,1.817 -1.49,3.194 -2.389,4.129 -0.963,1 -2.041,1.5 -3.24,1.5 -0.398,0 -0.77,-0.027 -1.119,-0.086 a 4.259,4.259 0 0 1 -0.99,-0.283 l -0.023,-0.008 c -0.16,-0.076 -0.266,-0.129 -0.371,-0.18 a 12.499,12.499 0 0 0 -0.527,-0.252 l -0.535,-0.232 0.199,-0.547 0.457,-1.252 -0.002,0.002 c 0.504,-1.402 1.004,-2.581 1.496,-3.532 0.508,-0.982 1.012,-1.726 1.514,-2.226 a 4.332,4.332 0 0 1 1.639,-1.023 c 0.619,-0.221 1.324,-0.332 2.121,-0.332 h 3.4 l -0.316,0.84 z m -1.16,-0.439 v 0.003 l 0.996,-2.64 h -1.607 c -0.656,0 -1.225,0.087 -1.709,0.259 -0.459,0.164 -0.85,0.408 -1.174,0.731 -0.414,0.414 -0.844,1.054 -1.289,1.915 -0.463,0.893 -0.938,2.021 -1.428,3.382 l -0.002,0.002 -0.264,0.723 0.053,0.027 0.336,0.164 c 0.209,0.086 0.443,0.15 0.703,0.195 0.271,0.045 0.576,0.066 0.916,0.066 0.848,0 1.629,-0.373 2.346,-1.117 0.781,-0.809 1.488,-2.048 2.123,-3.71 z"
       inkscape:connector-curvature="0"
       style="fill:#fff22d" />
    <path
       id="path24"
       d="m 115.35,89.672 c -0.338,-3.102 -2.703,-4.673 -7.098,-4.673 -5.508,0 -9.625,0.557 -12.329,1.67 C 94.353,85.556 91.847,85 88.407,85 82.76,85 76.596,85.159 69.875,85.478 l -5.428,17.339 h 12.049 l 0.656,-1.711 c 2.028,-5.388 3.818,-8.669 5.409,-9.842 0.895,-0.696 2.127,-1.034 3.678,-1.034 -0.517,1.292 -0.914,2.366 -1.173,3.221 l -2.963,9.366 h 12.209 l 0.676,-1.711 c 1.253,-3.201 2.128,-5.329 2.625,-6.363 0.836,-1.73 1.67,-2.883 2.467,-3.479 0.914,-0.696 2.127,-1.034 3.678,-1.034 -0.518,1.292 -0.914,2.366 -1.174,3.221 l -8.072,25.333 -6.184,-0.08 8.212,18.451 15.013,-18.133 -4.873,-0.061 8.174,-25.511 c 0.437,-1.392 0.595,-2.664 0.496,-3.778 z"
       inkscape:connector-curvature="0"
       style="clip-rule:evenodd;fill-rule:evenodd" />
    <path
       id="path26"
       d="m 114.729,89.726 0.006,0.012 c -0.148,-1.356 -0.734,-2.374 -1.76,-3.048 -1.078,-0.711 -2.654,-1.069 -4.723,-1.069 -5.43,0 -9.467,0.541 -12.093,1.622 l -0.315,0.13 -0.279,-0.198 c -1.461,-1.036 -3.847,-1.554 -7.157,-1.554 -5.506,0 -11.517,0.153 -18.07,0.457 l -5.045,16.116 h 10.779 l 0.502,-1.309 v 0.002 c 1.025,-2.723 1.991,-4.917 2.905,-6.582 0.943,-1.72 1.847,-2.9 2.717,-3.542 l -0.015,0.01 c 0.51,-0.396 1.114,-0.69 1.81,-0.885 0.672,-0.188 1.423,-0.28 2.25,-0.28 h 0.916 l -0.34,0.852 a 63.21,63.21 0 0 0 -0.676,1.755 c -0.187,0.51 -0.347,0.981 -0.478,1.415 l -0.002,0.007 -2.707,8.556 h 10.938 l 0.521,-1.316 v 0.004 c 0.615,-1.574 1.149,-2.91 1.6,-4.006 a 52.22,52.22 0 0 1 1.041,-2.399 l 0.002,-0.003 c 0.428,-0.885 0.859,-1.629 1.287,-2.234 0.453,-0.64 0.912,-1.13 1.365,-1.471 l -0.004,0.002 a 5.344,5.344 0 0 1 1.809,-0.882 c 0.67,-0.188 1.416,-0.28 2.246,-0.28 h 0.916 l -0.342,0.852 a 74.41,74.41 0 0 0 -0.676,1.755 c -0.186,0.51 -0.346,0.981 -0.477,1.415 l -0.004,0.007 -8.072,25.332 -0.141,0.441 -0.459,-0.006 -5.217,-0.068 7.411,16.654 13.547,-16.363 -3.572,-0.045 -0.84,-0.01 0.258,-0.801 8.172,-25.511 -0.004,0.005 c 0.209,-0.661 0.35,-1.287 0.428,-1.873 a 7.623,7.623 0 0 0 0.042,-1.666 z m 1.238,-0.119 0.004,0.012 a 8.816,8.816 0 0 1 -0.057,1.935 12.114,12.114 0 0 1 -0.469,2.082 l -0.002,0.005 -7.916,24.71 4.033,0.051 1.299,0.016 -0.828,1 -15.014,18.135 -0.637,0.77 -0.406,-0.912 -8.212,-18.453 -0.395,-0.887 0.967,0.014 5.725,0.072 7.932,-24.891 -0.002,0.008 c 0.127,-0.421 0.295,-0.915 0.502,-1.479 0.104,-0.284 0.215,-0.583 0.336,-0.895 a 6.09,6.09 0 0 0 -0.98,0.185 c -0.535,0.15 -0.998,0.375 -1.393,0.673 l -0.004,0.003 c -0.352,0.262 -0.719,0.662 -1.1,1.199 -0.387,0.546 -0.781,1.23 -1.18,2.055 l 0.002,-0.003 a 47.682,47.682 0 0 0 -1.016,2.338 236.78,236.78 0 0 0 -1.592,3.984 v 0.002 l -0.676,1.709 -0.155,0.395 H 81.256 l 0.256,-0.809 2.963,-9.366 -0.003,0.008 c 0.127,-0.421 0.296,-0.915 0.502,-1.479 0.104,-0.284 0.216,-0.583 0.337,-0.895 -0.355,0.038 -0.687,0.1 -0.991,0.185 a 3.959,3.959 0 0 0 -1.377,0.671 l -0.015,0.01 c -0.721,0.531 -1.507,1.578 -2.363,3.139 -0.886,1.616 -1.829,3.756 -2.832,6.422 v 0.002 l -0.656,1.711 -0.153,0.4 h -13.32 l 0.252,-0.807 5.428,-17.338 0.131,-0.417 0.433,-0.021 c 6.721,-0.318 12.895,-0.477 18.561,-0.477 3.374,0 5.904,0.532 7.59,1.596 2.78,-1.064 6.872,-1.596 12.254,-1.596 2.318,0 4.123,0.426 5.408,1.272 1.347,0.887 2.114,2.207 2.306,3.956 z"
       inkscape:connector-curvature="0"
       style="fill:#fff22d" />
  </g>
</svg>
