<?xml version="1.0" encoding="UTF-8" standalone="no"?>
<svg
   xmlns:dc="http://purl.org/dc/elements/1.1/"
   xmlns:cc="http://creativecommons.org/ns#"
   xmlns:rdf="http://www.w3.org/1999/02/22-rdf-syntax-ns#"
   xmlns:svg="http://www.w3.org/2000/svg"
   xmlns="http://www.w3.org/2000/svg"
   xmlns:xlink="http://www.w3.org/1999/xlink"
   xmlns:sodipodi="http://sodipodi.sourceforge.net/DTD/sodipodi-0.dtd"
   xmlns:inkscape="http://www.inkscape.org/namespaces/inkscape"
   sodipodi:docname="lang-ruby.svg"
   inkscape:version="1.0 (1.0+r73+1)"
   xml:space="preserve"
   enable-background="new 0 0 198.13 197.58"
   overflow="visible"
   viewBox="0 0 511.99999 512"
   height="512"
   width="512"
   id="Layer_1"
   version="1.1"><metadata
   id="metadata3320"><rdf:RDF><cc:Work
       rdf:about=""><dc:format>image/svg+xml</dc:format><dc:type
         rdf:resource="http://purl.org/dc/dcmitype/StillImage" /><dc:title></dc:title></cc:Work></rdf:RDF></metadata><defs
   id="defs3489"><linearGradient
     y2="141.7533"
     x2="132.27631"
     y1="215.5488"
     x1="174.0737"
     gradientUnits="userSpaceOnUse"
     id="XMLID_17_-9"><stop
       id="stop3272-4"
       style="stop-color:#FB7655"
       offset="0" /><stop
       id="stop3274-5"
       style="stop-color:#FB7655"
       offset="0" /><stop
       id="stop3276-1"
       style="stop-color:#E42B1E"
       offset="0.41" /><stop
       id="stop3278-0"
       style="stop-color:#990000"
       offset="0.99" /><stop
       id="stop3280-3"
       style="stop-color:#990000"
       offset="1" /></linearGradient><linearGradient
     y2="117.4093"
     x2="141.0276"
     y1="153.5576"
     x1="194.895"
     gradientUnits="userSpaceOnUse"
     id="XMLID_18_-7"><stop
       id="stop3285-8"
       style="stop-color:#871101"
       offset="0" /><stop
       id="stop3287-8"
       style="stop-color:#871101"
       offset="0" /><stop
       id="stop3289-6"
       style="stop-color:#911209"
       offset="0.99" /><stop
       id="stop3291-0"
       style="stop-color:#911209"
       offset="1" /></linearGradient><linearGradient
     y2="181.638"
     x2="97.929703"
     y1="217.7852"
     x1="151.79539"
     gradientUnits="userSpaceOnUse"
     id="XMLID_19_-4"><stop
       id="stop3296-6"
       style="stop-color:#871101"
       offset="0" /><stop
       id="stop3298-7"
       style="stop-color:#871101"
       offset="0" /><stop
       id="stop3300-6"
       style="stop-color:#911209"
       offset="0.99" /><stop
       id="stop3302-0"
       style="stop-color:#911209"
       offset="1" /></linearGradient><linearGradient
     y2="181.66141"
     x2="47.046902"
     y1="127.3906"
     x1="38.696301"
     gradientUnits="userSpaceOnUse"
     id="XMLID_20_-9"><stop
       id="stop3307-7"
       style="stop-color:#FFFFFF"
       offset="0" /><stop
       id="stop3309-5"
       style="stop-color:#FFFFFF"
       offset="0" /><stop
       id="stop3311-9"
       style="stop-color:#E57252"
       offset="0.23" /><stop
       id="stop3313-7"
       style="stop-color:#DE3B20"
       offset="0.46" /><stop
       id="stop3315-8"
       style="stop-color:#A60003"
       offset="0.99" /><stop
       id="stop3317-5"
       style="stop-color:#A60003"
       offset="1" /></linearGradient><linearGradient
     y2="132.1021"
     x2="99.209602"
     y1="76.715302"
     x1="96.132797"
     gradientUnits="userSpaceOnUse"
     id="XMLID_21_-3"><stop
       id="stop3322-3"
       style="stop-color:#FFFFFF"
       offset="0" /><stop
       id="stop3324-8"
       style="stop-color:#FFFFFF"
       offset="0" /><stop
       id="stop3326-3"
       style="stop-color:#E4714E"
       offset="0.23" /><stop
       id="stop3328-7"
       style="stop-color:#BE1A0D"
       offset="0.56" /><stop
       id="stop3330-9"
       style="stop-color:#A80D00"
       offset="0.99" /><stop
       id="stop3332-3"
       style="stop-color:#A80D00"
       offset="1" /></linearGradient><linearGradient
     y2="65.216202"
     x2="156.3141"
     y1="25.521"
     x1="147.103"
     gradientUnits="userSpaceOnUse"
     id="XMLID_22_-7"><stop
       id="stop3337-8"
       style="stop-color:#FFFFFF"
       offset="0" /><stop
       id="stop3339-7"
       style="stop-color:#FFFFFF"
       offset="0" /><stop
       id="stop3341-4"
       style="stop-color:#E46342"
       offset="0.18" /><stop
       id="stop3343-1"
       style="stop-color:#C82410"
       offset="0.4" /><stop
       id="stop3345-9"
       style="stop-color:#A80D00"
       offset="0.99" /><stop
       id="stop3347-0"
       style="stop-color:#A80D00"
       offset="1" /></linearGradient><linearGradient
     y2="-8.3048"
     x2="158.66859"
     y1="11.5415"
     x1="118.9761"
     gradientUnits="userSpaceOnUse"
     id="XMLID_23_-9"><stop
       id="stop3352-8"
       style="stop-color:#FFFFFF"
       offset="0" /><stop
       id="stop3354-8"
       style="stop-color:#FFFFFF"
       offset="0" /><stop
       id="stop3356-5"
       style="stop-color:#C81F11"
       offset="0.54" /><stop
       id="stop3358-8"
       style="stop-color:#BF0905"
       offset="0.99" /><stop
       id="stop3360-4"
       style="stop-color:#BF0905"
       offset="1" /></linearGradient><linearGradient
     y2="146.2628"
     x2="7.1701999"
     y1="113.5547"
     x1="3.9033"
     gradientUnits="userSpaceOnUse"
     id="XMLID_24_-3"><stop
       id="stop3365-7"
       style="stop-color:#FFFFFF"
       offset="0" /><stop
       id="stop3367-1"
       style="stop-color:#FFFFFF"
       offset="0" /><stop
       id="stop3369-3"
       style="stop-color:#DE4024"
       offset="0.31" /><stop
       id="stop3371-8"
       style="stop-color:#BF190B"
       offset="0.99" /><stop
       id="stop3373-0"
       style="stop-color:#BF190B"
       offset="1" /></linearGradient><linearGradient
     y2="-2.8092999"
     x2="135.0152"
     y1="155.10451"
     x1="-18.5557"
     gradientUnits="userSpaceOnUse"
     id="XMLID_25_-9"><stop
       id="stop3380-7"
       style="stop-color:#BD0012"
       offset="0" /><stop
       id="stop3382-9"
       style="stop-color:#BD0012"
       offset="0" /><stop
       id="stop3384-9"
       style="stop-color:#FFFFFF"
       offset="0.07" /><stop
       id="stop3386-3"
       style="stop-color:#FFFFFF"
       offset="0.17" /><stop
       id="stop3388-2"
       style="stop-color:#C82F1C"
       offset="0.27" /><stop
       id="stop3390-4"
       style="stop-color:#820C01"
       offset="0.33" /><stop
       id="stop3392-3"
       style="stop-color:#A31601"
       offset="0.46" /><stop
       id="stop3394-7"
       style="stop-color:#B31301"
       offset="0.72" /><stop
       id="stop3396-1"
       style="stop-color:#E82609"
       offset="0.99" /><stop
       id="stop3398-2"
       style="stop-color:#E82609"
       offset="1" /></linearGradient><linearGradient
     y2="159.61659"
     x2="52.817699"
     y1="171.0332"
     x1="99.074699"
     gradientUnits="userSpaceOnUse"
     id="XMLID_26_-2"><stop
       id="stop3403-0"
       style="stop-color:#8C0C01"
       offset="0" /><stop
       id="stop3405-2"
       style="stop-color:#8C0C01"
       offset="0" /><stop
       id="stop3407-1"
       style="stop-color:#990C00"
       offset="0.54" /><stop
       id="stop3409-7"
       style="stop-color:#A80D0E"
       offset="0.99" /><stop
       id="stop3411-5"
       style="stop-color:#A80D0E"
       offset="1" /></linearGradient><linearGradient
     y2="78.683998"
     x2="137.43269"
     y1="115.5146"
     x1="178.52589"
     gradientUnits="userSpaceOnUse"
     id="XMLID_27_-1"><stop
       id="stop3416-7"
       style="stop-color:#7E110B"
       offset="0" /><stop
       id="stop3418-4"
       style="stop-color:#7E110B"
       offset="0" /><stop
       id="stop3420-1"
       style="stop-color:#9E0C00"
       offset="0.99" /><stop
       id="stop3422-7"
       style="stop-color:#9E0C00"
       offset="1" /></linearGradient><linearGradient
     y2="26.053801"
     x2="173.15421"
     y1="47.937"
     x1="193.6235"
     gradientUnits="userSpaceOnUse"
     id="XMLID_28_-1"><stop
       id="stop3427-1"
       style="stop-color:#79130D"
       offset="0" /><stop
       id="stop3429-1"
       style="stop-color:#79130D"
       offset="0" /><stop
       id="stop3431-7"
       style="stop-color:#9E120B"
       offset="0.99" /><stop
       id="stop3433-0"
       style="stop-color:#9E120B"
       offset="1" /></linearGradient><radialGradient
     gradientUnits="userSpaceOnUse"
     r="50.357601"
     cy="79.388199"
     cx="143.8315"
     id="XMLID_29_-4"><stop
       id="stop3440-0"
       style="stop-color:#A80D00"
       offset="0" /><stop
       id="stop3442-8"
       style="stop-color:#A80D00"
       offset="0" /><stop
       id="stop3444-5"
       style="stop-color:#7E0E08"
       offset="0.99" /><stop
       id="stop3446-1"
       style="stop-color:#7E0E08"
       offset="1" /></radialGradient><radialGradient
     gradientUnits="userSpaceOnUse"
     r="66.943703"
     cy="145.75101"
     cx="74.0923"
     id="XMLID_30_-6"><stop
       id="stop3451-6"
       style="stop-color:#A30C00"
       offset="0" /><stop
       id="stop3453-2"
       style="stop-color:#A30C00"
       offset="0" /><stop
       id="stop3455-1"
       style="stop-color:#800E08"
       offset="0.99" /><stop
       id="stop3457-9"
       style="stop-color:#800E08"
       offset="1" /></radialGradient><linearGradient
     y2="140.742"
     x2="9.9886999"
     y1="197.33591"
     x1="26.669901"
     gradientUnits="userSpaceOnUse"
     id="XMLID_31_-6"><stop
       id="stop3462-4"
       style="stop-color:#8B2114"
       offset="0" /><stop
       id="stop3464-8"
       style="stop-color:#8B2114"
       offset="0" /><stop
       id="stop3466-0"
       style="stop-color:#9E100A"
       offset="0.43" /><stop
       id="stop3468-8"
       style="stop-color:#B3100C"
       offset="0.99" /><stop
       id="stop3470-1"
       style="stop-color:#B3100C"
       offset="1" /></linearGradient><linearGradient
     y2="26.305901"
     x2="192.039"
     y1="9.7979002"
     x1="154.6411"
     gradientUnits="userSpaceOnUse"
     id="XMLID_32_-0"><stop
       id="stop3475-2"
       style="stop-color:#B31000"
       offset="0" /><stop
       id="stop3477-2"
       style="stop-color:#B31000"
       offset="0" /><stop
       id="stop3479-9"
       style="stop-color:#910F08"
       offset="0.44" /><stop
       id="stop3481-7"
       style="stop-color:#791C12"
       offset="0.99" /><stop
       id="stop3483-5"
       style="stop-color:#791C12"
       offset="1" /></linearGradient><linearGradient
     inkscape:collect="always"
     xlink:href="#XMLID_17_-9"
     id="linearGradient3448"
     gradientUnits="userSpaceOnUse"
     x1="174.0737"
     y1="215.5488"
     x2="132.27631"
     y2="141.7533" /></defs><sodipodi:namedview
   fit-margin-bottom="0"
   fit-margin-right="0"
   fit-margin-left="0"
   fit-margin-top="0"
   inkscape:showpageshadow="false"
   inkscape:document-rotation="0"
   inkscape:current-layer="Layer_1"
   inkscape:window-maximized="1"
   inkscape:window-y="24"
   inkscape:window-x="0"
   inkscape:cy="256"
   inkscape:cx="256"
   inkscape:zoom="1.6386719"
   showgrid="false"
   id="namedview3487"
   inkscape:window-height="1033"
   inkscape:window-width="1920"
   inkscape:pageshadow="2"
   inkscape:pageopacity="0"
   guidetolerance="10"
   gridtolerance="10"
   objecttolerance="10"
   borderopacity="1"
   bordercolor="#666666"
   pagecolor="#ffffff" />
<linearGradient
   y2="141.7533"
   x2="132.27631"
   y1="215.5488"
   x1="174.0737"
   gradientUnits="userSpaceOnUse"
   id="XMLID_17_">
	<stop
   id="stop3272"
   style="stop-color:#FB7655"
   offset="0" />
	<stop
   id="stop3274"
   style="stop-color:#FB7655"
   offset="0" />
	<stop
   id="stop3276"
   style="stop-color:#E42B1E"
   offset="0.41" />
	<stop
   id="stop3278"
   style="stop-color:#990000"
   offset="0.99" />
	<stop
   id="stop3280"
   style="stop-color:#990000"
   offset="1" />
</linearGradient>

<linearGradient
   y2="117.4093"
   x2="141.0276"
   y1="153.5576"
   x1="194.895"
   gradientUnits="userSpaceOnUse"
   id="XMLID_18_">
	<stop
   id="stop3285"
   style="stop-color:#871101"
   offset="0" />
	<stop
   id="stop3287"
   style="stop-color:#871101"
   offset="0" />
	<stop
   id="stop3289"
   style="stop-color:#911209"
   offset="0.99" />
	<stop
   id="stop3291"
   style="stop-color:#911209"
   offset="1" />
</linearGradient>

<linearGradient
   y2="181.638"
   x2="97.929703"
   y1="217.7852"
   x1="151.79539"
   gradientUnits="userSpaceOnUse"
   id="XMLID_19_">
	<stop
   id="stop3296"
   style="stop-color:#871101"
   offset="0" />
	<stop
   id="stop3298"
   style="stop-color:#871101"
   offset="0" />
	<stop
   id="stop3300"
   style="stop-color:#911209"
   offset="0.99" />
	<stop
   id="stop3302"
   style="stop-color:#911209"
   offset="1" />
</linearGradient>

<linearGradient
   y2="181.66141"
   x2="47.046902"
   y1="127.3906"
   x1="38.696301"
   gradientUnits="userSpaceOnUse"
   id="XMLID_20_">
	<stop
   id="stop3307"
   style="stop-color:#FFFFFF"
   offset="0" />
	<stop
   id="stop3309"
   style="stop-color:#FFFFFF"
   offset="0" />
	<stop
   id="stop3311"
   style="stop-color:#E57252"
   offset="0.23" />
	<stop
   id="stop3313"
   style="stop-color:#DE3B20"
   offset="0.46" />
	<stop
   id="stop3315"
   style="stop-color:#A60003"
   offset="0.99" />
	<stop
   id="stop3317"
   style="stop-color:#A60003"
   offset="1" />
</linearGradient>

<linearGradient
   y2="132.1021"
   x2="99.209602"
   y1="76.715302"
   x1="96.132797"
   gradientUnits="userSpaceOnUse"
   id="XMLID_21_">
	<stop
   id="stop3322"
   style="stop-color:#FFFFFF"
   offset="0" />
	<stop
   id="stop3324"
   style="stop-color:#FFFFFF"
   offset="0" />
	<stop
   id="stop3326"
   style="stop-color:#E4714E"
   offset="0.23" />
	<stop
   id="stop3328"
   style="stop-color:#BE1A0D"
   offset="0.56" />
	<stop
   id="stop3330"
   style="stop-color:#A80D00"
   offset="0.99" />
	<stop
   id="stop3332"
   style="stop-color:#A80D00"
   offset="1" />
</linearGradient>

<linearGradient
   y2="65.216202"
   x2="156.3141"
   y1="25.521"
   x1="147.103"
   gradientUnits="userSpaceOnUse"
   id="XMLID_22_">
	<stop
   id="stop3337"
   style="stop-color:#FFFFFF"
   offset="0" />
	<stop
   id="stop3339"
   style="stop-color:#FFFFFF"
   offset="0" />
	<stop
   id="stop3341"
   style="stop-color:#E46342"
   offset="0.18" />
	<stop
   id="stop3343"
   style="stop-color:#C82410"
   offset="0.4" />
	<stop
   id="stop3345"
   style="stop-color:#A80D00"
   offset="0.99" />
	<stop
   id="stop3347"
   style="stop-color:#A80D00"
   offset="1" />
</linearGradient>

<linearGradient
   y2="-8.3048"
   x2="158.66859"
   y1="11.5415"
   x1="118.9761"
   gradientUnits="userSpaceOnUse"
   id="XMLID_23_">
	<stop
   id="stop3352"
   style="stop-color:#FFFFFF"
   offset="0" />
	<stop
   id="stop3354"
   style="stop-color:#FFFFFF"
   offset="0" />
	<stop
   id="stop3356"
   style="stop-color:#C81F11"
   offset="0.54" />
	<stop
   id="stop3358"
   style="stop-color:#BF0905"
   offset="0.99" />
	<stop
   id="stop3360"
   style="stop-color:#BF0905"
   offset="1" />
</linearGradient>

<linearGradient
   y2="146.2628"
   x2="7.1701999"
   y1="113.5547"
   x1="3.9033"
   gradientUnits="userSpaceOnUse"
   id="XMLID_24_">
	<stop
   id="stop3365"
   style="stop-color:#FFFFFF"
   offset="0" />
	<stop
   id="stop3367"
   style="stop-color:#FFFFFF"
   offset="0" />
	<stop
   id="stop3369"
   style="stop-color:#DE4024"
   offset="0.31" />
	<stop
   id="stop3371"
   style="stop-color:#BF190B"
   offset="0.99" />
	<stop
   id="stop3373"
   style="stop-color:#BF190B"
   offset="1" />
</linearGradient>


<linearGradient
   y2="-2.8092999"
   x2="135.0152"
   y1="155.10451"
   x1="-18.5557"
   gradientUnits="userSpaceOnUse"
   id="XMLID_25_">
	<stop
   id="stop3380"
   style="stop-color:#BD0012"
   offset="0" />
	<stop
   id="stop3382"
   style="stop-color:#BD0012"
   offset="0" />
	<stop
   id="stop3384"
   style="stop-color:#FFFFFF"
   offset="0.07" />
	<stop
   id="stop3386"
   style="stop-color:#FFFFFF"
   offset="0.17" />
	<stop
   id="stop3388"
   style="stop-color:#C82F1C"
   offset="0.27" />
	<stop
   id="stop3390"
   style="stop-color:#820C01"
   offset="0.33" />
	<stop
   id="stop3392"
   style="stop-color:#A31601"
   offset="0.46" />
	<stop
   id="stop3394"
   style="stop-color:#B31301"
   offset="0.72" />
	<stop
   id="stop3396"
   style="stop-color:#E82609"
   offset="0.99" />
	<stop
   id="stop3398"
   style="stop-color:#E82609"
   offset="1" />
</linearGradient>

<linearGradient
   y2="159.61659"
   x2="52.817699"
   y1="171.0332"
   x1="99.074699"
   gradientUnits="userSpaceOnUse"
   id="XMLID_26_">
	<stop
   id="stop3403"
   style="stop-color:#8C0C01"
   offset="0" />
	<stop
   id="stop3405"
   style="stop-color:#8C0C01"
   offset="0" />
	<stop
   id="stop3407"
   style="stop-color:#990C00"
   offset="0.54" />
	<stop
   id="stop3409"
   style="stop-color:#A80D0E"
   offset="0.99" />
	<stop
   id="stop3411"
   style="stop-color:#A80D0E"
   offset="1" />
</linearGradient>

<linearGradient
   y2="78.683998"
   x2="137.43269"
   y1="115.5146"
   x1="178.52589"
   gradientUnits="userSpaceOnUse"
   id="XMLID_27_">
	<stop
   id="stop3416"
   style="stop-color:#7E110B"
   offset="0" />
	<stop
   id="stop3418"
   style="stop-color:#7E110B"
   offset="0" />
	<stop
   id="stop3420"
   style="stop-color:#9E0C00"
   offset="0.99" />
	<stop
   id="stop3422"
   style="stop-color:#9E0C00"
   offset="1" />
</linearGradient>

<linearGradient
   y2="26.053801"
   x2="173.15421"
   y1="47.937"
   x1="193.6235"
   gradientUnits="userSpaceOnUse"
   id="XMLID_28_">
	<stop
   id="stop3427"
   style="stop-color:#79130D"
   offset="0" />
	<stop
   id="stop3429"
   style="stop-color:#79130D"
   offset="0" />
	<stop
   id="stop3431"
   style="stop-color:#9E120B"
   offset="0.99" />
	<stop
   id="stop3433"
   style="stop-color:#9E120B"
   offset="1" />
</linearGradient>


<radialGradient
   gradientUnits="userSpaceOnUse"
   r="50.357601"
   cy="79.388199"
   cx="143.8315"
   id="XMLID_29_">
	<stop
   id="stop3440"
   style="stop-color:#A80D00"
   offset="0" />
	<stop
   id="stop3442"
   style="stop-color:#A80D00"
   offset="0" />
	<stop
   id="stop3444"
   style="stop-color:#7E0E08"
   offset="0.99" />
	<stop
   id="stop3446"
   style="stop-color:#7E0E08"
   offset="1" />
</radialGradient>

<radialGradient
   gradientUnits="userSpaceOnUse"
   r="66.943703"
   cy="145.75101"
   cx="74.0923"
   id="XMLID_30_">
	<stop
   id="stop3451"
   style="stop-color:#A30C00"
   offset="0" />
	<stop
   id="stop3453"
   style="stop-color:#A30C00"
   offset="0" />
	<stop
   id="stop3455"
   style="stop-color:#800E08"
   offset="0.99" />
	<stop
   id="stop3457"
   style="stop-color:#800E08"
   offset="1" />
</radialGradient>

<linearGradient
   y2="140.742"
   x2="9.9886999"
   y1="197.33591"
   x1="26.669901"
   gradientUnits="userSpaceOnUse"
   id="XMLID_31_">
	<stop
   id="stop3462"
   style="stop-color:#8B2114"
   offset="0" />
	<stop
   id="stop3464"
   style="stop-color:#8B2114"
   offset="0" />
	<stop
   id="stop3466"
   style="stop-color:#9E100A"
   offset="0.43" />
	<stop
   id="stop3468"
   style="stop-color:#B3100C"
   offset="0.99" />
	<stop
   id="stop3470"
   style="stop-color:#B3100C"
   offset="1" />
</linearGradient>

<linearGradient
   y2="26.305901"
   x2="192.039"
   y1="9.7979002"
   x1="154.6411"
   gradientUnits="userSpaceOnUse"
   id="XMLID_32_">
	<stop
   id="stop3475"
   style="stop-color:#B31000"
   offset="0" />
	<stop
   id="stop3477"
   style="stop-color:#B31000"
   offset="0" />
	<stop
   id="stop3479"
   style="stop-color:#910F08"
   offset="0.44" />
	<stop
   id="stop3481"
   style="stop-color:#791C12"
   offset="0.99" />
	<stop
   id="stop3483"
   style="stop-color:#791C12"
   offset="1" />
</linearGradient>

<g
   transform="scale(2.5841619,2.5913554)"
   id="g239"><polygon
     style="fill:url(#linearGradient3448);fill-rule:evenodd"
     clip-rule="evenodd"
     points="186.849,187.641 198.13,39.95 153.5,130.41 40.38,197.58 "
     id="polygon3282" /><polygon
     style="fill:url(#XMLID_18_-7);fill-rule:evenodd"
     clip-rule="evenodd"
     points="187.089,187.54 174.5,100.65 140.209,145.93 "
     id="polygon3293" /><polygon
     style="fill:url(#XMLID_19_-4);fill-rule:evenodd"
     clip-rule="evenodd"
     points="187.259,187.54 95.03,180.3 40.87,197.391 "
     id="polygon3304" /><polygon
     style="fill:url(#XMLID_20_-9);fill-rule:evenodd"
     clip-rule="evenodd"
     points="41,197.41 64.04,121.93 13.34,132.771 "
     id="polygon3319" /><polygon
     style="fill:url(#XMLID_21_-3);fill-rule:evenodd"
     clip-rule="evenodd"
     points="140.2,146.18 119,63.14 58.33,120.01 "
     id="polygon3334" /><polygon
     style="fill:url(#XMLID_22_-7);fill-rule:evenodd"
     clip-rule="evenodd"
     points="193.32,64.31 135.97,17.47 120,69.1 "
     id="polygon3349" /><polygon
     style="fill:url(#XMLID_23_-9);fill-rule:evenodd"
     clip-rule="evenodd"
     points="166.5,0.77 132.77,19.41 111.49,0.52 "
     id="polygon3362" /><polygon
     style="fill:url(#XMLID_24_-3);fill-rule:evenodd"
     clip-rule="evenodd"
     points="0,158.09 14.13,132.32 2.7,101.62 "
     id="polygon3375" /><path
     style="fill:#ffffff;fill-rule:evenodd"
     inkscape:connector-curvature="0"
     clip-rule="evenodd"
     d="m 1.94,100.65 11.5,32.62 49.97,-11.211 57.05,-53.02 L 136.56,17.9 111.209,0 68.109,16.13 C 54.53,28.76 28.18,53.75 27.23,54.22 26.29,54.7 9.83,85.81 1.94,100.65 Z"
     id="path3377" /><path
     style="fill:url(#XMLID_25_-9);fill-rule:evenodd"
     inkscape:connector-curvature="0"
     clip-rule="evenodd"
     d="m 42.32,42.05 c 29.43,-29.18 67.37,-46.42 81.93,-31.73 14.551,14.69 -0.88,50.39 -30.31,79.56 -29.43,29.17 -66.9,47.36 -81.45,32.67 -14.56,-14.68 0.4,-51.33 29.83,-80.5 z"
     id="path3400" /><path
     style="fill:url(#XMLID_26_-2);fill-rule:evenodd"
     inkscape:connector-curvature="0"
     clip-rule="evenodd"
     d="m 41,197.38 22.86,-75.72 75.92,24.39 C 112.33,171.79 81.8,193.55 41,197.38 Z"
     id="path3413" /><path
     style="fill:url(#XMLID_27_-1);fill-rule:evenodd"
     inkscape:connector-curvature="0"
     clip-rule="evenodd"
     d="m 120.56,68.89 19.49,77.2 C 162.98,121.98 183.56,96.06 193.639,64 Z"
     id="path3424" /><path
     style="fill:url(#XMLID_28_-1);fill-rule:evenodd"
     inkscape:connector-curvature="0"
     clip-rule="evenodd"
     d="m 193.44,64.39 c 7.8,-23.54 9.6,-57.31 -27.181,-63.58 l -30.18,16.67 z"
     id="path3435" /><path
     style="fill:#9e1209;fill-rule:evenodd"
     inkscape:connector-curvature="0"
     clip-rule="evenodd"
     d="m 0,157.75 c 1.08,38.851 29.11,39.43 41.05,39.771 L 13.47,133.11 Z"
     id="path3437" /><path
     style="fill:url(#XMLID_29_-4);fill-rule:evenodd"
     inkscape:connector-curvature="0"
     clip-rule="evenodd"
     d="m 120.669,69.01 c 17.62,10.83 53.131,32.58 53.851,32.98 1.119,0.63 15.31,-23.93 18.53,-37.81 z"
     id="path3448" /><path
     style="fill:url(#XMLID_30_-6);fill-rule:evenodd"
     inkscape:connector-curvature="0"
     clip-rule="evenodd"
     d="m 63.83,121.66 30.56,58.96 c 18.07,-9.8 32.22,-21.74 45.18,-34.53 z"
     id="path3459" /><path
     style="fill:url(#XMLID_31_-6);fill-rule:evenodd"
     inkscape:connector-curvature="0"
     clip-rule="evenodd"
     d="m 13.35,133.19 -4.33,51.56 c 8.17,11.16 19.41,12.13 31.2,11.26 -8.53,-21.23 -25.57,-63.68 -26.87,-62.82 z"
     id="path3472" /><path
     style="fill:url(#XMLID_32_-0);fill-rule:evenodd"
     inkscape:connector-curvature="0"
     clip-rule="evenodd"
     d="m 135.9,17.61 60.71,8.52 C 193.37,12.4 183.42,3.54 166.46,0.77 Z"
     id="path3485" /></g></svg>
