<?xml version="1.0" encoding="UTF-8" standalone="no"?>
<svg
   xmlns:dc="http://purl.org/dc/elements/1.1/"
   xmlns:cc="http://creativecommons.org/ns#"
   xmlns:rdf="http://www.w3.org/1999/02/22-rdf-syntax-ns#"
   xmlns:svg="http://www.w3.org/2000/svg"
   xmlns="http://www.w3.org/2000/svg"
   xmlns:sodipodi="http://sodipodi.sourceforge.net/DTD/sodipodi-0.dtd"
   xmlns:inkscape="http://www.inkscape.org/namespaces/inkscape"
   viewBox="0 0 512.46051 512"
   version="1.1"
   id="svg24"
   sodipodi:docname="ms-yammer.svg"
   width="512.46051"
   height="512"
   inkscape:version="0.92.4 (unknown)">
  <metadata
     id="metadata30">
    <rdf:RDF>
      <cc:Work
         rdf:about="">
        <dc:format>image/svg+xml</dc:format>
        <dc:type
           rdf:resource="http://purl.org/dc/dcmitype/StillImage" />
        <dc:title>OfficeCore10_32x_24x_20x_16x_01-22-2019</dc:title>
      </cc:Work>
    </rdf:RDF>
  </metadata>
  <defs
     id="defs28" />
  <sodipodi:namedview
     pagecolor="#ffffff"
     bordercolor="#666666"
     borderopacity="1"
     objecttolerance="10"
     gridtolerance="10"
     guidetolerance="10"
     inkscape:pageopacity="0"
     inkscape:pageshadow="2"
     inkscape:window-width="1600"
     inkscape:window-height="851"
     id="namedview26"
     showgrid="false"
     inkscape:showpageshadow="false"
     fit-margin-top="0"
     fit-margin-left="0"
     fit-margin-right="0"
     fit-margin-bottom="0"
     inkscape:zoom="1.2597656"
     inkscape:cx="256.23026"
     inkscape:cy="256"
     inkscape:window-x="0"
     inkscape:window-y="24"
     inkscape:window-maximized="1"
     inkscape:current-layer="svg24" />
  <title
     id="title2">OfficeCore10_32x_24x_20x_16x_01-22-2019</title>
  <g
     id="g51"
     transform="matrix(16.362431,0,0,16.362431,0,-5.7989915)">
    <path
       d="M 11.55018,9.71687 A 0.4163,0.4163 0 0 1 11.49339,9.22338 0.41,0.41 0 0 1 11.55663,9.14031 L 20.085,0.59887 a 0.83408,0.83408 0 0 1 1.20252,0.02354 22.62072,22.62072 0 0 1 5.2527,9.54509 v 6e-5 L 21.37806,16 13.701,13.596 A 9.25859,9.25859 0 0 0 11.55019,9.71687 Z"
       id="path4"
       inkscape:connector-curvature="0"
       style="fill:#28a8ea" />
    <path
       d="M 30.62719,9.96175 A 0.832,0.832 0 0 0 29.60149,9.35 l -15.90182,4.24747 a 9.37875,9.37875 0 0 1 0.0031,4.8345 l 5.30344,6.60672 7.5488,-3.15212 3.04229,0.81775 a 0.832,0.832 0 0 0 1.02687,-0.611 26.868,26.868 0 0 0 0.003,-12.13157 z"
       id="path6"
       inkscape:connector-curvature="0"
       style="fill:#0078d4" />
    <path
       d="m 13.70282,18.43177 a 9.26173,9.26173 0 0 1 -2.1295,3.87451 0.417,0.417 0 0 0 0.0061,0.58365 l 8.525,8.51191 a 0.8335,0.8335 0 0 0 1.19983,-0.02262 22.54982,22.54982 0 0 0 5.2509,-9.49281 z"
       id="path8"
       inkscape:connector-curvature="0"
       style="fill:#0358a7" />
    <path
       d="M 18,24.66663 V 8.33331 A 1.33727,1.33727 0 0 0 16.66663,7 h -2.994 l -2.116,2.11926 A 0.40811,0.40811 0 0 0 11.4934,9.20233 0.41622,0.41622 0 0 0 11.55016,9.6958 9.25873,9.25873 0 0 1 13.701,13.575 l 0.0034,1.8e-4 -0.0047,0.0013 a 9.38226,9.38226 0 0 1 0.0031,4.83447 9.21967,9.21967 0 0 1 -0.41467,1.20862 9.27745,9.27745 0 0 1 -1.71479,2.66571 0.417,0.417 0 0 0 0.0062,0.58368 L 14.71539,26 h 1.95124 A 1.33732,1.33732 0 0 0 18,24.66663 Z"
       id="path10"
       inkscape:connector-curvature="0"
       style="opacity:0.1" />
    <path
       d="M 17,25.66663 V 9.33331 A 1.33727,1.33727 0 0 0 15.66663,8 H 12.67419 L 11.55664,9.11926 A 0.40811,0.40811 0 0 0 11.49341,9.20233 0.41622,0.41622 0 0 0 11.55017,9.6958 9.25873,9.25873 0 0 1 13.701,13.575 l 0.0034,1.8e-4 -0.0047,0.0013 a 9.38226,9.38226 0 0 1 0.0031,4.83447 9.21967,9.21967 0 0 1 -0.41467,1.20862 9.27745,9.27745 0 0 1 -1.71479,2.66571 0.417,0.417 0 0 0 0.0062,0.58368 l 4.13617,4.12982 A 1.33727,1.33727 0 0 0 17,25.66663 Z"
       id="path12"
       inkscape:connector-curvature="0"
       style="opacity:0.2" />
    <path
       d="M 17,23.66663 V 9.33331 A 1.33727,1.33727 0 0 0 15.66663,8 H 12.67419 L 11.55664,9.11926 A 0.40811,0.40811 0 0 0 11.49341,9.20233 0.41622,0.41622 0 0 0 11.55017,9.6958 9.25873,9.25873 0 0 1 13.701,13.575 l 0.0034,1.8e-4 -0.0047,0.0013 a 9.38226,9.38226 0 0 1 0.0031,4.83447 9.21967,9.21967 0 0 1 -0.41467,1.20862 9.27745,9.27745 0 0 1 -1.71479,2.66571 0.417,0.417 0 0 0 0.0062,0.58368 L 13.71387,25 h 1.95276 A 1.33732,1.33732 0 0 0 17,23.66663 Z"
       id="path14"
       inkscape:connector-curvature="0"
       style="opacity:0.2" />
    <path
       d="M 16,23.66663 V 9.33331 A 1.33727,1.33727 0 0 0 14.66663,8 H 12.67419 L 11.55664,9.11926 A 0.40811,0.40811 0 0 0 11.49341,9.20233 0.41622,0.41622 0 0 0 11.55017,9.6958 9.25873,9.25873 0 0 1 13.701,13.575 l 0.0034,1.8e-4 -0.0047,0.0013 a 9.38226,9.38226 0 0 1 0.0031,4.83447 9.21967,9.21967 0 0 1 -0.41467,1.20862 9.27745,9.27745 0 0 1 -1.71479,2.66571 0.417,0.417 0 0 0 0.0062,0.58368 L 13.71387,25 h 0.95276 A 1.33732,1.33732 0 0 0 16,23.66663 Z"
       id="path16"
       inkscape:connector-curvature="0"
       style="opacity:0.2" />
    <path
       id="Back_Plate"
       data-name="Back Plate"
       d="M 1.33333,8 H 14.66669 A 1.33334,1.33334 0 0 1 16,9.33334 V 22.66666 A 1.33333,1.33333 0 0 1 14.6667,24 H 1.33334 A 1.33334,1.33334 0 0 1 0,22.66666 V 9.33333 A 1.33333,1.33333 0 0 1 1.33333,8 Z"
       inkscape:connector-curvature="0"
       style="fill:#0078d4" />
    <path
       d="M 7.82588,15.26778 A 3.361,3.361 0 0 1 8.04904,15.8675 H 8.07 a 2.84446,2.84446 0 0 1 0.21617,-0.58577 l 2.02264,-3.8095 A 0.88924,0.88924 0 0 1 11.09417,11 v 0 a 0.88924,0.88924 0 0 1 0.771,1.33223 l -2.79835,4.87069 a 0.88915,0.88915 0 0 0 -0.1182,0.443 v 2.46485 A 0.88924,0.88924 0 0 1 8.05938,21 H 7.8783 A 0.88924,0.88924 0 0 1 6.98906,20.11076 V 17.675 A 0.88928,0.88928 0 0 0 6.87621,17.24144 L 4.12945,12.3228 A 0.88924,0.88924 0 0 1 4.90583,11 h 0.1748 a 0.88923,0.88923 0 0 1 0.79012,0.48126 z"
       id="path19"
       inkscape:connector-curvature="0"
       style="fill:#ffffff" />
  </g>
</svg>
