<?xml version="1.0" encoding="UTF-8" standalone="no"?>
<!-- Created with Inkscape (http://www.inkscape.org/) -->

<svg
   xmlns:dc="http://purl.org/dc/elements/1.1/"
   xmlns:cc="http://creativecommons.org/ns#"
   xmlns:rdf="http://www.w3.org/1999/02/22-rdf-syntax-ns#"
   xmlns:svg="http://www.w3.org/2000/svg"
   xmlns="http://www.w3.org/2000/svg"
   xmlns:sodipodi="http://sodipodi.sourceforge.net/DTD/sodipodi-0.dtd"
   xmlns:inkscape="http://www.inkscape.org/namespaces/inkscape"
   version="1.1"
   id="svg5317"
   width="512"
   height="512"
   viewBox="0 0 512 512"
   sodipodi:docname="dbeaver.svg"
   inkscape:version="0.92.4 (unknown)">
  <metadata
     id="metadata5323">
    <rdf:RDF>
      <cc:Work
         rdf:about="">
        <dc:format>image/svg+xml</dc:format>
        <dc:type
           rdf:resource="http://purl.org/dc/dcmitype/StillImage" />
        <dc:title></dc:title>
      </cc:Work>
    </rdf:RDF>
  </metadata>
  <defs
     id="defs5321" />
  <sodipodi:namedview
     pagecolor="#ffffff"
     bordercolor="#666666"
     borderopacity="1"
     objecttolerance="10"
     gridtolerance="10"
     guidetolerance="10"
     inkscape:pageopacity="0"
     inkscape:pageshadow="2"
     inkscape:window-width="1920"
     inkscape:window-height="1032"
     id="namedview5319"
     showgrid="false"
     inkscape:zoom="1.6132812"
     inkscape:cx="256"
     inkscape:cy="256"
     inkscape:window-x="0"
     inkscape:window-y="23"
     inkscape:window-maximized="1"
     inkscape:current-layer="svg5317"
     inkscape:showpageshadow="false"
     fit-margin-top="0"
     fit-margin-left="0"
     fit-margin-right="0"
     fit-margin-bottom="0" />
  <circle
     r="256"
     cy="256"
     cx="256"
     id="path822"
     style="opacity:1;fill:none;fill-opacity:1;stroke:none;stroke-width:7.04150152;stroke-linecap:round;stroke-linejoin:round;stroke-miterlimit:4;stroke-dasharray:none;stroke-dashoffset:0;stroke-opacity:1;paint-order:stroke fill markers" />
  <g
     id="g24">
    <g
       style="fill:#ffffff"
       transform="matrix(0.85806671,0,0,0.85806671,39.386705,33.872434)"
       id="g427">
      <path
         inkscape:connector-curvature="0"
         id="path423"
         d="M 236.37535,506.36679 C 178.93234,490.46884 126.20806,433.63017 76.858337,334.40183 35.129227,250.49633 17.313517,183.94088 20.153277,122.5647 c 2.32322,-50.212134 16.36887,-77.996244 45.90833,-90.812564 16.57244,-7.1903 40.181073,-6.2385 59.834773,2.41229 22.66309,9.9754 30.86985,21.51588 40.2524,56.60357 4.40516,16.473944 5.52622,30.160084 6.60534,80.640484 l 1.2997,60.79912 4.41686,-12.93598 c 4.83938,-14.17338 22.83472,-51.20515 31.99342,-65.83765 8.6455,-13.81261 9.35763,-27.38806 2.24649,-42.82458 -3.79211,-8.23179 -5.9683,-17.798434 -5.98426,-26.307154 -0.0391,-20.80649 0.6365,-21.53476 20.12995,-21.7033 l 17.04088,-0.14734 9.64452,-12.7705 c 11.84009,-15.67773 34.07316,-33.67557 54.25473,-43.9196602 12.94421,-6.57040001 18.00554,-7.67797 34.63068,-7.57814 15.88295,0.0954 21.59798,1.31465999 31.01439,6.61689 6.34895,3.5749901 9.23484,5.7661402 6.41309,4.8692301 -36.45503,-11.5874601 -68.37707,-2.9835801 -99.65096,26.8587201 -38.4169,36.65835 -64.64188,99.286234 -51.94494,124.049674 4.90522,9.56685 3.80742,10.49291 -3.30767,2.79034 l -5.03727,-5.45316 -5.00488,9.98075 c -11.20745,22.34985 -28.94803,71.19698 -35.57239,97.94541 -5.961,24.06984 -7.06483,34.04555 -7.15693,64.67989 -0.11643,38.75712 4.14665,59.45763 17.83618,86.6058 6.86569,13.61558 24.76409,38.77652 27.62475,38.83388 1.07845,0.0207 -1.50831,-6.8919 -5.74839,-15.36334 -33.94739,-67.82511 -29.38016,-157.11425 12.66523,-247.60486 8.57806,-18.46189 11.05242,-21.83808 14.81866,-20.21997 7.61507,3.27172 34.02139,4.68591 34.02139,1.82201 0,-1.43561 -3.838,-3.3364 -8.52887,-4.22394 -29.37275,-5.55753 -24.9636,-32.11655 12.16222,-73.260324 24.25105,-26.87564 24.85741,-28.05132 21.33381,-41.36552 -5.14868,-19.4547 7.40996,-24.4999 30.67837,-12.32446 11.8701,6.21115 13.55522,6.41586 32.94348,4.00189 11.23839,-1.39925 27.96645,-3.95458 37.17348,-5.6785 9.207,-1.72392 19.88477,-2.33835 23.72841,-1.36541 6.15517,1.55808 6.98838,3.00672 6.98838,12.1501 0,5.70961 2.42257,17.62087 5.38354,26.46946 4.4604,13.32966 5.21925,20.746496 4.42573,43.253914 -0.91972,26.08627 -1.43933,28.19994 -13.07923,53.20138 -7.44812,15.998 -12.12145,29.6378 -12.12145,35.37847 0,5.13846 3.46855,18.07912 7.70793,28.75704 18.02887,45.41046 22.83567,115.56475 11.53133,168.29731 -8.53769,39.82661 -8.45128,53.03564 0.41644,63.66454 5.59895,6.71096 6.40786,9.3796 4.48915,14.81061 -3.57504,10.11953 -13.78484,16.21233 -32.61991,19.46627 -15.42918,2.66553 -18.83587,2.39628 -34.64195,-2.73801 -22.29071,-7.24065 -27.32511,-7.14808 -42.07991,0.77376 -11.19443,6.01029 -14.46056,6.45161 -46.15381,6.23664 -19.99625,-0.13557 -39.34131,-1.68002 -46.75914,-3.73299 z M 389.30629,204.39525 c 2.21058,-1.7787 5.37221,-5.56247 7.02587,-8.40839 2.85919,-4.92064 2.92925,-4.88892 1.42865,0.6468 -2.35986,8.70566 3.12112,7.07992 7.96209,-2.36167 5.92776,-11.56116 14.16001,-36.39237 12.59007,-37.97577 -0.72382,-0.73001 -4.47846,1.71543 -8.34365,5.43431 -8.60654,8.28071 -18.54986,12.26514 -30.60813,12.26514 h -9.13769 l 1.22426,12.85017 c 1.76447,18.52049 8.46652,25.10653 17.85853,17.54941 z"
         style="fill:#ffffff;stroke-width:2.57619143" />
      <path
         sodipodi:nodetypes="cssssccsccscscscscssssccccc"
         inkscape:connector-curvature="0"
         id="path425"
         d="M 240.04933,506.63984 C 181.15523,490.16792 128.20988,434.37919 78.954357,336.89348 21.349697,222.88325 4.8620167,122.94218 33.812427,63.263066 c 11.90231,-24.53569 40.24354,-39.512 67.163753,-35.49122 54.9392,8.20567 73.75005,50.32883 71.88725,160.977234 -0.43605,25.90135 -0.0665,46.27551 0.82122,45.27592 0.88772,-0.99956 3.03463,-6.47435 4.77092,-12.16618 1.7363,-5.69183 10.9976,-25.70622 20.5807,-44.47643 21.49419,-42.10022 22.98105,-49.21923 14.23685,-68.16547 -6.7161,-14.551844 -8.62762,-34.018164 -4.05517,-41.296254 1.71826,-2.73501 6.91769,-3.8808 17.61052,-3.8808 h 15.17248 l 17.13114,-18.65927 c 17.54608,-19.11121 44.6514,-39.0893002 60.18094,-44.3566202 13.55471,-4.59748 38.4969,-3.55312 50.28059,2.10532 l 10.26095,4.92722 c 0,0 49.14761,23.5156002 46.9389,35.6924512 -5.30808,29.264041 12.9751,100.417113 -0.88201,130.499813 -14.49797,31.28057 -15.22479,40.3521 -5.1487,64.26408 9.83259,23.33415 16.65707,60.34036 18.39897,99.76976 1.32674,30.03227 0.77184,36.91069 -5.18225,64.24007 -7.79426,35.77574 -8.76946,61.43363 -2.53328,66.6535 11.88276,9.94624 7.38939,25.07696 -9.4672,31.87937 -13.69586,5.52693 -39.00052,5.74984 -53.34921,0.46997 -15.71232,-5.78169 -26.68979,-5.16128 -41.36253,2.33761 -11.55788,5.90698 -15.38864,6.44791 -44.16501,6.23664 -17.33014,-0.12729 -36.70397,-1.68419 -43.05292,-3.45994 z"
         style="fill:#ffffff;stroke-width:2.57619143" />
    </g>
    <g
       id="g406"
       transform="matrix(0.85806671,0,0,0.85806671,39.386705,33.872434)">
      <path
         style="fill:#887161;stroke-width:2.57619143"
         d="M 236.37535,506.36679 C 178.93234,490.46884 126.20806,433.63017 76.858337,334.40183 35.129227,250.49633 17.313517,183.94088 20.153277,122.5647 c 2.32322,-50.212134 16.36887,-77.996244 45.90833,-90.812564 16.57244,-7.1903 40.181073,-6.2385 59.834773,2.41229 22.66309,9.9754 30.86985,21.51588 40.2524,56.60357 4.40516,16.473944 5.52622,30.160084 6.60534,80.640484 l 1.2997,60.79912 4.41686,-12.93598 c 4.83938,-14.17338 22.83472,-51.20515 31.99342,-65.83765 8.6455,-13.81261 9.35763,-27.38806 2.24649,-42.82458 -3.79211,-8.23179 -5.9683,-17.798434 -5.98426,-26.307154 -0.0391,-20.80649 0.6365,-21.53476 20.12995,-21.7033 l 17.04088,-0.14734 9.64452,-12.7705 c 11.84009,-15.67773 34.07316,-33.67557 54.25473,-43.9196602 12.94421,-6.57040001 18.00554,-7.67797 34.63068,-7.57814 15.88295,0.0954 21.59798,1.31465999 31.01439,6.61689 6.34895,3.5749901 9.23484,5.7661402 6.41309,4.8692301 -36.45503,-11.5874601 -68.37707,-2.9835801 -99.65096,26.8587201 -38.4169,36.65835 -64.64188,99.286234 -51.94494,124.049674 4.90522,9.56685 3.80742,10.49291 -3.30767,2.79034 l -5.03727,-5.45316 -5.00488,9.98075 c -11.20745,22.34985 -28.94803,71.19698 -35.57239,97.94541 -5.961,24.06984 -7.06483,34.04555 -7.15693,64.67989 -0.11643,38.75712 4.14665,59.45763 17.83618,86.6058 6.86569,13.61558 24.76409,38.77652 27.62475,38.83388 1.07845,0.0207 -1.50831,-6.8919 -5.74839,-15.36334 -33.94739,-67.82511 -29.38016,-157.11425 12.66523,-247.60486 8.57806,-18.46189 11.05242,-21.83808 14.81866,-20.21997 7.61507,3.27172 34.02139,4.68591 34.02139,1.82201 0,-1.43561 -3.838,-3.3364 -8.52887,-4.22394 -29.37275,-5.55753 -24.9636,-32.11655 12.16222,-73.260324 24.25105,-26.87564 24.85741,-28.05132 21.33381,-41.36552 -5.14868,-19.4547 7.40996,-24.4999 30.67837,-12.32446 11.8701,6.21115 13.55522,6.41586 32.94348,4.00189 11.23839,-1.39925 27.96645,-3.95458 37.17348,-5.6785 9.207,-1.72392 19.88477,-2.33835 23.72841,-1.36541 6.15517,1.55808 6.98838,3.00672 6.98838,12.1501 0,5.70961 2.42257,17.62087 5.38354,26.46946 4.4604,13.32966 5.21925,20.746496 4.42573,43.253914 -0.91972,26.08627 -1.43933,28.19994 -13.07923,53.20138 -7.44812,15.998 -12.12145,29.6378 -12.12145,35.37847 0,5.13846 3.46855,18.07912 7.70793,28.75704 18.02887,45.41046 22.83567,115.56475 11.53133,168.29731 -8.53769,39.82661 -8.45128,53.03564 0.41644,63.66454 5.59895,6.71096 6.40786,9.3796 4.48915,14.81061 -3.57504,10.11953 -13.78484,16.21233 -32.61991,19.46627 -15.42918,2.66553 -18.83587,2.39628 -34.64195,-2.73801 -22.29071,-7.24065 -27.32511,-7.14808 -42.07991,0.77376 -11.19443,6.01029 -14.46056,6.45161 -46.15381,6.23664 -19.99625,-0.13557 -39.34131,-1.68002 -46.75914,-3.73299 z M 389.30629,204.39525 c 2.21058,-1.7787 5.37221,-5.56247 7.02587,-8.40839 2.85919,-4.92064 2.92925,-4.88892 1.42865,0.6468 -2.35986,8.70566 3.12112,7.07992 7.96209,-2.36167 5.92776,-11.56116 14.16001,-36.39237 12.59007,-37.97577 -0.72382,-0.73001 -4.47846,1.71543 -8.34365,5.43431 -8.60654,8.28071 -18.54986,12.26514 -30.60813,12.26514 h -9.13769 l 1.22426,12.85017 c 1.76447,18.52049 8.46652,25.10653 17.85853,17.54941 z"
         id="path402"
         inkscape:connector-curvature="0" />
      <path
         style="fill:#362722;stroke-width:2.57619143"
         d="M 240.04933,506.63984 C 181.15523,490.16792 128.20988,434.37919 78.954357,336.89348 21.349697,222.88325 4.8620167,122.94218 33.812427,63.263066 c 11.90231,-24.53569 40.24354,-39.512 67.163753,-35.49122 54.9392,8.20567 73.75005,50.32883 71.88725,160.977234 -0.43605,25.90135 -0.0665,46.27551 0.82122,45.27592 0.88772,-0.99956 3.03463,-6.47435 4.77092,-12.16618 1.7363,-5.69183 10.9976,-25.70622 20.5807,-44.47643 21.49419,-42.10022 22.98105,-49.21923 14.23685,-68.16547 -6.7161,-14.551844 -8.62762,-34.018164 -4.05517,-41.296254 1.71826,-2.73501 6.91769,-3.8808 17.61052,-3.8808 h 15.17248 l 17.13114,-18.65927 c 17.54608,-19.11121 44.6514,-39.0893002 60.18094,-44.3566202 13.55471,-4.59748 38.4969,-3.55312 50.28059,2.10532 l 10.26095,4.92722 -8.97832,-1.76107 c -36.01146,-7.06353001 -66.28607,3.4132801 -94.97204,32.8659502 -37.05643,38.04682 -60.87374,98.549344 -48.30781,122.715184 2.91958,5.61473 2.90299,5.61928 -2.58096,0.70819 -3.03568,-2.71862 -5.98281,-4.46498 -6.54909,-3.88081 -5.70317,5.88312 -31.25858,73.28298 -38.84993,102.4628 -9.75448,37.49451 -11.48332,87.38768 -4.05473,117.01528 6.92365,27.61373 20.21231,54.77706 35.31727,72.19215 6.50369,7.49836 12.2876,13.16673 12.85311,12.59638 0.5655,-0.57035 -1.93448,-11.97701 -5.55552,-25.34813 -8.05463,-29.74276 -10.72405,-65.26741 -6.45629,-85.92073 l 3.10784,-15.0401 7.71802,12.4529 c 15.72811,25.37698 53.64648,58.42198 71.07094,61.93671 15.49378,3.12528 15.86132,-16.91591 1.02603,-55.95183 -9.82454,-25.85123 -13.29651,-40.72729 -15.0958,-64.67989 -2.11656,-28.17665 2.3632,-46.8923 19.5088,-81.5038 14.50188,-29.27474 15.41011,-36.47354 7.72239,-61.20827 -2.80353,-9.02027 -5.11224,-16.74487 -5.13046,-17.16579 -0.0181,-0.42092 5.39826,3.41734 12.03659,8.52947 20.55579,15.82989 43.53904,25.57749 60.67421,25.73301 13.94338,0.12651 15.53743,-0.48086 22.12174,-8.42959 3.90258,-4.71127 9.52259,-16.35365 12.48891,-25.87195 l 5.39332,-17.306 -0.87367,18.68362 -0.87367,18.68361 7.12723,-5.11849 c 3.91999,-2.81517 10.22657,-11.22279 14.01464,-18.68361 l 6.88737,-13.56513 -1.22597,17.27715 c -0.96492,13.5988 -3.84067,22.91864 -13.50726,43.77505 -14.49797,31.28057 -15.22479,40.3521 -5.1487,64.26408 9.83259,23.33415 16.65707,60.34036 18.39897,99.76976 1.32674,30.03227 0.77184,36.91069 -5.18225,64.24007 -7.79426,35.77574 -8.76946,61.43363 -2.53328,66.6535 11.88276,9.94624 7.38939,25.07696 -9.4672,31.87937 -13.69586,5.52693 -39.00052,5.74984 -53.34921,0.46997 -15.71232,-5.78169 -26.68979,-5.16128 -41.36253,2.33761 -11.55788,5.90698 -15.38864,6.44791 -44.16501,6.23664 -17.33014,-0.12729 -36.70397,-1.68419 -43.05292,-3.45994 z M 392.97354,203.91181 c 0.77792,-2.04459 2.96449,-3.11752 4.85901,-2.38429 4.46708,1.72885 10.17418,-7.24696 16.6174,-26.13486 7.29701,-21.39073 6.77732,-23.92505 -3.17128,-15.46449 -10.70108,9.1005 -22.56179,14.0675 -33.59183,14.0675 h -8.74563 l 1.30607,12.28921 c 0.71831,6.75905 2.34868,14.3266 3.62298,16.81677 2.84387,5.55725 17.0676,6.16048 19.10328,0.81016 z M 383.95178,84.378206 c -13.66251,-6.8666 -24.07651,-19.26367 -21.61558,-25.73165 3.69824,-9.72004 47.66096,-21.76159 60.90652,-16.68252 8.08183,3.09901 8.50673,9.90273 1.57969,25.29373 -5.94791,13.21541 -16.05068,23.94766 -22.54309,23.94766 -2.60885,0 -10.85626,-3.07225 -18.32754,-6.82722 z m -84.50657,-26.4952 c -3.71897,-12.51904 -3.74637,-12.08514 1.07034,-16.9431 5.77778,-5.82725 13.10291,-5.0435 26.41822,2.8266 l 11.6608,6.89219 -9.78715,3.41742 c -5.38297,1.87958 -13.52542,5.74754 -18.09436,8.59547 l -8.30714,5.17805 z"
         id="path404"
         inkscape:connector-curvature="0" />
    </g>
  </g>
</svg>
