<?xml version="1.0" encoding="UTF-8" standalone="no"?>
<!-- Created with Inkscape (http://www.inkscape.org/) -->

<svg
   xmlns:dc="http://purl.org/dc/elements/1.1/"
   xmlns:cc="http://creativecommons.org/ns#"
   xmlns:rdf="http://www.w3.org/1999/02/22-rdf-syntax-ns#"
   xmlns:svg="http://www.w3.org/2000/svg"
   xmlns="http://www.w3.org/2000/svg"
   xmlns:sodipodi="http://sodipodi.sourceforge.net/DTD/sodipodi-0.dtd"
   xmlns:inkscape="http://www.inkscape.org/namespaces/inkscape"
   width="512"
   height="512"
   id="svg5294"
   sodipodi:version="0.32"
   inkscape:version="0.92.4 (unknown)"
   version="1.0"
   sodipodi:docname="vpn.svg"
   inkscape:output_extension="org.inkscape.output.svg.inkscape">
  <defs
     id="defs5296">
    <inkscape:perspective
       sodipodi:type="inkscape:persp3d"
       inkscape:vp_x="0 : 526.18109 : 1"
       inkscape:vp_y="0 : 1000 : 0"
       inkscape:vp_z="744.09448 : 526.18109 : 1"
       inkscape:persp3d-origin="372.04724 : 350.78739 : 1"
       id="perspective5302" />
  </defs>
  <sodipodi:namedview
     id="base"
     pagecolor="#ffffff"
     bordercolor="#666666"
     borderopacity="1.0"
     gridtolerance="10000"
     guidetolerance="10"
     objecttolerance="10"
     inkscape:pageopacity="0.0"
     inkscape:pageshadow="2"
     inkscape:zoom="1.6132812"
     inkscape:cx="256"
     inkscape:cy="256"
     inkscape:document-units="px"
     inkscape:current-layer="layer1"
     showgrid="false"
     inkscape:window-width="1920"
     inkscape:window-height="1032"
     inkscape:window-x="0"
     inkscape:window-y="23"
     inkscape:showpageshadow="false"
     fit-margin-top="0"
     fit-margin-left="0"
     fit-margin-right="0"
     fit-margin-bottom="0"
     inkscape:window-maximized="1" />
  <metadata
     id="metadata5299">
    <rdf:RDF>
      <cc:Work
         rdf:about="">
        <dc:format>image/svg+xml</dc:format>
        <dc:type
           rdf:resource="http://purl.org/dc/dcmitype/StillImage" />
        <dc:title></dc:title>
      </cc:Work>
    </rdf:RDF>
  </metadata>
  <g
     inkscape:label="Layer 1"
     inkscape:groupmode="layer"
     id="layer1"
     transform="translate(8.3348846,254.80931)">
    <circle
       style="opacity:1;fill:none;fill-opacity:1;stroke:none;stroke-width:13.42622757;stroke-linecap:round;stroke-linejoin:round;stroke-miterlimit:4;stroke-dasharray:none;stroke-dashoffset:0;stroke-opacity:1;paint-order:stroke fill markers"
       id="path816"
       cx="247.66512"
       cy="1.1906927"
       r="256" />
    <g
       id="g3739"
       transform="matrix(1.5150928,0,0,1.5150928,53.733226,-192.74119)">
      <g
         transform="matrix(25.903066,0,0,-25.903066,30.552563,5.1886949)"
         id="g5738">
        <path
           id="path5740"
           style="fill:#ffffff;fill-opacity:1;fill-rule:nonzero;stroke:none"
           d="m 0,0 c -0.54,0 -0.979,-0.44 -0.979,-0.981 v -7.522 c 0,-0.54 0.439,-0.979 0.979,-0.979 h 7.521 c 0.542,0 0.982,0.439 0.982,0.979 v 7.522 C 8.503,-0.44 8.063,0 7.521,0 Z"
           inkscape:connector-curvature="0" />
      </g>
      <g
         transform="matrix(25.903066,0,0,-25.903066,225.38258,256)"
         id="g5742">
        <path
           id="path5744"
           style="fill:#231f20;fill-opacity:1;fill-rule:nonzero;stroke:none"
           d="M 0,0 C 0.652,0 1.182,0.527 1.182,1.18 V 8.701 C 1.182,9.354 0.652,9.883 0,9.883 h -7.521 c -0.653,0 -1.18,-0.529 -1.18,-1.182 V 1.18 C -8.701,0.527 -8.174,0 -7.521,0 Z"
           inkscape:connector-curvature="0" />
      </g>
      <g
         transform="matrix(25.903066,0,0,-25.903066,100.92601,162.70793)"
         id="g5746">
        <path
           id="path5748"
           style="fill:#ffffff;fill-opacity:1;fill-rule:nonzero;stroke:none"
           d="m 0,0 v 1.322 c 0,0.537 0.436,0.973 0.975,0.973 0.537,0 0.972,-0.436 0.972,-0.973 V 0 Z"
           inkscape:connector-curvature="0" />
      </g>
      <g
         transform="matrix(25.903066,0,0,-25.903066,127.99223,48.724081)"
         id="g5750">
        <path
           id="path5752"
           style="fill:#ffffff;fill-opacity:1;fill-rule:nonzero;stroke:none"
           d="m 0,0 c 1.414,0 2.561,-1.146 2.561,-2.561 v -3.3 h 0.728 l -0.002,3.3 c 0,1.815 -1.473,3.286 -3.287,3.286 -1.814,0 -3.287,-1.471 -3.287,-3.286 l -0.002,-3.302 0.728,0.002 v 3.3 C -2.561,-1.146 -1.414,0 0,0"
           inkscape:connector-curvature="0" />
      </g>
      <g
         transform="matrix(25.903066,0,0,-25.903066,131.28192,170.04347)"
         id="g5754">
        <path
           id="path5756"
           style="fill:#ffffff;fill-opacity:1;fill-rule:nonzero;stroke:none"
           d="M 0,0 H -0.396 L -0.445,-0.277 H 0.051 Z"
           inkscape:connector-curvature="0" />
      </g>
      <g
         transform="matrix(25.903066,0,0,-25.903066,134.468,188.25602)"
         id="g5758">
        <path
           id="path5760"
           style="fill:#ffffff;fill-opacity:1;fill-rule:nonzero;stroke:none"
           d="M 0,0 H -0.639 L -0.713,-0.416 H 0.07 Z"
           inkscape:connector-curvature="0" />
      </g>
      <g
         transform="matrix(25.903066,0,0,-25.903066,138.77039,213.55316)"
         id="g5762">
        <path
           id="path5764"
           style="fill:#ffffff;fill-opacity:1;fill-rule:nonzero;stroke:none"
           d="M 0,0 H -0.975 L -1.068,-0.557 H 0.098 Z"
           inkscape:connector-curvature="0" />
      </g>
    </g>
  </g>
</svg>
