<?xml version="1.0" encoding="UTF-8" standalone="no"?>
<svg
   xmlns:dc="http://purl.org/dc/elements/1.1/"
   xmlns:cc="http://creativecommons.org/ns#"
   xmlns:rdf="http://www.w3.org/1999/02/22-rdf-syntax-ns#"
   xmlns:svg="http://www.w3.org/2000/svg"
   xmlns="http://www.w3.org/2000/svg"
   xmlns:sodipodi="http://sodipodi.sourceforge.net/DTD/sodipodi-0.dtd"
   xmlns:inkscape="http://www.inkscape.org/namespaces/inkscape"
   inkscape:version="1.0 (1.0+r73+1)"
   sodipodi:docname="cloud-oracle.svg"
   viewBox="0 0 512 300"
   height="300"
   width="512"
   id="svg2"
   version="1.1">
  <metadata
     id="metadata8">
    <rdf:RDF>
      <cc:Work
         rdf:about="">
        <dc:format>image/svg+xml</dc:format>
        <dc:type
           rdf:resource="http://purl.org/dc/dcmitype/StillImage" />
        <dc:title />
      </cc:Work>
    </rdf:RDF>
  </metadata>
  <defs
     id="defs6" />
  <sodipodi:namedview
     inkscape:current-layer="g10"
     inkscape:window-maximized="1"
     inkscape:window-y="24"
     inkscape:window-x="0"
     inkscape:cy="150"
     inkscape:cx="256"
     inkscape:zoom="2.7966667"
     showborder="true"
     showgrid="false"
     id="namedview4"
     inkscape:window-height="1033"
     inkscape:window-width="1920"
     inkscape:pageshadow="2"
     inkscape:pageopacity="0"
     guidetolerance="10"
     gridtolerance="10"
     objecttolerance="10"
     borderopacity="1"
     bordercolor="#666666"
     pagecolor="#ffffff"
     inkscape:document-rotation="0"
     fit-margin-top="0"
     fit-margin-left="0"
     fit-margin-right="0"
     fit-margin-bottom="0"
     inkscape:showpageshadow="false" />
  <g
     id="g10"
     inkscape:label="Image"
     inkscape:groupmode="layer"
     transform="translate(750.94713,-132.09993)">
    <g
       id="g224"
       transform="matrix(1,0,0,1.0020068,0,-0.26510075)"
       style="stroke-width:0.998998">
      <path
         id="path215"
         d="m -658.07813,430.33505 c -47.98781,-8.4117 -84.70097,-46.22298 -91.88999,-94.63855 -1.84359,-12.41584 -1.01527,-30.79626 1.91128,-42.4112 4.92256,-19.5368 14.59173,-37.05706 28.21235,-51.11992 20.92908,-21.60861 46.51439,-33.1754 76.59077,-34.62568 l 8.39613,-0.40486 1.48466,-4.13971 c 7.97978,-22.25016 25.74484,-43.49897 46.63837,-55.78423 25.00839,-14.70479 55.07428,-18.88109 83.74687,-11.63287 28.08823,7.10052 53.68939,26.85024 67.69538,52.22284 l 2.6147,4.73666 8.47242,0.0121 c 22.70341,0.0315 42.94758,6.27836 62.31403,19.22842 8.32361,5.56591 18.79543,15.44223 24.97041,23.55047 l 4.61823,6.06408 3.92551,0.0121 c 2.15901,0.006 6.96285,0.42634 10.67517,0.93206 30.10301,4.10087 55.0903,21.96365 68.76272,49.15675 15.2235,30.278 12.86351,70.74072 -5.79485,99.35567 -12.84135,19.69379 -30.76382,32.52934 -54.06242,38.71792 l -6.65556,1.76783 -167.77755,0.11973 c -163.10882,0.11631 -167.97431,0.0852 -174.84863,-1.11974 z"
         style="fill:#ffffff;fill-opacity:1;stroke-width:0.998998" />
      <path
         style="fill:#e32124;fill-opacity:1;stroke-width:0.998998"
         d="m -658.07813,430.33505 c -47.98781,-8.4117 -84.70097,-46.22298 -91.88999,-94.63855 -1.84359,-12.41584 -1.01527,-30.79626 1.91128,-42.4112 4.92256,-19.5368 14.59173,-37.05706 28.21235,-51.11992 20.92908,-21.60861 46.51439,-33.1754 76.59077,-34.62568 l 8.39613,-0.40486 1.48466,-4.13971 c 7.97978,-22.25016 25.74484,-43.49897 46.63837,-55.78423 25.00839,-14.70479 55.07428,-18.88109 83.74687,-11.63287 28.08823,7.10052 53.68939,26.85024 67.69538,52.22284 l 2.6147,4.73666 8.47242,0.0121 c 22.70341,0.0315 42.94758,6.27836 62.31403,19.22842 8.32361,5.56591 18.79543,15.44223 24.97041,23.55047 l 4.61823,6.06408 3.92551,0.0121 c 2.15901,0.006 6.96285,0.42634 10.67517,0.93206 30.10301,4.10087 55.0903,21.96365 68.76272,49.15675 15.2235,30.278 12.86351,70.74072 -5.79485,99.35567 -12.84135,19.69379 -30.76382,32.52934 -54.06242,38.71792 l -6.65556,1.76783 -167.77755,0.11973 c -163.10882,0.11631 -167.97431,0.0852 -174.84863,-1.11974 z m 334.53871,-19.90502 c 31.85791,-3.26923 55.68686,-26.09465 62.15688,-59.53924 1.49511,-7.72845 1.52713,-22.46598 0.0647,-29.81581 -5.65755,-28.43486 -24.51543,-48.99916 -51.70602,-56.3848 -5.81247,-1.57882 -7.23142,-1.70616 -18.86864,-1.69339 l -12.58352,0.0141 -2.6385,-4.60291 c -8.4625,-14.76292 -22.21164,-27.74605 -37.44129,-35.3553 -6.5924,-3.2938 -11.90051,-5.22553 -19.89926,-7.2418 -6.19392,-1.5613 -7.8582,-1.70788 -19.31312,-1.70105 -11.02143,0.006 -13.1949,0.18501 -17.99912,1.47707 -7.18709,1.93304 -15.98559,6.15128 -21.38429,10.25221 l -4.34938,3.30386 -9.47137,-4.27099 c -5.20924,-2.34905 -9.69665,-4.46099 -9.972,-4.6932 -0.4822,-0.40664 5.45978,-5.94971 10.78586,-10.06173 4.22885,-3.26491 11.23296,-7.3658 16.90045,-9.89522 l 5.32959,-2.37857 -4.00467,-5.98706 c -2.26045,-3.37942 -6.82154,-8.80796 -10.47219,-12.46385 -12.40487,-12.42267 -26.56623,-20.21816 -43.98956,-24.21523 -7.9268,-1.81848 -23.53427,-2.30062 -31.58939,-0.97585 -26.07759,4.28881 -48.26921,19.00299 -62.18108,41.22926 -3.67857,5.87706 -7.83004,15.99351 -10.40948,25.36619 -2.62,9.52007 -1.37708,22.06689 0.70283,35.58495 0.50496,3.28195 0.89254,4.6256 1.08756,5.87647 l -21.92962,-8.09737 c -1.37302,-3.6339 -2.4008,-11.50379 -2.4008,-18.3836 v -7.43078 l -5.58947,0.42965 c -21.84477,1.67912 -41.2096,10.31603 -56.90371,25.37963 -11.43957,10.97994 -19.15862,23.20268 -23.84289,37.75388 -3.53424,10.97874 -4.52246,18.3893 -4.13657,31.0195 0.27897,9.13008 0.61037,11.80008 2.24769,18.10881 4.62876,17.83502 11.78,30.39391 24.5315,43.08187 6.79788,6.76401 15.25781,13.01125 22.72232,16.77934 9.46427,4.77754 22.19174,8.51164 32.29298,9.47437 8.65589,0.825 316.24272,0.87894 324.2535,0.0568 z"
         id="path14"
         sodipodi:nodetypes="csssscssssccssccsssscscccscsccssscsscsssscsssssssccscsssssssscc" />
      <path
         sodipodi:nodetypes="ccccccccssscccccsccccscccccssscscsssscscssssccccssscccccscccscsccccccccccsccccccc"
         style="clip-rule:evenodd;fill:#e32124;fill-opacity:1;fill-rule:nonzero;stroke-width:168.089;image-rendering:optimizeQuality;shape-rendering:geometricPrecision;text-rendering:geometricPrecision"
         d="m -335.79297,353.13504 c -7.40253,0 -13.59057,-4.97357 -15.49903,-11.73993 h 40.94518 l 5.66755,-8.79049 h -46.67056 c 1.94563,-6.95684 8.27527,-11.77493 15.49903,-11.79776 h 28.22209 l 5.60972,-8.7905 h -34.46797 c -13.82189,0 -24.9835,11.16162 -24.9835,24.92568 0,13.76405 11.16161,24.92566 24.9835,24.92566 h 29.61007 l 5.60973,-8.79049 h -34.58364 z m -117.3415,8.7905 c -13.76402,-0.002 -24.92041,-11.16165 -24.92041,-24.92568 0,-13.76402 11.15639,-24.92277 24.92041,-24.92567 h 34.46799 l -5.66755,8.7905 h -28.22211 c -8.743,0.23411 -15.7089,7.38905 -15.7089,16.13517 0,8.74613 6.9659,15.90107 15.7089,16.13518 h 34.58364 l -5.66755,8.7905 h -29.61008 z m -182.17135,-8.7905 c 8.90615,0 16.19301,-7.22902 16.19301,-16.13518 0,-8.90615 -7.22903,-16.13517 -16.19301,-16.13517 h -27.70162 c -8.74299,0.23411 -15.7089,7.38905 -15.7089,16.13517 0,8.74613 6.96591,15.90107 15.7089,16.13518 z m -28.33777,8.7905 c -13.82189,0 -24.9835,-11.16162 -24.9835,-24.92568 0,-13.76405 11.16161,-24.92567 24.9835,-24.92567 h 28.97393 c 13.76402,0.002 24.92042,11.16165 24.92042,24.92567 0,13.76403 -11.1564,24.92277 -24.92042,24.92568 z m 100.97498,-16.13518 c 9.36881,0 16.887,-7.57603 16.887,-16.887 0,-9.31099 -7.51819,-16.887 -16.887,-16.887 h -41.98616 v 49.90918 h 9.60015 v -41.11868 h 31.74986 c 4.39524,0 8.03868,3.64342 8.03868,8.0965 0,4.45307 -3.64344,8.03868 -8.03868,8.03868 h -27.06546 l 28.56909,24.9835 h 13.93756 l -19.25811,-16.13518 h 4.33741 z m 158.6915,7.34468 v -41.06085 h -9.54231 v 45.10911 c 0,1.2723 0.46265,2.42895 1.38797,3.35427 0.92532,0.86748 2.19762,1.4458 3.52776,1.4458 h 43.77897 l 5.66755,-8.7905 h -44.76211 z m -117.39932,-8.79049 h 25.61965 l -13.53272,-21.80273 -24.86785,39.44155 h -11.27727 l 30.18839,-47.30672 c 1.33016,-1.90847 3.52777,-3.06511 5.95673,-3.06511 2.31328,0 4.5109,1.09881 5.84104,2.94945 l 30.30406,47.42238 h -11.3351 l -5.32056,-8.7905 h -25.90882 l -5.66755,-8.79049 z"
         fill="#fefefe"
         id="path191" />
    </g>
  </g>
</svg>
