<?xml version="1.0" encoding="UTF-8" standalone="no"?>
<svg
   xmlns:dc="http://purl.org/dc/elements/1.1/"
   xmlns:cc="http://creativecommons.org/ns#"
   xmlns:rdf="http://www.w3.org/1999/02/22-rdf-syntax-ns#"
   xmlns:svg="http://www.w3.org/2000/svg"
   xmlns="http://www.w3.org/2000/svg"
   xmlns:sodipodi="http://sodipodi.sourceforge.net/DTD/sodipodi-0.dtd"
   xmlns:inkscape="http://www.inkscape.org/namespaces/inkscape"
   width="511.99997"
   height="464.15421"
   fill="none"
   version="1.1"
   id="svg16"
   sodipodi:docname="atom.svg"
   inkscape:version="1.0 (1.0+r73+1)">
  <metadata
     id="metadata22">
    <rdf:RDF>
      <cc:Work
         rdf:about="">
        <dc:format>image/svg+xml</dc:format>
        <dc:type
           rdf:resource="http://purl.org/dc/dcmitype/StillImage" />
        <dc:title></dc:title>
      </cc:Work>
    </rdf:RDF>
  </metadata>
  <defs
     id="defs20" />
  <sodipodi:namedview
     inkscape:document-rotation="0"
     pagecolor="#ffffff"
     bordercolor="#666666"
     borderopacity="1"
     objecttolerance="10"
     gridtolerance="10"
     guidetolerance="10"
     inkscape:pageopacity="0"
     inkscape:pageshadow="2"
     inkscape:window-width="1920"
     inkscape:window-height="1033"
     id="namedview18"
     showgrid="false"
     inkscape:showpageshadow="false"
     fit-margin-top="0"
     fit-margin-left="0"
     fit-margin-right="0"
     fit-margin-bottom="0"
     inkscape:zoom="1.7688087"
     inkscape:cx="255.99998"
     inkscape:cy="232.0771"
     inkscape:window-x="0"
     inkscape:window-y="24"
     inkscape:window-maximized="1"
     inkscape:current-layer="svg16" />
  <g
     transform="matrix(10.951846,0,0,10.951846,-8.8543279,-8.8388298)"
     id="g28">
    <path
       id="path6"
       stroke-linecap="round"
       stroke-width="2.383"
       stroke="#66595c"
       d="M 37.428,11.242 C 38.171,7.47 37.756,4.608 36.001,3.471 35.416,3.091 34.715,2.926 33.925,2.956 29.663,3.117 22.787,8.974 17.168,17.61 10.509,27.845 8.143,38.102 11.886,40.528 c 1.777,1.152 4.609,0.336 7.808,-1.94" />
    <path
       id="path8"
       stroke-linecap="round"
       stroke-width="2.383"
       stroke="#66595c"
       d="m 41.14,28.19 c 3.172,-1.238 5.121,-2.933 5.223,-4.88 0.234,-4.502 -9.5,-8.67 -21.75,-9.316 A 60.367,60.367 0 0 0 21.231,13.905 C 10.552,13.941 2.217,16.89 2.004,20.97 c -0.101,1.943 1.657,3.827 4.672,5.39" />
    <path
       id="path10"
       stroke-linecap="round"
       stroke-width="2.383"
       stroke="#66595c"
       d="M 20.916,4.637 C 18.746,2.849 16.712,1.889 15.077,2.01 a 3.17,3.17 0 0 0 -1.212,0.329 c -3.99,2.02 -2.715,12.464 2.854,23.32 5.569,10.857 13.317,18.02 17.307,16 3.838,-1.942 2.802,-11.675 -2.236,-22.073" />
    <path
       id="path12"
       fill="#66595c"
       d="m 26.807,22.238 a 2.622,2.622 0 0 1 -2.624,2.62 2.621,2.621 0 0 1 -2.623,-2.62 2.621,2.621 0 0 1 2.623,-2.619 2.622,2.622 0 0 1 2.624,2.62 z" />
  </g>
</svg>
