<?xml version="1.0" encoding="UTF-8" standalone="no"?>
<svg
   xmlns:dc="http://purl.org/dc/elements/1.1/"
   xmlns:cc="http://creativecommons.org/ns#"
   xmlns:rdf="http://www.w3.org/1999/02/22-rdf-syntax-ns#"
   xmlns:svg="http://www.w3.org/2000/svg"
   xmlns="http://www.w3.org/2000/svg"
   xmlns:sodipodi="http://sodipodi.sourceforge.net/DTD/sodipodi-0.dtd"
   xmlns:inkscape="http://www.inkscape.org/namespaces/inkscape"
   inkscape:version="1.0 (1.0+r73+1)"
   height="512"
   width="493.06253"
   sodipodi:docname="spring-batch.svg"
   version="1.1"
   viewBox="0 0 493.06251 511.99999"
   data-name="Layer 1"
   id="Layer_1">
  <metadata
     id="metadata13">
    <rdf:RDF>
      <cc:Work
         rdf:about="">
        <dc:format>image/svg+xml</dc:format>
        <dc:type
           rdf:resource="http://purl.org/dc/dcmitype/StillImage" />
        <dc:title>logo-batch</dc:title>
      </cc:Work>
    </rdf:RDF>
  </metadata>
  <sodipodi:namedview
     inkscape:current-layer="Layer_1"
     inkscape:window-maximized="1"
     inkscape:window-y="24"
     inkscape:window-x="0"
     inkscape:cy="256"
     inkscape:cx="246.53127"
     inkscape:zoom="1.6386719"
     fit-margin-bottom="0"
     fit-margin-right="0"
     fit-margin-left="0"
     fit-margin-top="0"
     inkscape:showpageshadow="false"
     showgrid="false"
     id="namedview11"
     inkscape:window-height="1033"
     inkscape:window-width="1920"
     inkscape:pageshadow="2"
     inkscape:pageopacity="0"
     guidetolerance="10"
     gridtolerance="10"
     objecttolerance="10"
     borderopacity="1"
     bordercolor="#666666"
     pagecolor="#ffffff" />
  <defs
     id="defs4">
    <style
       id="style2">.cls-1{fill:#6db33f;}</style>
  </defs>
  <title
     id="title6">logo-batch</title>
  <path
     style="stroke-width:3.27638"
     id="path8"
     d="m 0,331.86459 v 37.90773 L 246.51488,512 493.06252,369.77232 V 331.86459 L 246.51488,474.09228 Z m 0,-75.84821 v 37.90773 L 246.51488,436.15179 493.06252,293.92411 V 256.01638 L 246.51488,398.24406 Z M 246.51488,0 0,142.22768 v 75.84821 L 246.51488,360.40187 493.06252,218.17419 v -75.94651 z"
     class="cls-1" />
</svg>
