<?xml version="1.0" encoding="UTF-8" standalone="no"?>
<!-- Generator: Adobe Illustrator 19.0.0, SVG Export Plug-In . SVG Version: 6.00 Build 0)  -->

<svg
   xmlns:dc="http://purl.org/dc/elements/1.1/"
   xmlns:cc="http://creativecommons.org/ns#"
   xmlns:rdf="http://www.w3.org/1999/02/22-rdf-syntax-ns#"
   xmlns:svg="http://www.w3.org/2000/svg"
   xmlns="http://www.w3.org/2000/svg"
   xmlns:sodipodi="http://sodipodi.sourceforge.net/DTD/sodipodi-0.dtd"
   xmlns:inkscape="http://www.inkscape.org/namespaces/inkscape"
   version="1.1"
   id="Capa_1"
   x="0px"
   y="0px"
   viewBox="0 0 581.10291 512.00001"
   xml:space="preserve"
   sodipodi:docname="ms-tasks.svg"
   width="581.10291"
   height="512"
   inkscape:version="0.92.4 (unknown)"><metadata
   id="metadata47"><rdf:RDF><cc:Work
       rdf:about=""><dc:format>image/svg+xml</dc:format><dc:type
         rdf:resource="http://purl.org/dc/dcmitype/StillImage" /><dc:title></dc:title></cc:Work></rdf:RDF></metadata><defs
   id="defs45" /><sodipodi:namedview
   pagecolor="#ffffff"
   bordercolor="#666666"
   borderopacity="1"
   objecttolerance="10"
   gridtolerance="10"
   guidetolerance="10"
   inkscape:pageopacity="0"
   inkscape:pageshadow="2"
   inkscape:window-width="1600"
   inkscape:window-height="851"
   id="namedview43"
   showgrid="false"
   inkscape:showpageshadow="false"
   fit-margin-top="0"
   fit-margin-left="0"
   fit-margin-right="0"
   fit-margin-bottom="0"
   inkscape:zoom="1.2597656"
   inkscape:cx="290.55146"
   inkscape:cy="256"
   inkscape:window-x="0"
   inkscape:window-y="24"
   inkscape:window-maximized="1"
   inkscape:current-layer="Capa_1" />


<g
   id="g858"
   style="fill:#2896ff;fill-opacity:1"
   transform="matrix(1.9605891,0,0,1.9605891,-211.35935,-245.91081)"><polygon
     style="fill:#2896ff;fill-opacity:1"
     points="339.265,276.333 339.265,356.888 137.489,356.888 137.489,155.112 323.501,155.112 348.161,125.427 107.804,125.427 107.804,386.573 368.95,386.573 368.95,240.727 "
     id="polygon6" /><polygon
     style="fill:#2896ff;fill-opacity:1"
     points="152.318,233.53 256.618,337.83 299.578,288.564 404.196,159.086 370.795,132.41 253.555,273.547 182.147,203.701 "
     id="polygon8" /></g>
<g
   id="g12"
   transform="translate(-107.804,125.427)">
</g>
<g
   id="g14"
   transform="translate(-107.804,125.427)">
</g>
<g
   id="g16"
   transform="translate(-107.804,125.427)">
</g>
<g
   id="g18"
   transform="translate(-107.804,125.427)">
</g>
<g
   id="g20"
   transform="translate(-107.804,125.427)">
</g>
<g
   id="g22"
   transform="translate(-107.804,125.427)">
</g>
<g
   id="g24"
   transform="translate(-107.804,125.427)">
</g>
<g
   id="g26"
   transform="translate(-107.804,125.427)">
</g>
<g
   id="g28"
   transform="translate(-107.804,125.427)">
</g>
<g
   id="g30"
   transform="translate(-107.804,125.427)">
</g>
<g
   id="g32"
   transform="translate(-107.804,125.427)">
</g>
<g
   id="g34"
   transform="translate(-107.804,125.427)">
</g>
<g
   id="g36"
   transform="translate(-107.804,125.427)">
</g>
<g
   id="g38"
   transform="translate(-107.804,125.427)">
</g>
<g
   id="g40"
   transform="translate(-107.804,125.427)">
</g>
</svg>