<?xml version="1.0" encoding="UTF-8" standalone="no"?>
<svg
   xmlns:dc="http://purl.org/dc/elements/1.1/"
   xmlns:cc="http://creativecommons.org/ns#"
   xmlns:rdf="http://www.w3.org/1999/02/22-rdf-syntax-ns#"
   xmlns:svg="http://www.w3.org/2000/svg"
   xmlns="http://www.w3.org/2000/svg"
   xmlns:sodipodi="http://sodipodi.sourceforge.net/DTD/sodipodi-0.dtd"
   xmlns:inkscape="http://www.inkscape.org/namespaces/inkscape"
   viewBox="-0.12979373 0 7.5202081 6.6064516"
   width="585.14288"
   height="512"
   version="1.1"
   id="svg28"
   sodipodi:docname="ms-excel.svg"
   inkscape:version="0.92.4 (unknown)">
  <metadata
     id="metadata34">
    <rdf:RDF>
      <cc:Work
         rdf:about="">
        <dc:format>image/svg+xml</dc:format>
        <dc:type
           rdf:resource="http://purl.org/dc/dcmitype/StillImage" />
        <dc:title></dc:title>
      </cc:Work>
    </rdf:RDF>
  </metadata>
  <defs
     id="defs32" />
  <sodipodi:namedview
     pagecolor="#ffffff"
     bordercolor="#666666"
     borderopacity="1"
     objecttolerance="10"
     gridtolerance="10"
     guidetolerance="10"
     inkscape:pageopacity="0"
     inkscape:pageshadow="2"
     inkscape:window-width="1600"
     inkscape:window-height="851"
     id="namedview30"
     showgrid="false"
     inkscape:showpageshadow="false"
     fit-margin-top="0"
     fit-margin-left="0"
     fit-margin-right="0"
     fit-margin-bottom="0"
     inkscape:zoom="1.2597656"
     inkscape:cx="296.37856"
     inkscape:cy="256"
     inkscape:window-x="0"
     inkscape:window-y="24"
     inkscape:window-maximized="1"
     inkscape:current-layer="svg28" />
  <g
     id="g59"
     transform="matrix(0.2359447,0,0,0.2359447,-0.14480505,-0.4718894)">
    <path
       d="M 20,2 H 9.333 A 1.333,1.333 0 0 0 8,3.333 V 9 l 12,7 6,2.532 L 32,16 V 9 Z"
       id="path2"
       inkscape:connector-curvature="0"
       style="fill:#21a366" />
    <path
       d="m 8,9 h 12 v 7 H 8 Z"
       id="path4"
       inkscape:connector-curvature="0"
       style="fill:#107c41" />
    <path
       d="M 30.667,2 H 20 V 9 H 32 V 3.333 A 1.333,1.333 0 0 0 30.667,2 Z"
       id="path6"
       inkscape:connector-curvature="0"
       style="fill:#33c481" />
    <path
       d="M 20,16 H 8 V 28.667 A 1.333,1.333 0 0 0 9.333,30 H 30.667 A 1.333,1.333 0 0 0 32,28.667 V 23 Z"
       id="path8"
       inkscape:connector-curvature="0"
       style="fill:#185c37" />
    <path
       d="m 20,16 h 12 v 7 H 20 Z"
       id="path10"
       inkscape:connector-curvature="0"
       style="fill:#107c41" />
    <path
       d="M 16.667,7 H 8 v 19 h 8.667 A 1.337,1.337 0 0 0 18,24.667 V 8.333 A 1.337,1.337 0 0 0 16.667,7 Z"
       id="path12"
       inkscape:connector-curvature="0"
       style="opacity:0.1" />
    <path
       d="M 15.667,8 H 8 v 19 h 7.667 A 1.337,1.337 0 0 0 17,25.667 V 9.333 A 1.337,1.337 0 0 0 15.667,8 Z"
       id="path14"
       inkscape:connector-curvature="0"
       style="opacity:0.2" />
    <path
       d="M 15.667,8 H 8 v 17 h 7.667 A 1.337,1.337 0 0 0 17,23.667 V 9.333 A 1.337,1.337 0 0 0 15.667,8 Z"
       id="path16"
       inkscape:connector-curvature="0"
       style="opacity:0.2" />
    <path
       d="M 14.667,8 H 8 v 17 h 6.667 A 1.337,1.337 0 0 0 16,23.667 V 9.333 A 1.337,1.337 0 0 0 14.667,8 Z"
       id="path18"
       inkscape:connector-curvature="0"
       style="opacity:0.2" />
    <path
       data-name="Back Plate"
       d="M 1.333,8 H 14.667 A 1.333,1.333 0 0 1 16,9.333 V 22.667 A 1.333,1.333 0 0 1 14.667,24 H 1.333 A 1.333,1.333 0 0 1 0,22.667 V 9.333 A 1.333,1.333 0 0 1 1.333,8 Z"
       id="path20"
       inkscape:connector-curvature="0"
       style="fill:#107c41" />
    <path
       d="M 3.533,21 6.769,15.986 3.805,11 H 6.19 l 1.618,3.187 q 0.223,0.453 0.307,0.676 h 0.021 q 0.16,-0.362 0.335,-0.704 L 10.2,11 h 2.189 L 9.349,15.958 12.466,21 h -2.33 L 8.267,17.5 A 2.922,2.922 0 0 1 8.044,17.032 H 8.016 A 2.207,2.207 0 0 1 7.8,17.485 L 5.877,21 Z"
       id="path22"
       inkscape:connector-curvature="0"
       style="fill:#ffffff" />
  </g>
</svg>
