<?xml version="1.0" encoding="UTF-8" standalone="no"?>
<svg
   xmlns:dc="http://purl.org/dc/elements/1.1/"
   xmlns:cc="http://creativecommons.org/ns#"
   xmlns:rdf="http://www.w3.org/1999/02/22-rdf-syntax-ns#"
   xmlns:svg="http://www.w3.org/2000/svg"
   xmlns="http://www.w3.org/2000/svg"
   xmlns:sodipodi="http://sodipodi.sourceforge.net/DTD/sodipodi-0.dtd"
   xmlns:inkscape="http://www.inkscape.org/namespaces/inkscape"
   inkscape:version="1.0 (1.0+r73+1)"
   height="130.75375"
   width="512"
   sodipodi:docname="moodle-2.svg"
   version="1.1"
   viewBox="0 0 512 130.75375"
   data-name="Layer 1"
   id="Layer_1">
  <metadata
     id="metadata31">
    <rdf:RDF>
      <cc:Work
         rdf:about="">
        <dc:format>image/svg+xml</dc:format>
        <dc:type
           rdf:resource="http://purl.org/dc/dcmitype/StillImage" />
        <dc:title>Moodle_Logo_UseonBlack_RGB</dc:title>
      </cc:Work>
    </rdf:RDF>
  </metadata>
  <sodipodi:namedview
     inkscape:current-layer="Layer_1"
     inkscape:window-maximized="1"
     inkscape:window-y="24"
     inkscape:window-x="0"
     inkscape:cy="65.376877"
     inkscape:cx="256"
     inkscape:zoom="3.5566406"
     fit-margin-bottom="0"
     fit-margin-right="0"
     fit-margin-left="0"
     fit-margin-top="0"
     inkscape:showpageshadow="false"
     showgrid="false"
     id="namedview29"
     inkscape:window-height="1033"
     inkscape:window-width="1920"
     inkscape:pageshadow="2"
     inkscape:pageopacity="0"
     guidetolerance="10"
     gridtolerance="10"
     objecttolerance="10"
     borderopacity="1"
     bordercolor="#666666"
     pagecolor="#ffffff" />
  <defs
     id="defs4">
    <style
       id="style2">.cls-1{fill:#f48020;}.cls-2,.cls-3{fill:#383738;stroke:#4a4a4c;}.cls-2{stroke-width:2.37px;}.cls-3{stroke-width:2.38px;}.cls-4{fill:#585858;}</style>
  </defs>
  <title
     id="title6">Moodle_Logo_UseonBlack_RGB</title>
  <g
     transform="scale(0.4158173)"
     id="g59">
    <g
       id="g45">
      <path
         id="path8"
         d="m 1086.3,235.34 a 53.42,53.42 0 0 0 16.71,29 q 13.26,12.27 29.48,12.27 11.29,0 24.56,-5.89 16.23,-6.88 16.22,-16.22 l 58,-0.49 q -12.29,29 -41.76,45.2 -27.52,15.23 -60.43,15.24 -42.25,0 -70,-26.29 -27.75,-26.29 -27.75,-68.54 0,-43.73 27.75,-69.51 27.75,-25.78 72,-25.8 48.15,0 75.17,31.94 25.07,29.47 25.06,79.1 z m 89.91,-33.91 q -3.43,-17.69 -14.73,-29 -12.8,-12.28 -29.49,-12.29 -17.21,0 -28.74,11.79 -11.53,11.79 -15.47,29.48 z"
         class="cls-1" />
      <path
         id="path10"
         d="M 965.45,308.54 V 0 h 55 v 308.54 z"
         class="cls-1" />
      <path
         id="path12"
         d="m 892.69,308.54 v -18.18 q -7.38,9.83 -25.06,15.72 a 92.31,92.31 0 0 1 -30,5.41 q -39.31,0 -63.13,-27 -23.82,-27 -23.8,-66.84 0,-39.3 23.34,-65.84 23.34,-26.54 62.15,-26.53 43.71,0 56.5,23.58 V 0 h 53.55 v 308.54 z m 0,-102.68 q 0,-14.75 -14,-28.26 -14,-13.51 -28.74,-13.51 -21.12,0 -33.41,17.2 -10.8,15.24 -10.8,37.33 0,21.63 10.8,36.85 12.29,17.71 33.41,17.69 12.78,0 27.76,-12 14.98,-12 15,-24.81 z"
         class="cls-1" />
      <path
         id="path14"
         d="m 647,313.45 q -41.77,0 -69,-26.53 -27.23,-26.53 -27.27,-68.3 0,-41.73 27.27,-68.28 27.27,-26.55 69,-26.53 41.75,0 69.27,26.53 27.52,26.53 27.52,68.28 0,41.79 -27.52,68.3 -27.52,26.51 -69.27,26.53 z M 647,168 q -19.89,0 -30.58,15.07 -10.69,15.07 -10.68,35.79 0,20.73 9.94,35.05 11.43,16.31 31.32,16.28 19.89,-0.03 31.32,-16.28 10.44,-14.31 10.44,-35.05 0,-20.74 -9.94,-35 Q 667.42,168 647,168 Z"
         class="cls-1" />
      <path
         id="path16"
         d="m 448.07,313.45 q -41.76,0 -69,-26.53 -27.24,-26.53 -27.27,-68.3 0,-41.73 27.27,-68.28 27.27,-26.55 69,-26.53 41.74,0 69.28,26.53 27.54,26.53 27.5,68.28 0,41.79 -27.5,68.3 -27.5,26.51 -69.28,26.53 z m 0,-145.43 q -19.89,0 -30.59,15.07 -10.7,15.07 -10.69,35.79 0,20.73 9.94,35.05 11.43,16.31 31.34,16.28 19.91,-0.03 31.32,-16.28 10.42,-14.31 10.44,-35.05 0.02,-20.74 -9.94,-35 Q 468.45,168 448.07,168 Z"
         class="cls-1" />
      <path
         id="path18"
         d="M 288.89,309.11 V 201 q 0,-33.9 -28,-33.9 -28,0 -28,33.9 v 108.11 h -55 V 201 q 0,-33.9 -27.52,-33.9 -28,0 -28,33.9 v 108.11 h -55 V 194.65 q 0,-35.37 24.56,-53.54 21.61,-16.22 58.46,-16.22 37.35,0 55,19.16 15.23,-19.16 55.51,-19.16 36.86,0 58.45,16.22 24.57,18.16 24.57,53.54 v 114.46 z"
         class="cls-1" />
    </g>
    <g
       id="g37">
      <path
         id="path20"
         d="M 0.76,145.76"
         class="cls-2" />
      <path
         id="path22"
         d="M 1.73,145.32"
         class="cls-3" />
      <path
         id="path24"
         d="m 173.86,116.85 55.08,-40.1 -0.7,-2.44 C 135,83.92 80.42,96.44 0,144.13 l 0.73,2.38 21,-0.67 c 15.17,0.52 30.85,1.26 46,1.32 -1,24.09 0.83,32.65 0.83,32.65 51.92,17.58 101.22,1.53 127.14,-43.9 a 248.72,248.72 0 0 0 -21.84,-19.06 z"
         class="cls-4" />
      <path
         id="path26"
         d="m 113.78,110 c -0.3,-1.08 -2.23,-1.48 -4.28,-0.9 a 4.73,4.73 0 0 0 -3.14,2.19 c -18.53,5 -49.16,13.72 -70.73,21 l -1.33,0.45 c -16.68,5.61 -24.73,8.49 -25.22,12.55 -2.29,18.44 -0.87,42.18 -0.86,42.48 l 0.19,6.4 c -9.74,27.56 0.06,49.6 8.38,69.77 0.06,-24.92 1.07,-45.22 -6,-71 -0.2,-3.82 -1.49,-30.36 0.61,-47.34 0.34,-2.75 11.65,-6.56 23.63,-10.59 l 1.33,-0.44 c 22,-7.42 53.57,-16.39 71.9,-21.29 a 6.75,6.75 0 0 0 2.29,-0.25 c 2.09,-0.6 3.53,-1.94 3.23,-3.03 z"
         class="cls-4" />
    </g>
  </g>
</svg>
