<?xml version="1.0" encoding="UTF-8" standalone="no"?>
<svg
   xmlns:dc="http://purl.org/dc/elements/1.1/"
   xmlns:cc="http://creativecommons.org/ns#"
   xmlns:rdf="http://www.w3.org/1999/02/22-rdf-syntax-ns#"
   xmlns:svg="http://www.w3.org/2000/svg"
   xmlns="http://www.w3.org/2000/svg"
   xmlns:sodipodi="http://sodipodi.sourceforge.net/DTD/sodipodi-0.dtd"
   xmlns:inkscape="http://www.inkscape.org/namespaces/inkscape"
   width="510.01669"
   height="512"
   viewBox="0 0 55.892241 56.1152"
   preserveAspectRatio="xMinYMin meet"
   version="1.1"
   id="svg30"
   sodipodi:docname="chef.svg"
   inkscape:version="0.92.4 (unknown)">
  <metadata
     id="metadata36">
    <rdf:RDF>
      <cc:Work
         rdf:about="">
        <dc:format>image/svg+xml</dc:format>
        <dc:type
           rdf:resource="http://purl.org/dc/dcmitype/StillImage" />
        <dc:title></dc:title>
      </cc:Work>
    </rdf:RDF>
  </metadata>
  <defs
     id="defs34" />
  <sodipodi:namedview
     pagecolor="#ffffff"
     bordercolor="#666666"
     borderopacity="1"
     objecttolerance="10"
     gridtolerance="10"
     guidetolerance="10"
     inkscape:pageopacity="0"
     inkscape:pageshadow="2"
     inkscape:window-width="1600"
     inkscape:window-height="851"
     id="namedview32"
     showgrid="false"
     inkscape:showpageshadow="false"
     fit-margin-top="0"
     fit-margin-left="0"
     fit-margin-right="0"
     fit-margin-bottom="0"
     inkscape:zoom="1.2597656"
     inkscape:cx="255.00835"
     inkscape:cy="256"
     inkscape:window-x="0"
     inkscape:window-y="24"
     inkscape:window-maximized="1"
     inkscape:current-layer="svg30" />
  <g
     id="g855"
     transform="matrix(0.31874038,0,0,0.31874038,-13.245885,0)">
    <path
       id="path6"
       d="m 129.587,127.669 c -21.859,0 -39.646,-17.784 -39.646,-39.643 0,-21.862 17.787,-39.649 39.646,-39.649 18.046,0 33.3,12.12 38.083,28.645 h 15.34 c -5.107,-24.818 -27.116,-43.537 -53.423,-43.537 -30.071,0 -54.538,24.467 -54.538,54.541 0,30.072 24.467,54.539 54.538,54.539 26.307,0 48.316,-18.716 53.422,-43.534 h -15.34 c -4.781,16.52 -20.036,28.638 -38.082,28.638"
       inkscape:connector-curvature="0"
       style="fill:#435363" />
    <path
       id="path8"
       d="m 102.86,114.75 c 6.848,6.847 16.303,11.09 26.727,11.09 v -15.808 a 21.955,21.955 0 0 1 -15.561,-6.448 z"
       inkscape:connector-curvature="0"
       style="fill:#435363" />
    <path
       id="path10"
       d="m 91.774,88.023 c 0,5.41 1.154,10.557 3.209,15.217 l 14.459,-6.36 a 21.898,21.898 0 0 1 -1.864,-8.857 c 0,-12.155 9.854,-22.006 22.006,-22.006 V 50.21 c -20.849,0 -37.81,16.964 -37.81,37.813"
       inkscape:connector-curvature="0"
       style="fill:#f38b00" />
    <path
       id="path12"
       d="m 143.295,52.787 -5.734,14.736 a 22.06,22.06 0 0 1 11.076,9.495 h 17.121 C 162.379,65.922 154.023,56.975 143.295,52.788"
       inkscape:connector-curvature="0"
       style="fill:#435363" />
    <path
       id="path14"
       d="m 137.568,108.524 5.73,14.735 c 10.729,-4.188 19.085,-13.138 22.467,-24.235 h -17.121 a 22.075,22.075 0 0 1 -11.076,9.5"
       inkscape:connector-curvature="0"
       style="fill:#f38b00" />
    <path
       id="path16"
       d="m 59.63,109.175 a 74.974,74.974 0 0 1 -0.709,-2.498 l -0.041,-0.154 a 78.02,78.02 0 0 1 -0.573,-2.341 79.232,79.232 0 0 1 -0.526,-2.512 c -0.058,-0.304 -0.11,-0.608 -0.16,-0.912 -0.096,-0.543 -0.192,-1.082 -0.277,-1.631 a 65.613,65.613 0 0 1 -0.195,-1.4 72.006,72.006 0 0 1 -0.658,-9.707 H 41.557 c -0.003,3.577 0.222,7.11 0.642,10.598 0.007,0.075 0.02,0.15 0.03,0.225 0.117,0.95 0.247,1.898 0.393,2.837 0.041,0.26 0.086,0.519 0.13,0.781 0.13,0.772 0.263,1.543 0.413,2.311 0.075,0.41 0.164,0.813 0.25,1.219 0.125,0.61 0.255,1.222 0.395,1.83 0.123,0.532 0.256,1.064 0.393,1.597 0.12,0.474 0.235,0.949 0.361,1.423 0.171,0.628 0.352,1.25 0.533,1.874 0.075,0.26 0.143,0.526 0.222,0.782 h 0.007 a 87.43,87.43 0 0 0 3.672,9.96 l 13.684,-6.018 a 72.611,72.611 0 0 1 -3.051,-8.264 z"
       inkscape:connector-curvature="0"
       style="fill:#435363" />
    <path
       id="path18"
       d="m 129.587,161.123 c -20.152,0 -38.42,-8.206 -51.654,-21.443 l -10.578,10.578 c 15.93,15.93 37.926,25.795 62.232,25.795 44.889,0 81.924,-33.6 87.34,-77.022 h -15.07 c -5.324,35.1 -35.703,62.092 -72.27,62.092 m 0,-146.193 c 16.374,0 31.498,5.41 43.698,14.54 l 8.946,-11.99 C 167.547,6.502 149.327,0 129.587,0 92.235,0 60.32,23.265 47.541,56.098 l 13.93,5.42 C 72.103,34.278 98.628,14.93 129.587,14.93"
       inkscape:connector-curvature="0"
       style="fill:#f38b00" />
    <path
       id="path20"
       d="m 201.858,77.022 h 15.07 a 87.445,87.445 0 0 0 -12.66,-35.608 l -12.691,7.919 a 72.664,72.664 0 0 1 10.28,27.689"
       inkscape:connector-curvature="0"
       style="fill:#435363" />
    <path
       id="path22"
       d="M 184.88,77.022 H 200 C 196.055,51.668 178.691,30.702 155.423,21.62 l -5.4,13.885 c 17.695,6.91 31.078,22.498 34.857,41.517"
       inkscape:connector-curvature="0"
       style="fill:#f38b00" />
    <path
       id="path24"
       d="m 129.587,31.652 0.004,-14.89 h -0.004 c -30.184,0 -56.04,18.863 -66.41,45.422 l 13.876,5.4 c 8.205,-21.01 28.658,-35.932 52.534,-35.932"
       inkscape:connector-curvature="0"
       style="fill:#435363" />
    <path
       id="path26"
       d="M 73.216,88.023 H 58.327 c 0,29.945 18.572,55.624 44.8,66.15 l 5.53,-13.82 C 87.907,132.024 73.216,111.712 73.216,88.023"
       inkscape:connector-curvature="0"
       style="fill:#f38b00" />
    <path
       id="path28"
       d="m 129.587,144.394 v 14.893 c 35.553,0 65.106,-26.174 70.414,-60.263 h -15.125 c -5.13,25.84 -27.968,45.37 -55.289,45.37"
       inkscape:connector-curvature="0"
       style="fill:#435363" />
  </g>
</svg>
