<?xml version="1.0" encoding="UTF-8" standalone="no"?>
<svg
   xmlns:dc="http://purl.org/dc/elements/1.1/"
   xmlns:cc="http://creativecommons.org/ns#"
   xmlns:rdf="http://www.w3.org/1999/02/22-rdf-syntax-ns#"
   xmlns:svg="http://www.w3.org/2000/svg"
   xmlns="http://www.w3.org/2000/svg"
   xmlns:sodipodi="http://sodipodi.sourceforge.net/DTD/sodipodi-0.dtd"
   xmlns:inkscape="http://www.inkscape.org/namespaces/inkscape"
   width="507.73889"
   height="512"
   viewBox="0 0 507.73889 512.00001"
   fill="none"
   version="1.1"
   id="svg83"
   sodipodi:docname="telecom-anatel.svg"
   inkscape:version="1.0 (1.0+r73+1)">
  <metadata
     id="metadata87">
    <rdf:RDF>
      <cc:Work
         rdf:about="">
        <dc:format>image/svg+xml</dc:format>
        <dc:type
           rdf:resource="http://purl.org/dc/dcmitype/StillImage" />
        <dc:title></dc:title>
      </cc:Work>
    </rdf:RDF>
  </metadata>
  <sodipodi:namedview
     inkscape:document-rotation="0"
     pagecolor="#ffffff"
     bordercolor="#666666"
     borderopacity="1"
     objecttolerance="10"
     gridtolerance="10"
     guidetolerance="10"
     inkscape:pageopacity="0"
     inkscape:pageshadow="2"
     inkscape:window-width="1920"
     inkscape:window-height="1033"
     id="namedview85"
     showgrid="false"
     inkscape:showpageshadow="false"
     fit-margin-top="0"
     fit-margin-left="0"
     fit-margin-right="0"
     fit-margin-bottom="0"
     inkscape:zoom="1.6386719"
     inkscape:cx="253.86945"
     inkscape:cy="256"
     inkscape:window-x="0"
     inkscape:window-y="24"
     inkscape:window-maximized="1"
     inkscape:current-layer="svg83" />
  <g
     id="g123"
     transform="matrix(3.3205392,0,0,3.3205392,-219.15559,-342.01612)"
     style="stroke-width:0.29865">
    <path
       fill-rule="evenodd"
       clip-rule="evenodd"
       d="m 107.236,223.615 c -18.9401,0 -34.3645,-15.425 -34.3645,-34.312 0,-18.94 15.4233,-34.365 34.3645,-34.365 18.887,0 34.312,15.425 34.312,34.365 0,18.887 -15.425,34.312 -34.312,34.312 z"
       fill="#295ca7"
       id="path4"
       style="stroke-width:0.0891916" />
    <path
       fill-rule="evenodd"
       clip-rule="evenodd"
       d="m 84.5716,250.424 c 0.0471,2.259 -0.0403,4.519 -0.2618,6.767 h 6.7156 c 0.682,-9.548 -1.5213,-22.297 -2.7809,-27.124 H 83.2087 C 79.3784,234.895 70.4595,247.644 66,257.191 h 6.8201 c 0.9449,-2.15 2.0988,-4.46 3.3584,-6.767 z m -6.819,-3.041 c 3.0415,-5.3 5.928,-9.655 5.928,-9.655 0,0 0.5775,4.355 0.7865,9.655 z m 35.2544,9.809 h 4.25 l 7.187,-27.124 h -6.085 l -4.25,16.053 -7.765,-16.053 h -4.302 l -7.1346,27.124 h 6.0336 l 4.249,-16.001 z m 26.233,-6.768 c 0.047,2.259 -0.041,4.519 -0.262,6.767 h 6.715 c 0.577,-9.548 -1.573,-22.297 -2.78,-27.124 h -5.09 c -3.829,4.828 -12.748,17.577 -17.155,27.124 h 6.821 c 0.891,-2.15 2.097,-4.46 3.357,-6.767 z m -6.82,-3.041 c 3.043,-5.3 5.929,-9.655 5.929,-9.655 0,0 0.577,4.355 0.786,9.655 z m 25.078,9.809 6.346,-24.08 h 6.822 l 0.788,-3.044 h -20.199 l -0.787,3.044 h 6.873 l -6.348,24.08 z m 17.574,-2.99 2.466,-9.34 h 7.871 l 0.839,-3.042 h -7.869 l 2.256,-8.708 h 9.285 l 0.735,-3.044 h -15.739 l -7.188,27.124 h 16.265 l 0.735,-2.99 z m 20.357,0 6.349,-24.134 h -6.505 l -7.19,27.124 h 16.056 l 0.787,-2.99 z"
       fill="#2f9c5c"
       id="path6"
       style="stroke-width:0.0891916" />
    <path
       fill-rule="evenodd"
       clip-rule="evenodd"
       d="m 206.603,223.719 c 20.044,-46.798 15.637,-93.596 -13.482,-112.483 -27.648,-17.9439 -69.044,-5.562 -102.7257,27.386 22.0347,-16.946 46.9567,-21.51 62.1697,-9.233 19.413,15.582 15.215,52.936 -9.443,83.418 -3.2,3.936 -6.662,7.605 -10.178,11.07 z"
       fill="#fadf3c"
       id="path8"
       style="stroke-width:0.0891916" />
  </g>
  <g
     transform="translate(-65.999997,-103.00018)"
     style="filter:url(#filter0_d)"
     id="g52"
     opacity="0.1">
    <path
       id="path44"
       fill="#000000"
       d="m 280,323.025 v 50.588 c 0,0.156 0.108,0.26 0.269,0.26 h 44.999 c 0.162,0 0.27,-0.104 0.27,-0.26 V 332.27 C 310.341,329.466 295.143,326.401 280,323.025 Z"
       opacity="0.1" />
    <path
       id="path46"
       fill="#000000"
       d="m 445.23,351.955 c -7.706,-1.195 -15.413,-2.39 -23.119,-3.636 v 25.294 c 0,0.156 0.108,0.26 0.269,0.26 h 44.999 c 0.162,0 0.27,-0.104 0.27,-0.26 v -18.075 c -7.491,-1.194 -14.928,-2.389 -22.419,-3.583 z"
       opacity="0.1" />
    <path
       id="path48"
       fill="#000000"
       d="m 351.028,336.893 v 36.772 c 0,0.156 0.108,0.26 0.27,0.26 h 44.999 c 0.161,0 0.269,-0.104 0.269,-0.26 v -29.293 c -15.143,-2.441 -30.341,-4.882 -45.538,-7.479 z"
       opacity="0.1" />
    <path
       id="path50"
       fill="#000000"
       d="m 493.139,359.746 v 13.919 c 0,0.156 0.108,0.26 0.27,0.26 h 44.999 c 0.161,0 0.269,-0.104 0.269,-0.26 v -6.44 c -15.143,-2.493 -30.341,-4.986 -45.538,-7.479 z"
       opacity="0.1" />
  </g>
  <defs
     id="defs81">
    <filter
       id="filter0_d"
       x="0"
       y="0"
       width="617.25"
       height="386"
       filterUnits="userSpaceOnUse"
       color-interpolation-filters="sRGB">
      <feFlood
         flood-opacity="0"
         result="BackgroundImageFix"
         id="feFlood66" />
      <feColorMatrix
         in="SourceAlpha"
         type="matrix"
         values="0 0 0 0 0 0 0 0 0 0 0 0 0 0 0 0 0 0 127 0"
         id="feColorMatrix68" />
      <feOffset
         dy="4"
         id="feOffset70" />
      <feGaussianBlur
         stdDeviation="4"
         id="feGaussianBlur72" />
      <feColorMatrix
         type="matrix"
         values="0 0 0 0 0 0 0 0 0 0 0 0 0 0 0 0 0 0 0.1 0"
         id="feColorMatrix74" />
      <feBlend
         mode="normal"
         in2="BackgroundImageFix"
         result="effect1_dropShadow"
         id="feBlend76" />
      <feBlend
         mode="normal"
         in="SourceGraphic"
         in2="effect1_dropShadow"
         result="shape"
         id="feBlend78" />
    </filter>
  </defs>
</svg>
