<?xml version="1.0" encoding="UTF-8" standalone="no"?>
<svg
   xmlns:dc="http://purl.org/dc/elements/1.1/"
   xmlns:cc="http://creativecommons.org/ns#"
   xmlns:rdf="http://www.w3.org/1999/02/22-rdf-syntax-ns#"
   xmlns:svg="http://www.w3.org/2000/svg"
   xmlns="http://www.w3.org/2000/svg"
   xmlns:sodipodi="http://sodipodi.sourceforge.net/DTD/sodipodi-0.dtd"
   xmlns:inkscape="http://www.inkscape.org/namespaces/inkscape"
   sodipodi:docname="os-freedos-2.svg"
   inkscape:version="1.0 (1.0+r73+1)"
   sodipodi:version="0.32"
   id="svg2"
   preserveAspectRatio="xMidYMid meet"
   viewBox="0 0 384 299.20129"
   height="299.20129pt"
   width="384pt"
   version="1.0">
  <defs
     id="defs33" />
  <sodipodi:namedview
     inkscape:window-maximized="1"
     fit-margin-bottom="0"
     fit-margin-right="0"
     fit-margin-left="0"
     fit-margin-top="0"
     inkscape:showpageshadow="false"
     showgrid="false"
     inkscape:document-rotation="0"
     inkscape:current-layer="svg2"
     inkscape:window-y="24"
     inkscape:window-x="0"
     inkscape:cy="199.46753"
     inkscape:cx="256"
     inkscape:zoom="2.0579791"
     id="base"
     pagecolor="#ffffff"
     bordercolor="#666666"
     borderopacity="1.0"
     objecttolerance="10.0"
     gridtolerance="10.0"
     guidetolerance="10.0"
     inkscape:pageopacity="0.0"
     inkscape:pageshadow="2"
     inkscape:window-width="1920"
     inkscape:window-height="1033" />
  <metadata
     id="metadata4">
Made by Mateusz Viste &quot;Fox&quot;
<rdf:RDF>
  <cc:Work
     rdf:about="">
    <dc:format>image/svg+xml</dc:format>
    <dc:type
       rdf:resource="http://purl.org/dc/dcmitype/StillImage" />
    <dc:title></dc:title>
  </cc:Work>
</rdf:RDF>
</metadata>
  <g
     transform="matrix(0.85672648,0,0,0.85672648,-10.251546,-6.9094764)"
     id="g70">
    <g
       id="g42">
      <path
         id="path4690"
         d="m 81.626984,212.23016 4.801587,-81.62699 28.809529,-61.460313 40.33333,-38.412698 52.81746,-18.246032 63.38095,4.801587 45.13492,30.730159 37.45238,46.095238 24.00794,73.944449 24.96825,-6.72223 14.40477,3.84127 -26.88889,31.69048 -2.88096,21.12698 17.28572,32.6508 -22.0873,-11.52381 -26.88889,-29.76984 -19.20635,22.0873 0.96032,13.44444 7.68254,27.84921 -2.88096,16.3254 -36.49206,-36.49207 -14.40476,14.40476 -47.05556,14.40477 h -58.57936 l -40.33334,-9.60318 -11.52381,-2.88095 -21.12698,17.28571 -1.92063,-14.40476 7.68254,-20.16667 z"
         style="fill:#bfcfe7;fill-opacity:1;fill-rule:evenodd;stroke:none;stroke-width:1px;stroke-linecap:butt;stroke-linejoin:miter;stroke-opacity:1" />
      <path
         sodipodi:arc-type="arc"
         transform="translate(-0.960317,-3.84127)"
         sodipodi:open="true"
         sodipodi:end="6.1866673"
         sodipodi:start="0"
         d="m 161.33334,182.94048 a 23.527779,24.488094 0 0 1 -22.96012,24.48096 23.527779,24.488094 0 0 1 -24.06805,-23.29965 23.527779,24.488094 0 0 1 21.79873,-25.60528 23.527779,24.488094 0 0 1 25.11993,22.06409"
         sodipodi:ry="24.488094"
         sodipodi:rx="23.527779"
         sodipodi:cy="182.94048"
         sodipodi:cx="137.80556"
         id="path2025"
         style="opacity:1;fill:#ffffff;fill-opacity:1;fill-rule:evenodd;stroke:none;stroke-width:5;stroke-linecap:round;stroke-linejoin:round;stroke-miterlimit:4;stroke-dasharray:none;stroke-opacity:1"
         sodipodi:type="arc" />
      <path
         sodipodi:arc-type="arc"
         transform="translate(0.960317,-4.801588)"
         sodipodi:open="true"
         sodipodi:end="6.1866673"
         sodipodi:start="0"
         d="m 211.26983,187.74207 a 18.246031,19.686508 0 0 1 -17.8058,19.68077 18.246031,19.686508 0 0 1 -18.66501,-18.73109 18.246031,19.686508 0 0 1 16.90513,-20.58464 18.246031,19.686508 0 0 1 19.48076,17.7378"
         sodipodi:ry="19.686508"
         sodipodi:rx="18.246031"
         sodipodi:cy="187.74207"
         sodipodi:cx="193.0238"
         id="path2912"
         style="opacity:1;fill:#ffffff;fill-opacity:1;fill-rule:evenodd;stroke:none;stroke-width:5;stroke-linecap:round;stroke-linejoin:round;stroke-miterlimit:4;stroke-dasharray:none;stroke-opacity:1"
         sodipodi:type="arc" />
      <path
         d="M 211.39845,8.940835 C 168.9858,11.9988 135.6141,33.53751 107.02877,75.950155 90.808265,100.14797 86.021885,114.90597 76.980945,168.22093 c -0.79773,4.78637 -1.06364,15.55573 -0.53182,26.98986 1.06364,20.87394 0.132955,18.74665 11.16822,25.92623 2.526145,1.59546 8.376165,7.97729 13.029595,13.96027 4.52046,6.11593 9.83866,12.36481 11.56708,13.69436 l 3.32387,2.52615 -4.1216,8.90798 c -6.38184,13.56141 -5.98298,32.30807 0.66477,32.30807 2.52615,0 12.23186,-7.04662 19.54439,-14.09323 l 5.98297,-5.85002 13.2955,5.18524 c 47.33198,18.48075 103.83786,14.35915 147.71301,-10.63639 l 11.70004,-6.78071 4.52047,5.05229 c 2.52614,2.92501 7.9773,9.43981 11.96595,14.49209 13.69436,17.01825 16.35346,18.48075 19.67734,10.37049 5.45115,-12.76367 4.1216,-23.66599 -5.58411,-48.39562 l -2.39319,-6.24888 9.17389,-8.77503 c 11.03527,-10.50345 9.70572,-10.23754 15.68869,-2.39319 8.37617,11.16822 25.66032,23.9319 38.95582,28.98419 9.30685,3.45683 9.4398,0.26591 1.06364,-13.42846 -15.42278,-24.72962 -16.35347,-32.04215 -5.98298,-46.6672 7.17957,-10.37049 15.28983,-18.21483 22.07053,-21.40576 5.45116,-2.52614 5.71707,-4.25456 1.72842,-7.97729 -6.78071,-6.11594 -20.20916,-7.7114 -31.24443,-3.8557 -6.64775,2.39319 -7.84434,1.59546 -9.57276,-5.98297 C 359.37736,60.66033 297.95215,4.154455 221.37007,8.27606 c -2.26023,0.132955 -6.64775,0.398865 -9.97162,0.664775 z m 51.18767,11.43413 c 22.4694,5.58411 39.35468,15.555735 55.97406,33.105795 29.64896,31.64329 46.53425,69.53547 54.91041,123.11633 0.13296,0.26591 2.12728,-1.1966 4.52047,-3.19092 7.31253,-6.11593 22.07053,-9.97162 31.24443,-7.84434 3.58978,0.66477 3.45683,0.93068 -8.37617,13.16254 -20.60802,21.2728 -21.80462,36.56263 -4.52047,60.89339 1.72842,2.26023 2.12728,3.72274 1.06364,3.72274 -6.51479,0 -35.23307,-31.11147 -34.5683,-37.49331 0.79773,-7.9773 -9.83867,-2.39319 -16.22051,8.64208 -1.86137,3.05796 -4.91933,7.04661 -6.91366,8.90798 l -3.58978,3.32387 -3.72274,-4.52047 c -3.45683,-3.98865 -3.98865,-4.25455 -6.5148,-2.52614 l -2.6591,1.86137 2.6591,4.52047 c 8.37617,13.56141 17.01824,38.55695 17.1512,48.52857 0,11.03527 -3.19092,10.90231 -11.03527,-0.53181 -6.11593,-9.1739 -23.40008,-27.92055 -27.65464,-30.04784 -9.04094,-4.78638 -14.09323,-1.59546 -7.17957,4.52048 6.78071,5.85001 6.78071,5.85001 -10.10458,15.15686 -30.84556,16.88529 -103.57194,21.00689 -130.2959,7.57844 -14.758,-7.57844 -38.15808,-25.39441 -44.0081,-33.50466 l -2.79206,-4.1216 3.19092,0.79773 c 1.72842,0.39886 8.64208,2.26023 15.42278,4.1216 27.25578,7.44548 102.90717,8.64207 117.39927,1.86137 18.87961,-8.77503 21.00689,-21.40576 2.39319,-14.35914 -33.1058,12.63072 -101.31171,8.90798 -141.99594,-7.57843 -9.83867,-3.98865 -18.746655,-7.7114 -19.810295,-8.11026 -2.39319,-0.93068 -1.196595,-43.07742 1.728415,-60.09566 7.9773,-46.6672 32.97284,-91.340085 62.35589,-111.41629 3.05797,-2.12728 7.84435,-5.3182 10.6364,-7.312525 18.6137,-12.76368 71.13093,-18.480745 101.31171,-11.16822 z M 127.50384,264.74626 c 1.72842,2.26023 2.92501,4.1216 2.6591,4.38751 -5.85002,3.98865 -14.758,8.90799 -15.42278,8.24321 -1.19659,-1.1966 1.86137,-10.37049 4.52047,-13.69437 3.05797,-3.85569 4.38752,-3.72274 8.24321,1.06365 z"
         id="path8"
         style="fill:#000000;stroke:none;stroke-width:0.132955" />
      <path
         d="m 123.38224,152.39928 c -15.82165,8.50912 -20.60803,37.09444 -8.11026,48.52858 20.74098,19.27847 49.72517,5.31819 50.12404,-24.06486 0.26591,-18.34779 -25.66032,-33.37171 -42.01378,-24.46372 z m 23.53303,6.91366 c 14.75801,9.1739 17.01824,20.47507 7.04662,34.43534 -15.9546,22.20349 -48.12971,1.59547 -38.15809,-24.46371 4.25456,-11.30118 20.34212,-16.48643 31.11147,-9.97163 z"
         id="path10"
         style="fill:#000000;stroke:none;stroke-width:0.132955" />
      <path
         d="m 130.96067,164.7641 c -12.49777,5.18524 -10.50344,26.72395 2.52615,27.78759 5.85002,0.53182 8.24321,-1.06364 10.90231,-7.44548 5.58411,-13.42845 -1.99433,-24.99554 -13.42846,-20.34211 z m 10.50345,5.85002 c 0.79773,1.19659 0.93068,2.52614 0.39886,3.05796 -1.59546,1.72841 -10.90231,-1.32955 -11.30117,-3.72274 -0.79773,-4.25456 8.11025,-3.72274 10.90231,0.66478 z"
         id="path12"
         style="fill:#000000;stroke:none;stroke-width:0.132955" />
      <path
         d="m 187.33359,160.9084 c -20.20916,6.11593 -19.54438,37.2274 1.06364,44.67288 8.90799,3.05797 14.09323,2.39319 19.54439,-2.6591 17.68301,-16.88528 1.99432,-48.92744 -20.60803,-42.01378 z m 12.09891,7.31253 c 11.70004,6.11593 13.42845,19.27847 3.72274,29.51601 -8.11026,8.64207 -23.66599,-1.32956 -23.66599,-14.89097 0,-12.76367 9.70571,-19.94325 19.94325,-14.62504 z"
         id="path14"
         style="fill:#000000;stroke:none;stroke-width:0.132955" />
      <path
         d="m 186.80177,175.00163 c -5.71706,8.77503 -0.93068,22.20348 7.04662,19.67734 7.84434,-2.52615 10.90231,-6.38184 10.90231,-13.82732 0,-8.37616 -13.42846,-12.76368 -17.94893,-5.85002 z m 11.30118,1.19659 c 2.12728,2.52615 0.66477,4.52048 -2.6591,3.72275 -3.19092,-0.79773 -4.52047,-2.52615 -3.32388,-4.38752 1.1966,-1.86137 4.12161,-1.59546 5.98298,0.66477 z"
         id="path16"
         style="fill:#000000;stroke:none;stroke-width:0.132955" />
    </g>
    <g
       id="g51">
      <path
         d="m 344.35345,304.10093 c -31.77625,5.3182 -37.09445,40.01946 -7.71139,50.38995 24.72963,8.64207 51.58654,-3.58979 51.58654,-23.66599 0,-19.41143 -18.87961,-30.97851 -43.87515,-26.72396 z m 22.7353,8.50912 c 6.64775,3.32388 10.50345,9.83868 10.50345,17.81597 0,25.92623 -45.33766,27.92055 -48.79449,2.12729 -2.39319,-17.55007 19.94325,-29.11715 38.29104,-19.94326 z"
         id="path18"
         style="fill:#000000;stroke:none;stroke-width:0.132955" />
      <path
         d="m 419.20711,304.4998 c -14.89096,3.05797 -21.53871,11.96595 -15.02391,20.34211 3.32387,4.12161 11.70004,6.91367 26.32509,8.77503 16.88528,2.12729 22.33644,6.11593 16.88528,12.09891 -6.11593,6.64775 -26.591,6.38184 -43.47628,-0.66477 -1.99433,-0.79773 -2.39319,-0.26592 -2.39319,3.58978 v 4.65342 l 9.17389,1.72842 c 15.42278,2.92501 34.30239,1.32955 41.48196,-3.45683 15.15687,-10.23754 8.11026,-21.53871 -15.42278,-24.46372 -16.22051,-2.12728 -21.67166,-3.58979 -23.26712,-6.64775 -5.58411,-10.37049 20.47507,-14.22619 41.61491,-5.98298 1.86137,0.79773 2.26024,0.26592 2.26024,-3.05796 0,-4.65342 -0.53182,-4.91934 -13.96028,-6.91366 -10.76935,-1.4625 -16.35346,-1.4625 -24.19781,0 z"
         id="path20"
         style="fill:#000000;stroke:none;stroke-width:0.132955" />
      <path
         d="m 11.96595,330.42602 v 25.92623 h 5.3182 5.3182 V 343.72152 331.0908 h 15.821645 c 12.364815,0 15.9546,-0.39887 16.48642,-1.86137 1.196595,-3.19092 -0.26591,-3.45683 -16.619375,-3.45683 H 22.60235 v -7.31252 -7.31253 h 18.480745 c 13.694365,0 18.6137,-0.39886 19.14552,-1.72842 1.59546,-4.52047 -0.398865,-4.91933 -24.46372,-4.91933 H 11.96595 Z"
         id="path22"
         style="fill:#000000;stroke:none;stroke-width:0.132955" />
      <path
         d="m 241.9781,330.42602 v 26.3251 l 18.34779,-0.79773 c 31.11147,-1.32956 45.47061,-9.30686 45.47061,-25.39441 0,-16.88529 -13.56141,-24.86259 -44.14106,-25.79327 l -19.67734,-0.66478 z m 37.62626,-17.81597 c 9.43981,2.52615 14.89096,9.04095 14.89096,17.55007 0,12.89663 -8.24321,18.34778 -29.51601,19.27847 l -13.69436,0.66477 v -19.54438 -19.41143 h 11.70004 c 6.38184,0 13.82732,0.66477 16.61937,1.4625 z"
         id="path24"
         style="fill:#000000;stroke:none;stroke-width:0.132955" />
      <path
         d="m 71.52979,318.06121 c -0.26591,0.53182 -0.26591,9.4398 0,19.67734 l 0.398865,18.6137 h 4.653425 4.52047 V 342.39197 328.4317 l 4.78638,-1.99433 c 2.6591,-1.06364 8.642075,-1.99432 13.162545,-1.99432 8.110255,0 8.376165,-0.13296 8.110255,-3.32388 -0.13296,-3.98864 -10.6364,-4.65342 -20.076205,-1.32955 -2.92501,1.06365 -5.451155,1.99433 -5.58411,1.99433 -0.26591,0 -0.398865,-1.06364 -0.398865,-2.39319 0,-2.26023 -8.907985,-3.58979 -9.57276,-1.32955 z"
         id="path26"
         style="fill:#000000;stroke:none;stroke-width:0.132955" />
      <path
         d="m 127.37089,318.06121 c -20.34212,5.45115 -20.87394,29.78192 -0.66478,36.42967 7.44548,2.52614 31.37738,1.99432 34.70126,-0.66478 2.26023,-1.86136 1.72841,-7.57843 -0.66478,-6.91366 -1.06364,0.26591 -4.91933,1.46251 -8.64207,2.52615 -12.89664,3.72274 -28.05351,-0.79773 -30.18079,-9.04094 -0.66477,-2.52614 -0.13295,-2.6591 20.47507,-2.6591 h 21.13985 v -5.05229 c 0,-12.76368 -17.01824,-19.67734 -36.16376,-14.62505 z m 24.33076,7.57843 c 5.05229,6.11594 3.8557,6.78071 -13.42845,6.78071 -12.49777,0 -15.9546,-0.39887 -15.9546,-1.72842 0,-8.11025 23.66599,-12.0989 29.38305,-5.05229 z"
         id="path28"
         style="fill:#000000;stroke:none;stroke-width:0.132955" />
      <path
         d="m 189.46087,317.92825 c -20.34211,5.85002 -20.34211,29.91488 -0.13295,36.56263 6.51479,2.26024 27.52168,2.12728 33.10579,-0.13295 3.72274,-1.59546 3.05797,-7.84435 -0.66477,-6.78071 -19.67734,5.58411 -34.70126,2.79206 -37.36036,-7.17957 -0.66477,-2.52614 -0.13295,-2.6591 20.47507,-2.6591 h 21.13985 v -5.05229 c 0,-12.63072 -18.48075,-20.07621 -36.56263,-14.75801 z m 21.80462,5.85002 c 3.45683,1.72842 5.45116,4.38752 5.45116,7.44548 0,0.66478 -7.17957,1.1966 -15.9546,1.1966 -12.49777,0 -15.9546,-0.39887 -15.9546,-1.72842 0,-6.91366 17.68301,-11.56708 26.45804,-6.91366 z"
         id="path30"
         style="fill:#000000;stroke:none;stroke-width:0.132955" />
    </g>
  </g>
</svg>
