<?xml version="1.0" encoding="UTF-8" standalone="no"?>
<svg
   xmlns:dc="http://purl.org/dc/elements/1.1/"
   xmlns:cc="http://creativecommons.org/ns#"
   xmlns:rdf="http://www.w3.org/1999/02/22-rdf-syntax-ns#"
   xmlns:svg="http://www.w3.org/2000/svg"
   xmlns="http://www.w3.org/2000/svg"
   xmlns:sodipodi="http://sodipodi.sourceforge.net/DTD/sodipodi-0.dtd"
   xmlns:inkscape="http://www.inkscape.org/namespaces/inkscape"
   inkscape:version="1.0 (1.0+r73+1)"
   height="512"
   width="512"
   sodipodi:docname="vmware-vsphere.svg"
   version="1.1"
   viewBox="0 0 512 512"
   id="icons">
  <metadata
     id="metadata52">
    <rdf:RDF>
      <cc:Work
         rdf:about="">
        <dc:format>image/svg+xml</dc:format>
        <dc:type
           rdf:resource="http://purl.org/dc/dcmitype/StillImage" />
        <dc:title>vmware-vsphere</dc:title>
      </cc:Work>
    </rdf:RDF>
  </metadata>
  <sodipodi:namedview
     inkscape:current-layer="icons"
     inkscape:window-maximized="1"
     inkscape:window-y="24"
     inkscape:window-x="0"
     inkscape:cy="256"
     inkscape:cx="256"
     inkscape:zoom="1.6035156"
     fit-margin-bottom="0"
     fit-margin-right="0"
     fit-margin-left="0"
     fit-margin-top="0"
     inkscape:showpageshadow="false"
     showgrid="false"
     id="namedview50"
     inkscape:window-height="1033"
     inkscape:window-width="1920"
     inkscape:pageshadow="2"
     inkscape:pageopacity="0"
     guidetolerance="10"
     gridtolerance="10"
     objecttolerance="10"
     borderopacity="1"
     bordercolor="#666666"
     pagecolor="#ffffff" />
  <defs
     id="defs4">
    <style
       id="style2">.cls-1{fill:#1996dc;}.cls-2{fill:#71c092;}.cls-3{fill:#22905f;}.cls-4{fill:#188179;}.cls-5{fill:#1aa2a2;}.cls-6{fill:#156d5c;}.cls-7{fill:#0c423b;}.cls-8{fill:#012906;}.cls-9{fill:#1c4224;}.cls-10{fill:#81b523;}.cls-11{fill:#225c4f;}.cls-12{fill:#899624;}.cls-13{fill:#c0d10f;}.cls-14{fill:#65932c;}.cls-15{fill:#95b71e;}.cls-16{fill:#2891d0;}.cls-17{fill:#7ac8fa;}.cls-18{fill:#46b6f5;}</style>
  </defs>
  <title
     id="title6">vmware-vsphere</title>
  <g
     transform="matrix(8.5333333,0,0,8.5333333,-170.66667,-170.66667)"
     id="vmware-vsphere">
    <polygon
       id="polygon8"
       points="35,35 35,20 27.5,27.5 "
       class="cls-1" />
    <polygon
       id="polygon10"
       points="80,20 65,20 80,35 "
       class="cls-2" />
    <polygon
       id="polygon12"
       points="80,35 65,20 65,35 "
       class="cls-3" />
    <polygon
       id="polygon14"
       points="42.5,42.5 50,50 50,35 "
       class="cls-4" />
    <polygon
       id="polygon16"
       points="50,35 35,35 42.5,42.5 "
       class="cls-5" />
    <polygon
       id="polygon18"
       points="65,35 50,35 65,50 "
       class="cls-6" />
    <polygon
       id="polygon20"
       points="50,35 50,50 65,50 "
       class="cls-7" />
    <polygon
       id="polygon22"
       points="80,50 80,35 65,50 "
       class="cls-8" />
    <polygon
       id="polygon24"
       points="65,50 80,35 65,35 "
       class="cls-9" />
    <polygon
       id="polygon26"
       points="57.5,57.5 65,65 65,50 "
       class="cls-10" />
    <polygon
       id="polygon28"
       points="65,50 50,50 57.5,57.5 "
       class="cls-11" />
    <polygon
       id="polygon30"
       points="80,65 80,50 65,50 "
       class="cls-12" />
    <polygon
       id="polygon32"
       points="65,65 80,65 65,50 "
       class="cls-13" />
    <polygon
       id="polygon34"
       points="80,80 80,65 72.5,72.5 "
       class="cls-14" />
    <polygon
       id="polygon36"
       points="72.5,72.5 80,65 65,65 "
       class="cls-15" />
    <polygon
       id="polygon38"
       points="35,20 20,20 27.5,27.5 "
       class="cls-16" />
    <polygon
       id="polygon40"
       points="50,20 35,20 50,35 "
       class="cls-17" />
    <polygon
       id="polygon42"
       points="35,35 50,35 35,20 "
       class="cls-18" />
    <polygon
       id="polygon44"
       points="65,20 50,20 50,35 "
       class="cls-18" />
    <polygon
       id="polygon46"
       points="65,35 65,20 50,35 "
       class="cls-5" />
  </g>
</svg>
