<?xml version="1.0" encoding="UTF-8" standalone="no"?>
<!-- Generator: Adobe Illustrator 19.0.0, SVG Export Plug-In . SVG Version: 6.00 Build 0)  -->

<svg
   xmlns:dc="http://purl.org/dc/elements/1.1/"
   xmlns:cc="http://creativecommons.org/ns#"
   xmlns:rdf="http://www.w3.org/1999/02/22-rdf-syntax-ns#"
   xmlns:svg="http://www.w3.org/2000/svg"
   xmlns="http://www.w3.org/2000/svg"
   xmlns:sodipodi="http://sodipodi.sourceforge.net/DTD/sodipodi-0.dtd"
   xmlns:inkscape="http://www.inkscape.org/namespaces/inkscape"
   version="1.1"
   id="Capa_1"
   x="0px"
   y="0px"
   viewBox="0 0 560.25622 511.99999"
   xml:space="preserve"
   sodipodi:docname="ms-planner.svg"
   width="560.25623"
   height="512"
   inkscape:version="0.92.4 (unknown)"><metadata
   id="metadata57"><rdf:RDF><cc:Work
       rdf:about=""><dc:format>image/svg+xml</dc:format><dc:type
         rdf:resource="http://purl.org/dc/dcmitype/StillImage" /><dc:title></dc:title></cc:Work></rdf:RDF></metadata><defs
   id="defs55" /><sodipodi:namedview
   pagecolor="#ffffff"
   bordercolor="#666666"
   borderopacity="1"
   objecttolerance="10"
   gridtolerance="10"
   guidetolerance="10"
   inkscape:pageopacity="0"
   inkscape:pageshadow="2"
   inkscape:window-width="1600"
   inkscape:window-height="851"
   id="namedview53"
   showgrid="false"
   inkscape:showpageshadow="false"
   fit-margin-top="0"
   fit-margin-left="0"
   fit-margin-right="0"
   fit-margin-bottom="0"
   inkscape:zoom="1.2597656"
   inkscape:cx="280.12811"
   inkscape:cy="256"
   inkscape:window-x="0"
   inkscape:window-y="24"
   inkscape:window-maximized="1"
   inkscape:current-layer="Capa_1" />


<g
   id="g878"
   transform="matrix(1.7179767,0,0,1.7179767,-159.67391,-182.0832)"><path
     style="fill:#36930f;fill-opacity:1"
     d="m 419.057,332.723 c 0,-21.012 -14.635,-38.594 -34.264,-43.142 -7.966,9.084 -19.202,14.764 -31.644,14.764 -12.442,0 -23.677,-5.68 -31.644,-14.764 -8.58,1.988 -16.201,6.464 -22.066,12.634 -0.591,5.919 -2.194,11.509 -4.61,16.574 20.129,6.424 35.41,23.793 38.816,45.08 h 85.411 v -31.146 z"
     id="path6"
     inkscape:connector-curvature="0" /><ellipse
     style="fill:#36930f;fill-opacity:1"
     cx="353.14999"
     cy="256.92999"
     rx="31.24"
     ry="34.952999"
     id="ellipse8" /><path
     style="fill:#36930f;fill-opacity:1"
     d="m 256,344.489 c -12.442,0 -23.678,-5.68 -31.644,-14.764 -19.629,4.547 -34.264,22.129 -34.264,43.141 v 31.146 h 131.815 v -31.146 c 0,-21.012 -14.635,-38.594 -34.264,-43.141 -7.966,9.084 -19.201,14.764 -31.643,14.764 z"
     id="path10"
     inkscape:connector-curvature="0" /><ellipse
     style="fill:#36930f;fill-opacity:1"
     cx="256"
     cy="297.07999"
     rx="31.24"
     ry="34.952999"
     id="ellipse12" /><path
     style="fill:#36930f;fill-opacity:1"
     d="m 92.943,332.723 c 0,-21.012 14.635,-38.594 34.264,-43.142 7.966,9.084 19.202,14.764 31.644,14.764 12.442,0 23.677,-5.68 31.644,-14.764 8.58,1.988 16.201,6.464 22.066,12.634 0.591,5.919 2.194,11.509 4.61,16.574 -20.129,6.424 -35.41,23.793 -38.816,45.08 H 92.943 Z"
     id="path14"
     inkscape:connector-curvature="0" /><ellipse
     style="fill:#36930f;fill-opacity:1"
     cx="158.85001"
     cy="256.92999"
     rx="31.24"
     ry="34.952999"
     id="ellipse16" /><polygon
     style="fill:#36930f;fill-opacity:1"
     points="258.095,188.342 216.428,147.586 199.023,164.991 259.883,225.852 284.95,197.104 345.996,121.553 326.506,105.987 "
     id="polygon18" /></g>
<g
   id="g22"
   transform="translate(-92.942998,107.98799)">
</g>
<g
   id="g24"
   transform="translate(-92.942998,107.98799)">
</g>
<g
   id="g26"
   transform="translate(-92.942998,107.98799)">
</g>
<g
   id="g28"
   transform="translate(-92.942998,107.98799)">
</g>
<g
   id="g30"
   transform="translate(-92.942998,107.98799)">
</g>
<g
   id="g32"
   transform="translate(-92.942998,107.98799)">
</g>
<g
   id="g34"
   transform="translate(-92.942998,107.98799)">
</g>
<g
   id="g36"
   transform="translate(-92.942998,107.98799)">
</g>
<g
   id="g38"
   transform="translate(-92.942998,107.98799)">
</g>
<g
   id="g40"
   transform="translate(-92.942998,107.98799)">
</g>
<g
   id="g42"
   transform="translate(-92.942998,107.98799)">
</g>
<g
   id="g44"
   transform="translate(-92.942998,107.98799)">
</g>
<g
   id="g46"
   transform="translate(-92.942998,107.98799)">
</g>
<g
   id="g48"
   transform="translate(-92.942998,107.98799)">
</g>
<g
   id="g50"
   transform="translate(-92.942998,107.98799)">
</g>
</svg>