<?xml version="1.0" encoding="UTF-8" standalone="no"?>
<svg
   xmlns:dc="http://purl.org/dc/elements/1.1/"
   xmlns:cc="http://creativecommons.org/ns#"
   xmlns:rdf="http://www.w3.org/1999/02/22-rdf-syntax-ns#"
   xmlns:svg="http://www.w3.org/2000/svg"
   xmlns="http://www.w3.org/2000/svg"
   xmlns:sodipodi="http://sodipodi.sourceforge.net/DTD/sodipodi-0.dtd"
   xmlns:inkscape="http://www.inkscape.org/namespaces/inkscape"
   width="512"
   height="512"
   viewBox="0 0 52.4288 52.4288"
   preserveAspectRatio="xMinYMin meet"
   version="1.1"
   id="svg4"
   sodipodi:docname="git.svg"
   inkscape:version="0.92.4 (unknown)">
  <metadata
     id="metadata10">
    <rdf:RDF>
      <cc:Work
         rdf:about="">
        <dc:format>image/svg+xml</dc:format>
        <dc:type
           rdf:resource="http://purl.org/dc/dcmitype/StillImage" />
        <dc:title></dc:title>
      </cc:Work>
    </rdf:RDF>
  </metadata>
  <defs
     id="defs8" />
  <sodipodi:namedview
     pagecolor="#ffffff"
     bordercolor="#666666"
     borderopacity="1"
     objecttolerance="10"
     gridtolerance="10"
     guidetolerance="10"
     inkscape:pageopacity="0"
     inkscape:pageshadow="2"
     inkscape:window-width="1920"
     inkscape:window-height="1032"
     id="namedview6"
     showgrid="false"
     borderlayer="false"
     inkscape:showpageshadow="false"
     fit-margin-top="0"
     fit-margin-left="0"
     fit-margin-right="0"
     fit-margin-bottom="0"
     inkscape:zoom="1.6132812"
     inkscape:cx="256"
     inkscape:cy="256"
     inkscape:window-x="0"
     inkscape:window-y="23"
     inkscape:window-maximized="1"
     inkscape:current-layer="svg4" />
  <circle
     style="opacity:1;fill:none;fill-opacity:1;stroke:none;stroke-width:1.37484574;stroke-linecap:round;stroke-linejoin:round;stroke-miterlimit:4;stroke-dasharray:none;stroke-dashoffset:0;stroke-opacity:1;paint-order:stroke fill markers"
     id="path816"
     cx="26.214399"
     cy="26.214399"
     r="26.214399" />
  <path
     d="M 51.440544,23.87884 28.549214,0.98874075 c -1.317503,-1.31832004 -3.455655,-1.31832004 -4.774796,0 L 19.020922,5.7422408 25.05096,11.77228 c 1.401268,-0.47351 3.008158,-0.15586 4.125158,0.96114 1.122325,1.12417 1.437723,2.74478 0.952747,4.15055 l 5.811308,5.81152 c 1.405978,-0.48436 3.028229,-0.17101 4.151168,0.95377 1.569412,1.5688 1.569412,4.11143 0,5.68126 -1.569821,1.57002 -4.11246,1.57002 -5.6831,0 -1.180489,-1.18172 -1.47213,-2.91539 -0.874512,-4.3697 L 28.11421,19.5413 28.113596,33.80323 a 4.0592113,4.0592113 0 0 1 1.062522,0.75982 c 1.569412,1.56879 1.569412,4.11164 0,5.68269 -1.569821,1.56921 -4.113689,1.56921 -5.681257,0 -1.569412,-1.57105 -1.569412,-4.11369 0,-5.68249 a 4.0252139,4.0252139 0 0 1 1.315045,-0.87676 V 19.29165 A 3.968688,3.968688 0 0 1 23.494861,18.41488 C 22.30577,17.22743 22.019864,15.48271 22.629155,14.02266 L 16.68493,8.0778208 0.98876665,23.77296 c -1.31893647,1.31955 -1.31893647,3.45791 0,4.77643 L 23.880506,51.4399 c 1.317913,1.31853 3.455655,1.31853 4.775206,0 L 51.440339,28.65569 c 1.318527,-1.31894 1.318527,-3.45852 0,-4.77685"
     id="path2"
     inkscape:connector-curvature="0"
     style="fill:#de4c36;stroke-width:0.20480379" />
</svg>
