<?xml version="1.0" encoding="UTF-8" standalone="no"?>
<svg
   xmlns:dc="http://purl.org/dc/elements/1.1/"
   xmlns:cc="http://creativecommons.org/ns#"
   xmlns:rdf="http://www.w3.org/1999/02/22-rdf-syntax-ns#"
   xmlns:svg="http://www.w3.org/2000/svg"
   xmlns="http://www.w3.org/2000/svg"
   xmlns:sodipodi="http://sodipodi.sourceforge.net/DTD/sodipodi-0.dtd"
   xmlns:inkscape="http://www.inkscape.org/namespaces/inkscape"
   inkscape:version="1.0 (1.0+r73+1)"
   sodipodi:docname="hw-msx2.svg"
   viewBox="0 0 135.47046 42.796479"
   version="1.1"
   height="161.74951"
   width="512"
   id="svg5942">
  <defs
     id="defs9" />
  <sodipodi:namedview
     fit-margin-bottom="0"
     fit-margin-right="0"
     fit-margin-left="0"
     fit-margin-top="0"
     inkscape:showpageshadow="false"
     inkscape:current-layer="g63"
     inkscape:window-maximized="1"
     inkscape:window-y="24"
     inkscape:window-x="0"
     inkscape:cy="80.874756"
     inkscape:cx="256"
     inkscape:zoom="3.5566406"
     showgrid="false"
     id="namedview7"
     inkscape:window-height="1033"
     inkscape:window-width="1920"
     inkscape:pageshadow="2"
     inkscape:pageopacity="0"
     guidetolerance="10"
     gridtolerance="10"
     objecttolerance="10"
     borderopacity="1"
     bordercolor="#666666"
     pagecolor="#ffffff" />
  <metadata
     id="metadata5939">
    <rdf:RDF>
      <cc:Work
         rdf:about="">
        <dc:format>image/svg+xml</dc:format>
        <dc:type
           rdf:resource="http://purl.org/dc/dcmitype/StillImage" />
        <dc:title></dc:title>
      </cc:Work>
    </rdf:RDF>
  </metadata>
  <g
     transform="matrix(0.91103203,0,0,0.91103203,-14.499623,-0.43979105)"
     id="g63">
    <g
       transform="matrix(0.80675793,0,0,0.80675793,3.0755638,0.09316142)"
       id="g251">
      <path
         style="fill:#000000;stroke-width:1.01887"
         id="path6498"
         d="M 15.915602,29.596691 V 0.48209699 H 164.6156 V 58.711283 H 15.915602 Z" />
      <path
         style="fill:#ffffff;fill-opacity:1;stroke:none;stroke-width:0;stroke-linecap:butt;stroke-linejoin:miter;stroke-miterlimit:4;stroke-dasharray:none;stroke-opacity:1"
         d="M 21.102814,53.354856 33.102667,5.669306 h 11.127132 l 5.781747,20.814247 5.999928,-20.814247 h 10.472597 l 9.818063,35.130929 23.954516,-0.04562 c 2.51459,-0.02474 2.66883,-5.27417 -0.18622,-5.2728 L 86.120197,35.293809 C 80.129691,35.35231 73.812739,28.809729 74.120345,20.096104 74.18425,12.103552 81.087976,5.809513 89.919615,5.8116812 l 35.581905,-0.032244 9.05444,12.4444968 8.83626,-12.5546256 14.7271,0.1101277 -16.14527,22.9066829 17.45433,24.837845 -14.64995,-0.04562 -10.15857,-14.252168 -9.66378,14.252168 -14.94526,-0.01325 17.01796,-24.558614 -7.41809,-10.902701 -30.930765,0.04562 c -3.375635,0.03123 -3.251861,5.392286 0.02647,5.291691 l 13.032325,0.201363 c 5.50793,0.03601 13.26499,5.814145 13.07203,14.835064 0.0842,10.487482 -9.2725,15.278572 -13.77723,15.023064 l -34.113093,0.0456 -5.672658,-21.456128 -5.67266,21.410507 H 44.807197 L 38.884411,32.100169 33.680063,53.432803 Z"
         id="path2830"
         sodipodi:nodetypes="cccccccccccccccccccccccccccccccccccc" />
      <path
         style="fill:#000000;stroke-width:1.20452"
         id="path17"
         d="m 168.97207,58.480375 c 1.6e-4,-0.12668 0.14028,-1.707285 0.31141,-3.512614 0.57191,-6.033309 2.71931,-11.566019 5.85551,-15.085381 0.85309,-0.957506 3.50997,-3.337357 5.90406,-5.288555 4.76953,-3.887099 6.51741,-5.923577 6.82071,-7.947047 0.4276,-2.852659 -0.98456,-5.095471 -3.20836,-5.095471 -2.2328,0 -3.40384,1.687168 -3.40384,4.903832 v 1.85255 H 169.2789 v -1.486376 c 0,-2.012027 0.98543,-5.728204 2.10995,-7.956683 0.50812,-1.006964 1.61549,-2.587786 2.4607,-3.512976 5.4572,-5.973204 16.25737,-5.997054 22.29805,-0.04927 5.60003,5.513318 5.41694,15.785205 -0.38417,21.562072 -0.97451,0.970407 -3.47444,2.916137 -5.55549,4.323858 -2.08092,1.40772 -4.49851,3.265928 -5.37239,4.129449 l -1.58875,1.569966 16.42359,0.163575 v 11.659979 h -15.34917 c -8.44235,0 -15.34917,-0.103707 -15.34917,-0.230327 z" />
    </g>
  </g>
</svg>
