<?xml version="1.0" encoding="UTF-8" standalone="no"?>
<!-- Generator: Adobe Illustrator 20.1.0, SVG Export Plug-In . SVG Version: 6.00 Build 0)  -->

<svg
   xmlns:dc="http://purl.org/dc/elements/1.1/"
   xmlns:cc="http://creativecommons.org/ns#"
   xmlns:rdf="http://www.w3.org/1999/02/22-rdf-syntax-ns#"
   xmlns:svg="http://www.w3.org/2000/svg"
   xmlns="http://www.w3.org/2000/svg"
   xmlns:sodipodi="http://sodipodi.sourceforge.net/DTD/sodipodi-0.dtd"
   xmlns:inkscape="http://www.inkscape.org/namespaces/inkscape"
   version="1.1"
   id="Layer_1"
   x="0px"
   y="0px"
   width="512"
   height="512"
   viewBox="0 0 512 511.99999"
   xml:space="preserve"
   sodipodi:docname="rancher.svg"
   inkscape:version="0.92.4 (unknown)"><metadata
   id="metadata34"><rdf:RDF><cc:Work
       rdf:about=""><dc:format>image/svg+xml</dc:format><dc:type
         rdf:resource="http://purl.org/dc/dcmitype/StillImage" /><dc:title></dc:title></cc:Work></rdf:RDF></metadata><defs
   id="defs32"><clipPath
     clipPathUnits="userSpaceOnUse"
     id="clipPath832"><circle
       r="256"
       cy="256"
       cx="256"
       id="circle834"
       style="opacity:0.5;fill:#ff0000;fill-opacity:1;stroke:none;stroke-width:13.42622757;stroke-linecap:round;stroke-linejoin:round;stroke-miterlimit:4;stroke-dasharray:none;stroke-dashoffset:0;stroke-opacity:1;paint-order:stroke fill markers" /></clipPath></defs><sodipodi:namedview
   pagecolor="#ffffff"
   bordercolor="#666666"
   borderopacity="1"
   objecttolerance="10"
   gridtolerance="10"
   guidetolerance="10"
   inkscape:pageopacity="0"
   inkscape:pageshadow="2"
   inkscape:window-width="1920"
   inkscape:window-height="1032"
   id="namedview30"
   showgrid="false"
   inkscape:showpageshadow="false"
   fit-margin-top="0"
   fit-margin-left="0"
   fit-margin-right="0"
   fit-margin-bottom="0"
   inkscape:zoom="1.6132812"
   inkscape:cx="256"
   inkscape:cy="256"
   inkscape:window-x="0"
   inkscape:window-y="23"
   inkscape:window-maximized="1"
   inkscape:current-layer="Layer_1" />
<style
   type="text/css"
   id="style19">
	.st0{fill:url(#SVGID_1_);}
</style>

<linearGradient
   id="SVGID_1_"
   gradientUnits="userSpaceOnUse"
   x1="175.5"
   y1="445.49481"
   x2="175.5"
   y2="114.0346"
   gradientTransform="matrix(1.2366552,0,0,1.2396694,-562.97792,202.45715)">
	<stop
   offset="0"
   style="stop-color:#FFF100"
   id="stop22" />
	<stop
   offset="1"
   style="stop-color:#F05A28"
   id="stop24" />
</linearGradient>

<circle
   style="opacity:1;fill:none;fill-opacity:1;stroke:none;stroke-width:13.42622757;stroke-linecap:round;stroke-linejoin:round;stroke-miterlimit:4;stroke-dasharray:none;stroke-dashoffset:0;stroke-opacity:1;paint-order:stroke fill markers"
   id="path816"
   cx="256"
   cy="256"
   r="256" /><path
   class="st0"
   d="m 438.74333,146.40157 -9.52412,-57.691861 c -2.98064,-18.439951 -10.42635,-33.606998 -16.08299,-33.606998 -5.6605,0 -10.42253,15.463543 -10.42253,34.200009 v 15.16703 c 0,18.73263 -15.48534,34.20002 -34.24819,34.20002 h -18.46596 v 41.33497 h 60.15989 c 18.76288,0 31.56835,-15.16705 28.5916,-33.60317 M 302.65283,97.631312 H 113.54741 c -1.19147,0 -2.08217,0 -3.27752,0.296478 v -8.921566 c 0,-18.736466 -4.76201,-34.200011 -10.418665,-34.200011 -5.656627,0 -13.106234,15.167049 -16.079128,33.603173 l -9.531828,57.691864 c -2.980623,18.43998 9.824849,33.60701 28.587711,33.60701 h 56.87856 a 53.674267,53.598746 0 0 0 16.07913,-2.37962 c -1.78528,9.81108 -10.41868,16.94986 -20.5443,16.94986 H 75.431727 c -12.80547,0 -22.634184,-11.59767 -20.551981,-24.3851 l 8.043431,-48.47379 C 65.005361,108.63601 55.180514,97.034474 42.371178,97.034474 H -353.99345 a 21.157379,21.12761 0 0 0 -19.05975,12.194496 l -74.45375,114.19384 c -1.19149,1.78279 -1.19149,4.45886 0.30075,6.24551 l 14.59075,16.9498 c 1.7853,2.07927 5.06282,2.37962 7.14501,0.593 l 50.6281,-39.84865 v 242.66135 a 20.717803,20.688653 0 0 0 20.84504,20.81958 h 112.56943 a 20.717803,20.688653 0 0 0 20.84506,-20.81958 v -84.45264 a 20.717803,20.688653 0 0 1 20.84506,-20.8196 H 81.385281 a 20.717803,20.688653 0 0 1 20.848889,20.8196 v 84.45264 a 20.717803,20.688653 0 0 0 20.84508,20.81958 h 112.56556 a 20.717803,20.688653 0 0 0 20.84892,-20.81958 v -90.69813 h -59.86302 c -18.76286,0 -34.24819,-15.46356 -34.24819,-34.20002 v -58.28481 a 34.410139,34.361723 0 0 1 13.70006,-27.36154 v 69.58597 c 0,18.73646 15.48533,34.20002 34.24821,34.20002 h 92.01742 c 18.76285,0 34.2482,-15.46356 34.2482,-34.20002 V 131.82745 c 0,-18.7326 -15.18844,-34.196138 -33.94744,-34.196138"
   id="path6"
   inkscape:connector-curvature="0"
   style="fill:#0075a8;stroke-width:1.84905601"
   clip-path="url(#clipPath832)" /></svg>