<?xml version="1.0" encoding="UTF-8" standalone="no"?>
<!-- Generator: Adobe Illustrator 23.0.1, SVG Export Plug-In . SVG Version: 6.00 Build 0)  -->

<svg
   xmlns:ns="http://ns.adobe.com/SaveForWeb/1.0/"
   xmlns:dc="http://purl.org/dc/elements/1.1/"
   xmlns:cc="http://creativecommons.org/ns#"
   xmlns:rdf="http://www.w3.org/1999/02/22-rdf-syntax-ns#"
   xmlns:svg="http://www.w3.org/2000/svg"
   xmlns="http://www.w3.org/2000/svg"
   xmlns:sodipodi="http://sodipodi.sourceforge.net/DTD/sodipodi-0.dtd"
   xmlns:inkscape="http://www.inkscape.org/namespaces/inkscape"
   version="1.1"
   id="Livello_1"
   x="0px"
   y="0px"
   viewBox="0 0 571.09746 511.99998"
   xml:space="preserve"
   sodipodi:docname="ms-publisher.svg"
   width="571.09747"
   height="512"
   inkscape:version="0.92.4 (unknown)"><defs
   id="defs42" /><sodipodi:namedview
   pagecolor="#ffffff"
   bordercolor="#666666"
   borderopacity="1"
   objecttolerance="10"
   gridtolerance="10"
   guidetolerance="10"
   inkscape:pageopacity="0"
   inkscape:pageshadow="2"
   inkscape:window-width="1600"
   inkscape:window-height="851"
   id="namedview40"
   showgrid="false"
   inkscape:showpageshadow="false"
   fit-margin-top="0"
   fit-margin-left="0"
   fit-margin-right="0"
   fit-margin-bottom="0"
   inkscape:zoom="1.2597656"
   inkscape:cx="285.54874"
   inkscape:cy="256"
   inkscape:window-x="0"
   inkscape:window-y="24"
   inkscape:window-maximized="1"
   inkscape:current-layer="Livello_1" />
<style
   type="text/css"
   id="style2">
	.st0{fill:#038387;}
	.st1{fill:#37C6D0;}
	.st2{fill:#1A9BA1;}
	.st3{opacity:0.2;enable-background:new    ;}
	.st4{opacity:0.1;enable-background:new    ;}
	.st5{fill:url(#SVGID_1_);}
	.st6{fill:#FFFFFF;}
</style>
<metadata
   id="metadata4">
	<ns:sfw>
		<ns:slices />
		<ns:sliceSourceBounds
   bottomLeftOrigin="true"
   height="1148.8"
   width="1281.4"
   x="-622.8"
   y="-539" />
	</ns:sfw>
<rdf:RDF><cc:Work
     rdf:about=""><dc:format>image/svg+xml</dc:format><dc:type
       rdf:resource="http://purl.org/dc/dcmitype/StillImage" /><dc:title>Publisher_64x</dc:title></cc:Work></rdf:RDF></metadata>
<title
   id="title6">Publisher_64x</title>








<linearGradient
   id="SVGID_1_"
   gradientUnits="userSpaceOnUse"
   x1="113.8111"
   y1="204.9937"
   x2="541.25592"
   y2="945.34967">
	<stop
   offset="0"
   style="stop-color:#058F92"
   id="stop24" />
	<stop
   offset="0.5"
   style="stop-color:#038489"
   id="stop26" />
	<stop
   offset="1"
   style="stop-color:#026D71"
   id="stop28" />
</linearGradient>



<g
   id="g56"
   transform="scale(0.44568245)"><path
     id="path8"
     d="m 887.2,104.9 h 341.3 c 29.2,0 52.9,23.7 52.9,52.9 v 833 c 0,29.2 -23.7,52.9 -52.9,52.9 H 887.2 c -29.2,0 -52.9,-23.7 -52.9,-52.9 v -833 c 0.1,-29.2 23.7,-52.9 52.9,-52.9 z"
     class="st0"
     inkscape:connector-curvature="0"
     style="fill:#038387" /><path
     id="path10"
     d="M 1050.6,1148.8 H 356.7 c -30.8,0 -55.8,-24.5 -55.8,-54.7 V 861.6 l 439.3,-95.7 366.1,95.7 v 232.5 c 0,30.2 -25,54.7 -55.7,54.7 z"
     class="st0"
     inkscape:connector-curvature="0"
     style="fill:#038387" /><path
     id="path12"
     d="M 1048.8,0 H 358.5 C 326.7,0 300.9,25.4 301,56.6 v 517.8 l 414.9,47.9 390.5,-47.9 V 56.6 C 1106.4,25.4 1080.6,0 1048.8,0 Z"
     class="st1"
     inkscape:connector-curvature="0"
     style="fill:#37c6d0" /><rect
     id="rect14"
     height="287.20001"
     width="805.40002"
     class="st2"
     y="574.40002"
     x="301"
     style="fill:#1a9ba1" /><path
     id="path16"
     d="m 675.3,305.2 v 616.2 c 0.1,3.1 -0.3,6.3 -0.9,9.4 -4.4,26.1 -27.1,45.3 -53.6,45.2 H 301 V 250.6 h 319.8 c 30.1,-0.1 54.5,24.3 54.5,54.3 0,0.1 0,0.2 0,0.3 z"
     class="st3"
     inkscape:connector-curvature="0"
     style="opacity:0.2;enable-background:new" /><path
     id="path18"
     d="m 698.7,305.2 v 569.4 c -0.4,42.9 -35,77.5 -77.9,77.9 H 301 V 227.2 h 319.8 c 42.9,0.2 77.7,35 77.9,78 z"
     class="st4"
     inkscape:connector-curvature="0"
     style="opacity:0.1;enable-background:new" /><path
     id="path20"
     d="m 675.3,305.2 v 569.4 c 0.1,30.1 -24.3,54.5 -54.3,54.5 -0.1,0 -0.1,0 -0.2,0 H 301 V 250.6 h 319.8 c 30.1,-0.1 54.5,24.3 54.5,54.3 0,0.1 0,0.2 0,0.3 z"
     class="st3"
     inkscape:connector-curvature="0"
     style="opacity:0.2;enable-background:new" /><path
     id="path22"
     d="m 651.9,305.2 v 569.4 c 0.1,30.1 -24.3,54.5 -54.3,54.5 -0.1,0 -0.1,0 -0.2,0 H 301 V 250.6 h 296.4 c 30.1,-0.1 54.5,24.3 54.5,54.3 0,0.1 0,0.2 0,0.3 z"
     class="st4"
     inkscape:connector-curvature="0"
     style="opacity:0.1;enable-background:new" /><path
     id="path31"
     d="m 54.6,247.6 h 545.9 c 30.2,0 54.6,24.4 54.6,54.6 v 545.9 c 0,30.2 -24.4,54.6 -54.6,54.6 H 54.6 C 24.4,902.7 0,878.3 0,848.1 V 302.2 c 0,-30.1 24.4,-54.6 54.6,-54.6 z"
     class="st5"
     style="fill:url(#SVGID_1_)"
     inkscape:connector-curvature="0" /><path
     id="path33"
     d="m 332.7,396.9 c 34.4,-2.3 68.4,7.9 95.8,28.8 23.1,21.3 35.3,51.9 33.2,83.3 0.4,21.9 -5.3,43.4 -16.4,62.3 -11.1,18.4 -27.4,33.1 -46.7,42.4 -21.9,10.5 -45.9,15.7 -70.2,15.1 H 262 V 755.6 H 193.9 V 396.9 Z M 261.9,574 h 58.7 c 18.7,1.4 37.2,-4.3 51.8,-15.9 12.3,-12.2 18.7,-29.1 17.5,-46.4 0,-39.5 -22.4,-59.3 -67.2,-59.3 h -60.8 z"
     class="st6"
     inkscape:connector-curvature="0"
     style="fill:#ffffff" /><rect
     id="rect35"
     height="938.70001"
     width="23.799999"
     class="st3"
     y="104.9"
     x="1106.4"
     style="opacity:0.2;enable-background:new" /><rect
     id="rect37"
     height="938.70001"
     width="23.799999"
     class="st4"
     y="104.9"
     x="1130.2"
     style="opacity:0.1;enable-background:new" /></g>
</svg>