<?xml version="1.0" encoding="UTF-8" standalone="no"?>
<svg
   xmlns:dc="http://purl.org/dc/elements/1.1/"
   xmlns:cc="http://creativecommons.org/ns#"
   xmlns:rdf="http://www.w3.org/1999/02/22-rdf-syntax-ns#"
   xmlns:svg="http://www.w3.org/2000/svg"
   xmlns="http://www.w3.org/2000/svg"
   xmlns:sodipodi="http://sodipodi.sourceforge.net/DTD/sodipodi-0.dtd"
   xmlns:inkscape="http://www.inkscape.org/namespaces/inkscape"
   version="1.1"
   width="731.42859"
   height="512"
   id="svg10"
   sodipodi:docname="bandeira-df.svg"
   inkscape:version="0.92.4 (unknown)">
  <metadata
     id="metadata16">
    <rdf:RDF>
      <cc:Work
         rdf:about="">
        <dc:format>image/svg+xml</dc:format>
        <dc:type
           rdf:resource="http://purl.org/dc/dcmitype/StillImage" />
        <dc:title></dc:title>
      </cc:Work>
    </rdf:RDF>
  </metadata>
  <defs
     id="defs14" />
  <sodipodi:namedview
     pagecolor="#ffffff"
     bordercolor="#666666"
     borderopacity="1"
     objecttolerance="10"
     gridtolerance="10"
     guidetolerance="10"
     inkscape:pageopacity="0"
     inkscape:pageshadow="2"
     inkscape:window-width="1600"
     inkscape:window-height="851"
     id="namedview12"
     showgrid="false"
     inkscape:showpageshadow="false"
     fit-margin-top="0"
     fit-margin-left="0"
     fit-margin-right="0"
     fit-margin-bottom="0"
     inkscape:zoom="1.2597656"
     inkscape:cx="365.71429"
     inkscape:cy="256"
     inkscape:window-x="0"
     inkscape:window-y="24"
     inkscape:window-maximized="1"
     inkscape:current-layer="svg10" />
  <g
     id="g22"
     transform="scale(0.48761905)">
    <rect
       id="rect2"
       height="1050"
       width="1500"
       x="0"
       y="0"
       style="fill:#ffffff" />
    <rect
       id="rect4"
       y="265"
       x="490"
       height="520"
       width="520"
       style="fill:#00923f" />
    <path
       id="path6"
       d="M 713,488 V 383 l 26,-26 v -48 h -26 l 37,-37 37,37 h -26 v 48 l 26,26 v 105 h 105 l 26,26 h 48 v -26 l 37,37 -37,37 v -26 h -48 l -26,26 H 787 v 105 l -26,26 v 48 h 26 l -37,37 -37,-37 h 26 V 693 L 713,667 V 562 H 608 l -26,-26 h -48 v 26 l -37,-37 37,-37 v 26 h 48 l 26,-26 z"
       inkscape:connector-curvature="0"
       style="fill:#f8c300" />
    <path
       id="path8"
       d="m 676,525 74,-74 74,74 -74,74 z"
       inkscape:connector-curvature="0"
       style="fill:#00923f" />
  </g>
</svg>
