<?xml version="1.0" encoding="UTF-8" standalone="no"?>
<svg
   xmlns:dc="http://purl.org/dc/elements/1.1/"
   xmlns:cc="http://creativecommons.org/ns#"
   xmlns:rdf="http://www.w3.org/1999/02/22-rdf-syntax-ns#"
   xmlns:svg="http://www.w3.org/2000/svg"
   xmlns="http://www.w3.org/2000/svg"
   xmlns:sodipodi="http://sodipodi.sourceforge.net/DTD/sodipodi-0.dtd"
   xmlns:inkscape="http://www.inkscape.org/namespaces/inkscape"
   width="512"
   height="512"
   viewBox="0 0 39.476428 39.476428"
   version="1.1"
   id="svg12"
   sodipodi:docname="lang-java-old.svg"
   inkscape:version="0.92.4 (unknown)">
  <metadata
     id="metadata18">
    <rdf:RDF>
      <cc:Work
         rdf:about="">
        <dc:format>image/svg+xml</dc:format>
        <dc:type
           rdf:resource="http://purl.org/dc/dcmitype/StillImage" />
        <dc:title></dc:title>
      </cc:Work>
    </rdf:RDF>
  </metadata>
  <defs
     id="defs16" />
  <sodipodi:namedview
     pagecolor="#ffffff"
     bordercolor="#666666"
     borderopacity="1"
     objecttolerance="10"
     gridtolerance="10"
     guidetolerance="10"
     inkscape:pageopacity="0"
     inkscape:pageshadow="2"
     inkscape:window-width="1920"
     inkscape:window-height="1032"
     id="namedview14"
     showgrid="false"
     inkscape:showpageshadow="false"
     fit-margin-top="0"
     fit-margin-left="0"
     fit-margin-right="0"
     fit-margin-bottom="0"
     inkscape:zoom="1.6132812"
     inkscape:cx="256"
     inkscape:cy="256"
     inkscape:window-x="0"
     inkscape:window-y="23"
     inkscape:window-maximized="1"
     inkscape:current-layer="svg12" />
  <circle
     style="opacity:1;fill:none;fill-opacity:1;stroke:none;stroke-width:1.0351944;stroke-linecap:round;stroke-linejoin:round;stroke-miterlimit:4;stroke-dasharray:none;stroke-dashoffset:0;stroke-opacity:1;paint-order:stroke fill markers"
     id="path816"
     cx="19.738214"
     cy="19.738214"
     r="19.738214" />
  <g
     id="g834"
     transform="matrix(0.2737105,0,0,0.2737105,-6.2973047,-0.57620196)">
    <path
       d="m 106.426,38.458 -0.404,-0.202 v -0.337 c 2.627,-2.458 5.354,-4.949 8.014,-7.474 1.01,-1.38 2.053,-2.794 3.098,-4.175 2.592,-3.03 3.533,-9.258 1.75,-12.792 -2.828,-5.724 -5.959,-7.643 -11.953,-9.36 -1.986,-0.236 -1.986,-0.236 -2.254,-0.371 -7.139,0 -12.356,2.02 -17.844,6.666 -0.909,1.146 -2.087,2.29 -3.03,3.401 -3.938,6.464 -5.722,13.298 -6.228,20.906 -0.504,7.71 -0.471,10.37 -0.471,11.076 0.067,-0.033 0.134,-0.067 0.202,-0.067 0.067,-0.034 0.102,-0.034 0.135,-0.067 1.717,-1.179 3.872,-4.916 4.781,-6.768 1.649,-6.026 4.478,-11.648 6.093,-17.675 0.371,-2.391 0.573,-4.68 0.707,-7.002 h 0.371 c 0.438,1.043 0.438,1.043 0.505,1.616 0,0.033 0.034,0.067 0.034,0.101 0,1.077 -0.034,2.121 -0.034,3.164 -0.741,6.262 -3.637,12.794 -5.791,18.685 a 9.74,9.74 0 0 0 -0.134,1.044 c 0.909,-0.336 1.817,-1.28 2.625,-1.919 a 358.646,358.646 0 0 1 5.825,-3.872 c 1.851,-1.885 1.515,-4.949 1.683,-7.407 h 0.64 c 0.539,1.785 -0.068,3.67 0.741,5.353 0.437,0.169 0.909,0.371 1.38,0.539 0.168,0.404 0.168,0.404 0.135,1.178 -2.593,1.38 -2.357,1.415 -2.324,4.478 1.954,0.101 6.768,-6.161 8.317,-1.515 -0.102,2.323 -0.943,0.741 -1.785,0.336 -1.75,0.168 -4.612,2.525 -6.161,3.501 -0.337,0.27 -0.64,0.573 -0.977,0.842 -0.606,1.313 -1.246,1.246 -2.559,1.649 v 0.27 c -1.717,0.909 -3.468,2.929 -3.771,4.915 0.203,0.539 0.203,0.539 0.74,1.179 h 0.472 c 3.973,-3.467 9.797,-7.912 15.352,-7.912 0.168,0.135 0.336,0.269 0.539,0.404 v 0.438 c -1.617,0.572 -3.299,0.674 -4.881,1.145 -2.492,1.111 -2.492,1.111 -4.748,2.357 -1.312,0.841 -4.916,3.434 -5.319,4.544 -0.809,0.236 -4.579,6.834 -5.185,8.081 -0.269,1.178 -1.01,2.592 0.034,3.635 1.178,0.572 2.996,1.65 4.511,1.481 0.202,-0.875 0.303,-2.356 0.573,-3.232 0,-2.828 -2.828,-1.784 -3.198,-3.501 1.683,-0.033 2.188,0.707 3.771,1.044 l 0.505,-0.404 c 0.605,-0.875 8.686,-12.558 10.469,-9.695 -0.066,1.413 -2.625,2.154 -3.164,3.602 -0.572,0.202 -1.145,0.774 -1.379,1.347 -0.102,0.034 -0.203,0.067 -0.27,0.101 -1.448,1.952 -4.68,5.05 -4.309,7.844 -0.741,1.414 -1.011,1.616 -1.011,3.333 0.169,0.134 0.304,0.302 0.472,0.437 5.554,2.56 9.796,3.536 8.181,10.437 -0.303,0.943 -0.943,2.255 -0.943,3.299 l -5.386,8.417 a 1.021,1.021 0 0 1 -0.236,0.168 c -0.707,1.212 -0.774,1.279 -0.842,1.548 l -0.841,1.313 c -1.583,0.808 -1.683,3.905 -3.434,3.434 0,-1.415 0.336,-1.785 1.043,-2.962 v -0.102 c 0.504,-0.639 0.976,-1.279 1.448,-1.919 0.808,-0.875 2.02,-2.322 2.491,-3.4 a 43.263,43.263 0 0 0 1.515,-2.29 c 0.034,0 0.034,-0.033 0.034,-0.033 0,0 0.034,-0.034 0.034,-0.067 0.471,-0.774 0.942,-1.549 1.346,-2.323 a 0.41,0.41 0 0 0 0.135,-0.303 c 0.202,-0.37 0.403,-0.741 0.573,-1.111 H 96.9 c 2.526,-3.064 3.401,-7.542 0.303,-10.403 -1.717,-0.841 -3.838,-2.087 -5.69,-2.019 -0.538,3.669 4.41,6.699 4.579,10.133 -0.168,-0.135 -0.37,-0.236 -0.539,-0.336 C 93.029,71.551 90.637,68.858 89.594,64.851 88.18,63.336 86.901,63.268 85.016,62.763 84.848,62.73 84.645,62.73 84.477,62.696 v 0.336 c 0.37,0.371 0.74,0.775 1.111,1.179 0.707,1.144 1.852,3.097 1.852,4.579 a 10.216,10.216 0 0 0 -0.741,3.804 c 0.606,0.774 1.784,2.154 4.478,4.781 -3.198,-1.481 -4.478,-3.569 -5.185,-3.535 -0.909,1.683 -1.953,3.333 -3.03,4.983 0.034,0.033 0.034,0.067 0.034,0.101 l -1.582,2.154 c -0.135,0 -0.236,0.067 -0.371,0.101 v 0.37 L 79.829,83.2 c -0.067,0.034 -0.167,0.067 -0.269,0.102 -0.74,1.245 -1.583,2.188 -3.063,2.356 -0.303,-1.313 1.111,-1.548 1.346,-2.423 H 77.81 c 1.885,-1.583 2.794,-3.333 3.669,-5.084 0.472,-0.572 1.01,-1.246 1.01,-1.886 h -0.033 c 0.134,-0.302 0.336,-0.605 0.539,-0.908 0.202,-0.135 0.236,-0.168 0.673,-0.708 0.101,-0.269 0.202,-0.538 0.303,-0.774 0.168,-0.337 0.302,-0.707 0.336,-1.078 0.033,-0.201 0.033,-0.369 0,-0.471 -0.068,-0.37 -0.236,-0.774 -0.573,-1.212 h 0.101 c -1.077,-1.044 -1.279,-3.905 -1.582,-8.417 -0.91,-0.741 -2.189,-2.155 -3.233,-2.323 -1.414,0.438 -2.794,0.875 -4.174,1.347 -3.266,0.235 -3.266,0.235 -5.858,0.235 C 63.5,61.35 58.248,58.825 55.151,54.079 53.299,50.88 52.054,48.187 51.246,44.753 l -0.404,-3.636 v -3.4 -0.134 c 0.909,-13.096 8.35,-21.984 19.762,-27.101 3.03,-0.64 5.892,-1.987 9.09,-1.987 v 0.37 c -4.074,0.775 -8.821,3.771 -11.985,6.363 -2.525,2.963 -6.733,8.013 -7.541,16.631 -0.438,8.989 2.794,12.221 5.588,13.938 0.942,0.674 8.619,3.905 9.628,2.188 0.809,-9.157 1.178,-18.146 3.603,-26.865 2.828,-7.777 6.228,-12.424 13.635,-16.126 1.313,-0.505 2.626,-0.977 3.973,-1.482 3.67,-0.808 6.834,-0.841 10.706,-0.37 4.781,1.28 9.527,3.636 11.75,8.518 1.615,3.333 0.674,8.384 0.404,10.032 0,-0.033 -1.078,5.926 -4.578,10.168 v 1.01 c -1.246,1.884 -5.893,5.285 -8.451,5.588 z m 1.447,39.793 c 0.236,-0.135 0.438,-0.337 0.674,-0.741 1.48,-4.141 -0.471,-5.588 -3.502,-7.709 -3.197,-1.616 -4.914,-2.929 -6.969,-5.858 -0.773,-1.684 -1.077,-1.986 -1.178,-4.545 2.256,-8.382 9.057,-14.341 15.991,-19.088 5.051,-3.165 5.455,-3.535 6.027,-3.535 1.65,-2.424 3.299,-5.185 5.387,-7.238 0.875,0 1.482,0.102 2.424,0.472 -0.033,0.033 -0.369,0.033 -0.438,0.067 -1.145,1.279 -2.693,3.299 -3.67,4.78 0.303,0.438 0.539,0.067 0.707,1.28 -0.641,0.269 -1.312,0.505 -2.053,0.774 -3.064,3.939 -5.117,8.888 -3.838,13.803 1.717,3.872 5.049,7.609 7.641,11.11 0.674,1.246 0.674,1.246 1.045,2.255 l -0.809,-0.303 c -3.805,-5.151 -9.426,-10.908 -9.695,-15.419 0.066,-5.286 0.773,-5.791 1.885,-9.292 -0.236,0 -0.674,0.336 -0.875,0.371 -7.541,4.813 -13.871,9.393 -17.607,17.742 -0.74,2.625 -0.773,3.266 -0.236,6.026 1.246,2.828 3.467,4.174 5.994,5.656 0.471,0.336 2.49,1.683 2.592,1.75 2.053,1.683 3.602,2.996 3.332,5.959 -0.201,0.707 -0.234,0.74 -0.27,1.279 l -2.256,3.804 c -0.336,0.202 -0.605,0.505 -0.875,0.909 -0.303,0.202 -0.303,0.202 -1.75,1.919 -0.473,0.336 -0.91,0.505 -1.111,1.044 -1.885,0.74 -4.545,5.184 -6.396,4.005 0.068,-1.211 1.818,-2.356 2.795,-3.097 0.336,-1.212 3.871,-2.761 4.275,-4.209 1.413,-1.277 2.187,-2.591 2.759,-3.971 z M 71.783,60.644 C 65.151,60.543 61.514,59.331 56.802,54.012 51.82,46.606 51.146,40.141 52.863,31.825 c 1.448,-5.083 3.098,-7.709 5.893,-11.244 1.784,-2.087 4.511,-4.848 7.743,-6.396 -1.144,1.447 -2.02,2.728 -2.861,3.737 -3.973,6.598 -5.622,13.029 -4.41,20.839 2.727,8.922 8.012,9.09 15.554,11.244 0,1.482 -0.673,2.728 -0.606,4.208 1.414,0.337 1.582,1.279 2.323,2.727 0.438,0.573 1.279,1.381 1.212,2.256 -1.585,1.01 -4.109,1.346 -5.928,1.448 z m 6.767,-2.795 c -1.246,-2.154 -2.896,-5.555 -1.65,-7.911 1.549,-0.337 3.603,-0.977 5.286,-0.876 0,0.202 -0.034,0.404 -0.034,0.573 -1.953,2.962 -3.165,4.646 -3.165,8.214 z M 78.449,47.648 c -0.102,-0.639 1.38,-2.861 2.02,-3.03 0,0.809 -0.371,2.391 -0.977,2.997 -0.369,0 -0.706,0.033 -1.043,0.033 z m 3.232,0.067 a 6.756,6.756 0 0 1 -0.472,-0.202 c 0,-0.203 0,-0.404 0.034,-0.606 1.346,-3.872 2.29,-6.397 6.026,-8.282 0.809,-0.539 4.613,-3.771 5.387,-3.097 0.067,1.279 -0.471,3.535 -1.346,4.545 -3.333,2.189 -5.253,7.238 -9.629,7.642 z m -0.438,9.461 c 0,-4.007 2.458,-6.733 5.016,-9.596 h 0.606 c 0.371,1.617 0.303,3.064 -0.539,4.68 -1.312,1.684 -2.726,4.579 -5.083,4.916 z m 0.909,2.289 c -0.034,-0.236 -0.067,-0.438 -0.101,-0.673 0.438,-0.337 0.37,-0.371 0.943,-0.438 -0.034,0.438 -0.034,0.438 -0.27,1.077 -0.202,0 -0.37,0.034 -0.572,0.034 z m 2.559,10.134 c -0.472,-0.336 -0.875,-3.972 -0.572,-4.613 1.111,0.371 1.312,3.569 0.841,4.546 -0.101,0.033 -0.202,0.067 -0.269,0.067 z"
       id="path4"
       inkscape:connector-curvature="0"
       style="clip-rule:evenodd;fill:#cc2229;fill-rule:evenodd" />
    <path
       d="m 117.906,84.715 c 1.246,-0.034 2.492,-0.034 3.736,-0.067 0,-0.068 0.033,-0.135 0.068,-0.203 0.875,-0.202 1.816,-0.606 2.828,-0.639 v 0.673 c -1.584,0.909 -2.627,1.077 -4.377,1.28 -0.875,0.403 -1.684,0.875 -2.559,1.178 -0.438,-0.067 -0.438,-0.067 -4.041,0.438 -1.379,0.067 -3.23,0.404 -4.543,0.067 -0.035,-0.067 -0.035,-0.168 -0.068,-0.235 l 0.201,-0.202 -0.066,-0.774 c 0.27,-0.067 0.537,-0.101 0.807,-0.168 0,-0.033 0.035,-0.101 0.068,-0.168 2.526,-0.574 5.286,-0.675 7.946,-1.18 z M 99.02,77.376 c 0.875,0 1.717,0.034 2.592,0.067 v 0.539 a 55.67,55.67 0 0 1 -5.251,0.438 v -0.135 c -0.809,-0.168 -1.919,0.201 -2.525,-0.067 v -0.37 c 0.37,-0.034 2.929,-0.067 3.165,-0.337 z m 4.578,1.346 c 0.943,0 1.92,-0.034 2.861,-0.034 l 0.035,-0.1 5.15,-0.606 c 3.197,-0.236 6.43,-0.875 9.629,-1.718 0.672,-0.168 1.145,-0.37 1.818,-0.773 3.062,-1.246 6.361,-2.054 9.627,-2.962 -0.438,-1.818 -8.281,1.111 -9.258,1.716 -0.605,0.808 -0.977,1.313 -2.055,1.515 -0.57,-0.034 -1.109,-0.034 -1.379,-0.37 0.605,-0.64 1.75,-0.673 2.223,-1.617 0.672,-0.269 1.178,-0.773 1.682,-1.245 2.762,-0.977 5.287,-1.751 8.148,-2.324 6.16,0 11.816,1.886 15.891,6.834 1.043,0.27 2.256,3.569 2.592,4.814 -0.539,7.608 -8.113,13.938 -13.803,18.147 -3.906,2.188 -7.576,4.24 -11.818,5.354 -1.816,0.168 -3.668,0.336 -5.486,0.504 -0.539,-0.27 -0.539,-0.336 -0.674,-0.74 10.471,-0.809 18.449,-7.307 25.889,-14.174 0.035,-0.101 0.068,-0.168 0.102,-0.27 1.818,-0.673 3.098,-4.881 3.67,-6.463 0.033,-0.034 0.102,-0.034 0.135,-0.067 -0.033,-0.606 -0.068,-1.178 -0.102,-1.75 -0.369,0 -0.201,0.707 -0.168,1.01 h -0.168 c -0.203,0.27 -0.404,0.538 -0.572,0.808 -0.404,-0.034 -0.404,-0.034 -0.572,-0.236 -0.203,-2.021 -0.102,-4.949 -1.852,-6.161 l -1.717,0.034 c -0.203,0.404 -0.203,0.404 -0.707,3.265 -1.111,3.536 -2.559,6.565 -4.545,9.763 -2.357,2.962 -4.982,6.162 -8.451,7.878 v 0.27 c -0.539,0.168 -1.414,0.572 -1.852,0.438 0,-0.135 0.033,-0.236 0.068,-0.336 4.578,-3.805 10.975,-9.865 12.051,-16.026 a 0.26,0.26 0 0 1 0.135,-0.067 c 0,-0.909 0.035,-1.818 0.035,-2.727 h -0.236 c -0.033,-0.64 -0.102,-1.246 -0.135,-1.886 -0.102,-0.068 -0.236,-0.168 -0.336,-0.236 -0.506,0.135 -0.506,0.135 -1.717,0.808 -0.338,0.337 -3.166,5.151 -4.646,7.406 -1.615,1.583 -2.727,3.703 -4.545,5.151 -0.91,1.178 -3.232,3.501 -4.713,3.905 0.135,-0.741 0.605,-1.212 1.01,-1.818 0.303,-0.202 4.006,-4.646 5.15,-6.127 0.908,-2.727 2.525,-5.151 2.525,-8.013 -0.977,-1.852 -2.559,-1.011 -4.107,-1.515 0.201,-0.404 0.941,-0.539 1.447,-0.808 2.93,0 3.064,0.606 4.209,3.232 0.168,0.067 0.303,0.135 0.438,0.236 1.01,-1.616 1.145,-2.458 1.246,-4.208 -2.492,-2.257 -10.639,1.414 -12.928,2.558 -1.986,1.179 -3.604,2.525 -5.354,3.973 -1.953,0.64 -0.775,-1.616 -0.438,-2.188 0.875,-0.707 1.75,-1.415 2.658,-2.122 v -0.438 c -2.996,0 -4.812,1.448 -7.236,2.424 l -7.24,1.279 v -0.101 c -3.904,0.606 -7.877,0.977 -11.782,1.212 v -0.101 c -3.535,-0.37 -6.902,0.269 -10.403,0.269 -3.636,-0.067 -7.542,0.235 -11.009,-0.673 -0.101,-0.27 -0.033,-0.404 0.236,-0.438 6.632,-0.067 12.188,-0.303 18.92,-0.438 0.64,-0.067 4.478,-0.134 5.892,-0.235 2.66,-0.37 5.15,-0.708 7.676,-0.943 -0.033,-0.101 -0.033,-0.202 -0.066,-0.303 -1.314,-0.169 -2.828,0.033 -4.176,0.066 -4.579,0.135 -6.463,0.607 -11.009,0.607 -5.857,0.134 -11.715,0.134 -17.606,0.134 -2.391,-0.067 -4.646,-0.134 -7.07,-0.134 -0.067,0.067 -0.134,0.101 -0.168,0.168 0,0.336 0,0.336 0.168,0.471 l 2.828,0.034 0.101,0.202 c 1.75,0.168 1.75,0.168 1.953,0.303 -0.371,0.942 -1.111,0.167 -1.279,0.774 -1.01,0 -3.165,-0.202 -4.006,0.134 l 0.101,0.573 2.66,1.515 c 0.841,0 1.414,-0.337 2.39,-0.337 0.27,0.842 0.505,0.808 1.583,1.212 3.4,0.741 6.801,1.347 10.403,1.549 0.606,0 8.82,0.067 8.888,0 1.852,0.168 3.77,0.37 5.655,0.37 a 1.962,1.962 0 0 0 -0.067,0.438 c -0.269,0.067 -0.606,0.134 -0.875,0.236 -5.858,-0.135 -11.784,0 -17.641,-0.034 -1.01,0 -9.628,-0.774 -9.864,-1.346 -1.717,0 -9.393,0.235 -9.326,-2.29 0.236,-0.067 0.438,-0.101 0.674,-0.135 2.121,1.279 3.704,1.515 6.464,1.448 -0.034,-0.169 -0.034,-0.303 -0.034,-0.438 -1.38,-0.538 -2.289,-2.39 -3.367,-3.299 -2.256,-0.236 -8.888,-1.548 -6.094,-5.084 4.916,-2.761 11.278,-3.938 16.8,-5.083 1.246,-0.236 5.353,-0.404 6.027,-0.404 1.75,-0.135 3.366,-0.404 5.117,-0.673 l -0.067,-0.068 h 0.102 l 0.37,1.212 c -0.27,-0.303 -1.077,-0.167 -2.66,-0.134 -1.313,0.134 -5.387,0.235 -7.878,0.673 -2.963,0.707 -5.992,1.616 -8.854,2.491 -1.65,0.842 -3.669,0.573 -4.747,2.188 0.438,1.549 2.322,0.673 3.535,0.303 a 297.789,297.789 0 0 1 19.257,-2.356 c 0.101,-0.067 0.168,-0.101 0.235,-0.168 l -0.538,1.01 c -4.579,0.034 -9.326,1.078 -13.871,1.515 -0.605,0.236 -1.986,0.505 -3.232,0.909 v 0.27 c 2.996,0.034 5.993,0.067 9.023,0.135 2.087,-0.404 4.208,-0.438 6.463,-0.606 2.391,0.606 2.963,0.909 5.791,0.977 5.586,-0.135 11.175,-0.471 16.763,-0.774 z m -42.387,1.381 v 0.27 c 0.168,0.067 0.371,0.134 0.539,0.235 -1.684,0.236 -2.861,-0.033 -4.444,-0.74 -0.101,-0.336 -0.202,-0.303 -0.37,-0.371 0.034,-0.808 0.034,-0.808 0.168,-1.145 0.236,0 0.539,-0.033 0.808,-0.033 0.539,0.471 1.01,0.909 1.784,1.347 1.246,0.268 1.246,0.268 1.515,0.437 z m 15.655,14.814 a 0.6,0.6 0 0 0 0.135,0.167 c 1.145,0.034 2.289,0.068 3.4,0.068 0.168,0.168 2.66,0.135 3.131,0.135 7.44,0.302 14.747,-0.068 22.186,-0.943 1.852,-0.606 3.939,-0.606 5.857,-1.246 l 1.381,0.034 c 0,0.404 -0.068,0.471 -0.369,0.809 -3.098,1.447 -7.205,1.347 -10.471,2.154 -4.107,0.236 -4.715,0.37 -6.397,0.438 -4.68,0 -9.326,0.033 -14.006,-0.135 -2.457,-0.269 -5.858,-0.673 -7.979,0.707 0.033,0.17 0.067,0.305 0.135,0.438 1.212,0.506 2.828,0.574 4.242,0.775 4.074,0.236 7.811,0.639 11.817,0.707 a 0.635,0.635 0 0 1 0.235,-0.068 c 8.921,0 17.742,-0.135 26.496,-1.986 1.01,-0.369 1.65,-0.908 2.762,-0.841 v 0.403 c -1.92,1.65 -5.287,1.818 -7.609,2.154 -0.875,0.539 -4.006,0.27 -4.107,0.574 -3.4,0.268 -6.834,0.504 -10.268,0.74 -0.035,0.033 -0.102,0.033 -0.17,0.066 -5.891,-0.033 -11.715,0.035 -17.573,-0.336 -2.895,0.605 -4.949,1.279 -7.306,3.062 -0.034,0.135 -0.034,0.27 -0.034,0.404 1.784,1.381 3.03,-0.236 5.151,-0.135 0.067,0.875 0.067,0.875 0.202,1.213 3.568,0.135 7.137,0.336 10.739,0.336 1.751,-0.066 3.501,-0.102 5.286,-0.135 5.522,-0.135 11.379,-1.111 16.833,-2.424 1.246,-0.168 2.391,-0.773 3.637,-0.809 0.066,1.785 -4.613,2.357 -5.758,2.795 -5.049,0.674 -9.998,1.75 -15.048,1.953 -0.977,0.135 -2.626,-0.168 -3.434,0.168 0.034,0.102 0.066,0.236 0.101,0.371 1.885,0.033 3.804,0.1 5.723,0.201 0.033,0.068 0.067,0.102 0.101,0.168 4.983,0.068 9.932,-0.135 14.948,-0.234 0.572,0 3.367,0.201 3.535,-0.203 0.674,0 1.279,-0.438 1.885,-0.336 0.068,0.438 0.068,0.438 -0.066,0.74 -2.66,1.516 -8.316,3.131 -11.648,3.805 -0.033,0.066 -0.033,0.135 -0.068,0.201 2.121,0 4.277,-0.605 6.33,-0.369 0,0.1 0.033,0.201 0.033,0.336 -2.424,1.447 -5.049,1.279 -7.475,2.154 -2.188,0.303 -2.625,0.506 -4.141,0.707 0.035,0.102 0.102,0.168 0.135,0.27 1.717,0.102 3.4,0.066 5.117,0.033 0.035,-0.066 0.035,-0.135 0.068,-0.201 1.852,-0.168 3.703,-0.336 5.555,-0.539 0,2.289 -15.924,2.861 -20.099,2.963 -2.896,-0.201 -5.589,-0.236 -8.148,-1.615 -2.626,-0.404 -5.622,-0.674 -7.911,-1.92 -0.472,-0.471 -0.472,-0.471 -1.145,-1.516 -1.784,-0.639 -6.127,-1.783 -4.679,-4.611 0.437,-0.371 0.875,-0.707 1.312,-1.078 0,-0.133 -0.033,-0.303 -0.033,-0.438 -1.65,-1.076 -2.592,-1.885 -3.03,-2.053 -1.01,-1.178 -0.875,-1.246 -0.875,-2.627 0.64,-0.842 2.794,-1.918 2.694,-2.625 -0.909,-0.641 -2.021,-1.314 -2.56,-2.087 -0.538,-2.593 -0.269,-2.491 -2.356,-3.703 l -0.034,-0.539 c 1.179,0.067 1.852,0.808 3.064,0.909 0.168,-0.943 0.168,-0.943 0.337,-1.313 3.905,-2.121 9.494,-2.188 13.836,-0.808 v 0.303 c -2.122,0 -4.208,-0.27 -6.195,-0.27 -1.279,0.741 -4.848,1.347 -5.285,2.525 0.943,1.213 6.262,1.887 7.878,2.157 z m -6.699,1.782 c -1.717,-0.639 -2.962,-0.706 -3.4,-2.389 0.91,-1.044 1.818,0.067 3.03,0.673 1.212,0.236 1.212,0.236 2.795,0.809 -0.371,0.672 -1.819,0.808 -2.425,0.907 z m -1.145,6.297 c -1.144,-0.303 -2.086,-0.775 -2.154,-1.92 1.582,-3.23 5.286,-2.289 8.08,-1.75 0.033,0.168 0.033,0.371 0.067,0.572 -1.852,0.506 -3.232,1.516 -4.31,2.963 -0.538,0.034 -1.11,0.067 -1.683,0.135 z m 3.636,6.025 a 13.342,13.342 0 0 1 -2.895,-1.178 v -0.641 c 2.693,-1.75 3.501,-1.109 6.363,0.305 a 0.674,0.674 0 0 0 -0.101,0.369 c -1.111,0.438 -2.289,1.044 -3.367,1.145 z m 7.643,-0.875 5.286,0.102 v 0.506 c -0.472,0.201 -0.909,0.402 -1.38,0.639 -2.357,0 -4.411,0.572 -6.666,-0.068 0.37,-0.741 1.951,-0.942 2.76,-1.179 z m 2.525,4.042 c 2.256,-0.102 4.443,-0.236 6.665,-0.236 4.579,0.168 9.292,-1.178 13.804,-0.74 -0.033,0.033 -0.033,0.066 -0.068,0.1 0,0.641 -10.436,1.482 -11.479,1.584 -2.828,0 -5.622,-0.068 -8.417,-0.068 l -0.606,-0.135 c -0.034,-0.168 -0.034,-0.336 -0.067,-0.504 h 0.168 z m 12.086,-3.739 c 0.033,0.035 0.067,0.068 0.101,0.068 2.829,0.033 5.655,0.066 8.483,0.135 0.102,0.066 0.203,0.135 0.305,0.168 -3.064,1.01 -5.994,1.145 -9.158,1.01 v 0.203 c -2.559,0 -5.152,-0.068 -7.71,-0.17 v -0.234 c 0.741,-0.305 1.448,-0.641 2.189,-0.977 z m -28.987,11.817 a 0.683,0.683 0 0 0 0.135,0.203 l 6.598,0.303 0.101,0.201 c 1.616,0 3.198,0.068 4.781,0.068 l 0.067,0.033 c 6.498,0.068 12.961,-0.033 19.459,-0.033 l 0.201,-0.203 c 2.998,0 6.027,0.068 9.023,0.068 0.336,0.336 9.393,0.033 10.639,0 0.033,0.066 0.066,0.135 0.102,0.168 6.834,0.102 13.803,0.135 19.965,-3.4 2.086,-2.424 -0.338,-1.516 -0.203,-3.164 1.043,-0.539 2.189,1.379 2.457,2.289 0,4.578 -8.854,4.746 -11.648,5.656 l -14.611,2.154 c 0,0 -3.5,0.404 -3.77,0.404 v 0.168 h 3.94 c 1.783,0 3.533,-0.066 5.318,-0.066 0.168,0.168 2.66,0.135 3.098,0.135 2.424,0.066 2.424,0.066 3.365,0.268 0.035,0.068 0.068,0.135 0.135,0.236 -0.404,0.201 -0.807,0.102 -1.178,0.338 -8.518,0 -17,0.369 -25.518,0.404 a 0.41,0.41 0 0 0 -0.102,0.133 c 0.033,0.17 0.033,0.17 0.234,0.236 3.703,0.033 7.408,0.135 11.145,0.135 a 3592.63,3592.63 0 0 1 19.426,-0.168 c 0.033,-0.102 0.066,-0.135 0.1,-0.203 5.656,-0.504 11.549,-0.773 16.834,-3.299 0.943,-0.842 1.684,-1.65 2.256,-2.727 1.717,0.27 -0.371,2.693 -1.078,3.266 -3.668,1.582 -7.775,2.592 -11.615,3.434 -3.803,0.506 -7.709,0.74 -11.211,2.121 l -18.717,1.414 -12.929,1.01 -4.646,0.236 c -6.06,0.033 -11.918,-0.068 -17.81,-0.809 -0.606,-0.236 -1.852,-0.371 -5.959,-1.48 -2.424,-0.943 -4.68,-1.986 -6.834,-3.232 a 119.116,119.116 0 0 0 -8.081,-1.111 c -2.255,-0.775 -8.214,-1.885 -8.551,-4.578 1.885,0.201 3.4,1.783 5.689,1.783 v -0.236 c -1.683,-1.885 -2.794,-3.568 -1.178,-5.789 6.632,-3.703 11.783,-5.285 19.325,-4.578 v 0.336 c -2.896,0.875 -9.292,1.312 -11.178,3.805 0,2.154 1.616,2.49 3.468,3.164 2.963,0.334 5.926,0.807 8.956,0.907 z m 16.16,10.134 c -0.943,0.066 -3.434,0.066 -4.107,-0.168 -4.579,-0.068 -9.528,-1.246 -13.803,-2.559 l -0.201,-0.404 c 3.299,-0.033 6.598,-0.033 9.897,-0.033 2.794,0 5.42,0.369 8.147,0.369 3.198,0.068 7.037,0.338 8.652,0.27 a 0.56,0.56 0 0 0 0.135,0.168 c 3.704,0.035 7.373,0.035 11.076,0 l 0.102,0.135 c 2.828,0 5.656,0.068 8.484,0.068 0.033,0.066 0.066,0.102 0.1,0.168 1.01,0.033 2.021,0.033 3.064,0.066 0.674,-0.066 1.312,-0.133 1.986,0.135 -0.539,0.539 -1.953,0 -2.055,0.371 -4.713,0.303 -9.324,0.773 -14.072,0.875 -1.178,0.068 -4.242,0.707 -5.69,0.438 -3.938,0.035 -7.81,0.236 -11.715,0.101 z m 5.353,-5.824 c -0.875,-0.102 -6.464,-0.203 -7.407,-0.203 a 227.716,227.716 0 0 0 -4.781,-0.066 c -0.707,-0.033 -2.188,0.033 -2.861,-0.168 a 59.661,59.661 0 0 0 -2.559,-0.135 c -0.067,-0.27 -11.346,-0.605 -12.49,-0.674 -0.572,-0.438 -0.572,-0.438 -1.818,-1.818 l -0.741,0.033 c -0.067,0.404 -0.1,0.809 -0.134,1.246 -1.583,0.102 -7.373,-1.145 -8.316,-2.996 0,-1.918 3.401,-3.736 5.083,-3.67 1.078,4.275 3.737,4.344 7.912,5.32 a 497.78,497.78 0 0 0 16.294,1.447 c 0.606,0.102 22.152,0.201 24.105,0.201 1.516,-0.1 3.535,0 3.973,0.338 -1.111,0.975 -6.33,0.773 -7.879,0.842 -0.673,0.133 -3.231,0.066 -3.905,0.234 -2.691,0.036 -3.028,0.136 -4.476,0.069 z"
       id="path6"
       inkscape:connector-curvature="0"
       style="clip-rule:evenodd;fill:#5257a2;fill-rule:evenodd" />
  </g>
</svg>
