<?xml version="1.0" encoding="UTF-8" standalone="no"?>
<svg
   xmlns:dc="http://purl.org/dc/elements/1.1/"
   xmlns:cc="http://creativecommons.org/ns#"
   xmlns:rdf="http://www.w3.org/1999/02/22-rdf-syntax-ns#"
   xmlns:svg="http://www.w3.org/2000/svg"
   xmlns="http://www.w3.org/2000/svg"
   xmlns:sodipodi="http://sodipodi.sourceforge.net/DTD/sodipodi-0.dtd"
   xmlns:inkscape="http://www.inkscape.org/namespaces/inkscape"
   width="628.28986"
   height="512"
   viewBox="0 0 48.442657 39.476428"
   version="1.1"
   id="svg80"
   sodipodi:docname="ms-windows311.svg"
   inkscape:version="0.92.4 (unknown)">
  <metadata
     id="metadata86">
    <rdf:RDF>
      <cc:Work
         rdf:about="">
        <dc:format>image/svg+xml</dc:format>
        <dc:type
           rdf:resource="http://purl.org/dc/dcmitype/StillImage" />
        <dc:title></dc:title>
      </cc:Work>
    </rdf:RDF>
  </metadata>
  <defs
     id="defs84" />
  <sodipodi:namedview
     pagecolor="#ffffff"
     bordercolor="#666666"
     borderopacity="1"
     objecttolerance="10"
     gridtolerance="10"
     guidetolerance="10"
     inkscape:pageopacity="0"
     inkscape:pageshadow="2"
     inkscape:window-width="1600"
     inkscape:window-height="851"
     id="namedview82"
     showgrid="false"
     inkscape:showpageshadow="false"
     fit-margin-top="0"
     fit-margin-left="0"
     fit-margin-right="0"
     fit-margin-bottom="0"
     inkscape:zoom="1.2597656"
     inkscape:cx="314.14493"
     inkscape:cy="256"
     inkscape:window-x="0"
     inkscape:window-y="24"
     inkscape:window-maximized="1"
     inkscape:current-layer="svg80" />
  <g
     id="g994"
     transform="matrix(0.32285418,0,0,0.32285418,-7.536708,-0.91488986)">
    <path
       sodipodi:nodetypes="ccccccccccccccccccccccccccccccccccccccccccccc"
       d="m 101.805,10.426 v 105.548 c 22.572,-13.113 46.541,-11.824 71.584,0.322 V 11.609 C 148.561,-0.215 124.807,0.43 101.805,10.426 Z M 86.329,17.842 V 31.17 L 99.656,24.183 V 11.394 Z m 0,15.262 V 46.433 L 99.656,39.446 V 26.548 Z m 0,15.048 V 61.48 L 99.656,54.601 V 41.704 Z m 0,15.263 V 76.743 L 99.656,69.756 V 56.965 Z m 0,15.047 v 13.221 l 13.327,-6.88 V 71.906 Z m 0,15.477 v 13.329 l 13.327,-6.879 V 87.491 Z m 0,15.262 v 13.328 l 13.327,-6.984 V 102.752 Z M 71.282,22.464 83.641,16.229 v 12.039 l -12.359,6.234 z"
       id="path28"
       inkscape:connector-curvature="0"
       style="clip-rule:evenodd;fill-rule:evenodd" />
    <path
       d="M 71.282,37.834 83.641,31.6 v 12.038 l -12.359,6.234 z m 0,14.617 12.359,-6.234 V 58.256 L 71.282,64.49 Z"
       id="path30"
       inkscape:connector-curvature="0"
       style="clip-rule:evenodd;fill:#d97941;fill-rule:evenodd" />
    <path
       d="M 71.282,67.714 83.641,61.48 V 73.518 L 71.282,79.86 Z"
       id="path32"
       inkscape:connector-curvature="0"
       style="clip-rule:evenodd;fill-rule:evenodd" />
    <path
       d="M 71.282,83.084 83.641,76.85 V 88.888 L 71.282,95.23 Z m 0,14.727 12.359,-6.237 v 12.039 l -12.359,6.342 z"
       id="path34"
       inkscape:connector-curvature="0"
       style="clip-rule:evenodd;fill:#4f89c8;fill-rule:evenodd" />
    <path
       d="m 71.282,113.072 12.359,-6.234 v 12.037 l -12.359,6.232 z M 57.955,21.926 68.487,16.982 v 10.533 l -10.532,5.053 z"
       id="path36"
       inkscape:connector-curvature="0"
       style="clip-rule:evenodd;fill-rule:evenodd" />
    <path
       d="m 57.955,37.403 10.532,-5.05 v 10.64 l -10.532,5.052 z m 0,14.618 10.532,-4.944 v 10.534 l -10.532,5.052 z"
       id="path38"
       inkscape:connector-curvature="0"
       style="clip-rule:evenodd;fill:#d97941;fill-rule:evenodd" />
    <path
       d="M 57.955,67.284 68.487,62.34 v 10.534 l -10.532,5.051 z"
       id="path40"
       inkscape:connector-curvature="0"
       style="clip-rule:evenodd;fill-rule:evenodd" />
    <path
       d="m 57.955,82.762 10.532,-5.053 v 10.642 l -10.532,5.051 z m 0,14.617 10.532,-5.051 v 10.641 l -10.532,4.943 z"
       id="path42"
       inkscape:connector-curvature="0"
       style="clip-rule:evenodd;fill:#4f89c8;fill-rule:evenodd" />
    <path
       d="m 57.955,112.533 10.532,-4.943 v 10.533 l -10.532,5.053 z M 45.592,30.095 54.191,26.226 V 18.38 l -8.599,4.084 z"
       id="path44"
       inkscape:connector-curvature="0"
       style="clip-rule:evenodd;fill-rule:evenodd" />
    <path
       d="m 45.592,45.465 8.599,-3.869 V 33.75 l -8.599,4.084 z m 0,14.618 8.599,-3.87 v -7.954 l -8.599,4.192 z"
       id="path46"
       inkscape:connector-curvature="0"
       style="clip-rule:evenodd;fill:#d97941;fill-rule:evenodd" />
    <path
       d="m 45.592,75.345 8.599,-3.87 v -7.847 l -8.599,4.086 z"
       id="path48"
       inkscape:connector-curvature="0"
       style="clip-rule:evenodd;fill-rule:evenodd" />
    <path
       d="m 45.592,90.823 8.599,-3.977 V 79 l -8.599,4.084 z m 0,14.726 8.599,-3.977 v -7.847 l -8.599,4.086 z"
       id="path50"
       inkscape:connector-curvature="0"
       style="clip-rule:evenodd;fill:#4f89c8;fill-rule:evenodd" />
    <path
       d="m 45.592,120.701 8.599,-3.869 v -7.846 l -8.599,4.086 z M 33.984,17.412 40.218,13.651 v 6.556 l -6.234,3.546 z"
       id="path52"
       inkscape:connector-curvature="0"
       style="clip-rule:evenodd;fill-rule:evenodd" />
    <path
       d="m 33.984,32.783 6.234,-3.762 v 6.663 l -6.234,3.44 z m 0,14.617 6.234,-3.762 v 6.663 l -6.234,3.548 z"
       id="path54"
       inkscape:connector-curvature="0"
       style="clip-rule:evenodd;fill:#d97941;fill-rule:evenodd" />
    <path
       d="M 33.984,62.663 40.218,58.9 v 6.664 l -6.234,3.547 z"
       id="path56"
       inkscape:connector-curvature="0"
       style="clip-rule:evenodd;fill-rule:evenodd" />
    <path
       d="m 33.984,78.138 6.234,-3.761 v 6.557 l -6.234,3.547 z m 0,14.619 6.234,-3.761 v 6.663 l -6.234,3.546 z"
       id="path58"
       inkscape:connector-curvature="0"
       style="clip-rule:evenodd;fill:#4f89c8;fill-rule:evenodd" />
    <path
       d="m 33.984,108.02 6.234,-3.762 v 6.664 l -6.234,3.439 z M 23.344,13.865 28.18,11.394 v 4.729 l -4.836,2.149 z"
       id="path60"
       inkscape:connector-curvature="0"
       style="clip-rule:evenodd;fill-rule:evenodd" />
    <path
       d="m 23.344,29.127 4.836,-2.364 v 4.729 l -4.836,2.15 z m 0,14.618 4.836,-2.256 v 4.728 l -4.836,2.042 z"
       id="path62"
       inkscape:connector-curvature="0"
       style="clip-rule:evenodd;fill:#d97941;fill-rule:evenodd" />
    <path
       d="m 23.344,59.008 4.836,-2.364 v 4.728 l -4.836,2.15 z"
       id="path64"
       inkscape:connector-curvature="0"
       style="clip-rule:evenodd;fill-rule:evenodd" />
    <path
       d="m 23.344,74.486 4.836,-2.365 v 4.622 l -4.836,2.149 z m 0,14.724 4.836,-2.364 v 4.622 l -4.836,2.15 z"
       id="path66"
       inkscape:connector-curvature="0"
       style="clip-rule:evenodd;fill:#4f89c8;fill-rule:evenodd" />
    <path
       d="M 23.344,104.473 28.18,102 v 4.73 l -4.836,2.151 z"
       id="path68"
       inkscape:connector-curvature="0"
       style="clip-rule:evenodd;fill-rule:evenodd" />
    <path
       d="m 101.697,25.151 c 9.459,-4.191 17.197,-6.449 23.971,-6.879 v 33.32 c -8.062,0.644 -16.016,3.117 -23.971,6.771 z"
       id="path70"
       inkscape:connector-curvature="0"
       style="clip-rule:evenodd;fill:#d97941;fill-rule:evenodd" />
    <path
       d="m 135.018,16.767 v 34.072 h 9.459 c 4.191,0 11.07,2.149 14.188,3.332 V 20.529 c -7.847,-3.331 -15.8,-4.514 -23.647,-3.762 z"
       id="path72"
       inkscape:connector-curvature="0"
       style="clip-rule:evenodd;fill:#8abe6c;fill-rule:evenodd" />
    <path
       d="m 135.018,60.62 v 32.782 c 9.137,-0.43 16.123,0.968 23.646,3.439 V 63.737 C 150.818,60.62 142.865,59.653 135.018,60.62 Z"
       id="path74"
       inkscape:connector-curvature="0"
       style="clip-rule:evenodd;fill:#f2ca30;fill-rule:evenodd" />
    <path
       d="m 101.697,68.789 c 8.814,-4.299 16.768,-6.234 23.971,-6.771 v 31.813 c -8.492,1.506 -16.66,3.765 -23.971,7.202 z"
       id="path76"
       inkscape:connector-curvature="0"
       style="clip-rule:evenodd;fill:#4f89c8;fill-rule:evenodd" />
  </g>
</svg>
