<?xml version="1.0" encoding="UTF-8" standalone="no"?>
<svg
   xmlns:dc="http://purl.org/dc/elements/1.1/"
   xmlns:cc="http://creativecommons.org/ns#"
   xmlns:rdf="http://www.w3.org/1999/02/22-rdf-syntax-ns#"
   xmlns:svg="http://www.w3.org/2000/svg"
   xmlns="http://www.w3.org/2000/svg"
   xmlns:sodipodi="http://sodipodi.sourceforge.net/DTD/sodipodi-0.dtd"
   xmlns:inkscape="http://www.inkscape.org/namespaces/inkscape"
   width="512"
   height="512"
   viewBox="0 0 135.46664 135.46653"
   version="1.1"
   id="svg20"
   sodipodi:docname="crio.svg"
   inkscape:version="0.92.4 (unknown)">
  <metadata
     id="metadata26">
    <rdf:RDF>
      <cc:Work
         rdf:about="">
        <dc:format>image/svg+xml</dc:format>
        <dc:type
           rdf:resource="http://purl.org/dc/dcmitype/StillImage" />
        <dc:title></dc:title>
      </cc:Work>
    </rdf:RDF>
  </metadata>
  <defs
     id="defs24" />
  <sodipodi:namedview
     pagecolor="#ffffff"
     bordercolor="#666666"
     borderopacity="1"
     objecttolerance="10"
     gridtolerance="10"
     guidetolerance="10"
     inkscape:pageopacity="0"
     inkscape:pageshadow="2"
     inkscape:window-width="1920"
     inkscape:window-height="1032"
     id="namedview22"
     showgrid="false"
     inkscape:showpageshadow="false"
     fit-margin-top="0"
     fit-margin-left="0"
     fit-margin-right="0"
     fit-margin-bottom="0"
     inkscape:zoom="1.6132812"
     inkscape:cx="256"
     inkscape:cy="256"
     inkscape:window-x="0"
     inkscape:window-y="23"
     inkscape:window-maximized="1"
     inkscape:current-layer="svg20" />
  <circle
     style="opacity:1;fill:none;fill-opacity:1;stroke:none;stroke-width:3.55235386;stroke-linecap:round;stroke-linejoin:round;stroke-miterlimit:4;stroke-dasharray:none;stroke-dashoffset:0;stroke-opacity:1;paint-order:stroke fill markers"
     id="path816"
     cx="67.733292"
     cy="67.733292"
     r="67.733292" />
  <g
     id="g845"
     transform="matrix(2.6857194,0,0,2.6857194,-12.436775,-10.494193)">
    <path
       d="m 29.94,53.818 -19.3,-9.233 -4.82,-20.86 13.287,-16.78 21.39,-0.066 13.384,16.7 -4.696,20.89 z"
       id="path10"
       inkscape:connector-curvature="0"
       style="fill:#ffffff;stroke:#3c6eb4;stroke-width:1.05799997;stroke-linecap:round;stroke-linejoin:round" />
    <path
       d="m 27.926,14.4 -2.502,5.592 z m 12.636,4.357 -5.986,1.306 z m -23.512,3.153 2.882,5.406 z m 22.867,5.36 4.686,3.946 z m -23.066,7.5 6.035,1.08 z m 20.688,1.042 -0.204,6.124 z m -7.71,3.428 -4.765,3.854 z"
       id="path12"
       inkscape:connector-curvature="0"
       style="fill:none;stroke:#3c6eb4;stroke-width:1.05799997" />
    <path
       d="m 21.534,11.176 -0.944,0.48 3.837,7.552 -4.843,-1.034 -0.22,1.035 5.68,1.21 1.694,3.333 0.36,-0.455 0.594,-0.003 z m 16.882,0.05 -3.8,7.57 -2.043,-4.51 -0.965,0.437 2.397,5.29 -1.642,3.27 h 0.216 L 33.172,24.026 39.36,11.7 Z m 3.924,10.434 -2.73,5.125 -3.656,0.705 0.055,0.068 -0.238,1.044 13.69,-2.64 -0.2,-1.04 -8.32,1.605 2.33,-4.37 z m -31.746,3.262 -0.2,1.04 8.362,1.613 -3.842,3.236 0.682,0.81 4.497,-3.785 3.826,0.738 -0.228,-0.975 0.1,-0.126 z m 24.242,7.847 -0.03,0.133 -0.918,0.444 10.58,9.16 0.693,-0.803 -6.403,-5.544 4.874,-0.87 -0.185,-1.043 -5.718,1.024 z m -9.923,0.092 -10.215,8.843 0.693,0.8 6.44,-5.574 0.17,5.02 1.057,-0.034 -0.197,-5.875 3.05,-2.64 -0.98,-0.467 z m 4.386,2.16 V 48.86 h 1.056 v -8.47 l 3.85,3.114 0.665,-0.822 -4.514,-3.653 v -3.97 l -0.484,0.235 z"
       style="color:#000000;font-weight:400;line-height:normal;font-family:sans-serif;font-variant-ligatures:normal;font-variant-position:normal;font-variant-caps:normal;font-variant-numeric:normal;font-variant-alternates:normal;font-feature-settings:normal;text-indent:0;text-align:start;text-decoration:none;text-decoration-line:none;text-decoration-style:solid;text-decoration-color:#000000;text-transform:none;text-orientation:mixed;white-space:normal;shape-padding:0;overflow:visible;isolation:auto;mix-blend-mode:normal;fill:#294172;stroke:none"
       font-weight="400"
       overflow="visible"
       id="path14"
       inkscape:connector-curvature="0" />
    <path
       d="m 29.874,35.297 -4.945,-2.363 -1.238,-5.34 3.409,-4.294 5.48,-0.017 3.43,4.275 -1.205,5.347 z"
       id="path16"
       inkscape:connector-curvature="0"
       style="fill:none;stroke:#294172;stroke-width:1.05799997;stroke-linecap:round;stroke-linejoin:round" />
  </g>
</svg>
