<?xml version="1.0" encoding="UTF-8" standalone="no"?>
<svg
   xmlns:dc="http://purl.org/dc/elements/1.1/"
   xmlns:cc="http://creativecommons.org/ns#"
   xmlns:rdf="http://www.w3.org/1999/02/22-rdf-syntax-ns#"
   xmlns:svg="http://www.w3.org/2000/svg"
   xmlns="http://www.w3.org/2000/svg"
   xmlns:sodipodi="http://sodipodi.sourceforge.net/DTD/sodipodi-0.dtd"
   xmlns:inkscape="http://www.inkscape.org/namespaces/inkscape"
   height="512"
   viewBox="-7.601 0 389.98078 145.42651"
   width="1543.0874"
   version="1.1"
   id="svg16"
   sodipodi:docname="cielo.svg"
   inkscape:version="0.92.4 (unknown)">
  <metadata
     id="metadata22">
    <rdf:RDF>
      <cc:Work
         rdf:about="">
        <dc:format>image/svg+xml</dc:format>
        <dc:type
           rdf:resource="http://purl.org/dc/dcmitype/StillImage" />
        <dc:title></dc:title>
      </cc:Work>
    </rdf:RDF>
  </metadata>
  <defs
     id="defs20" />
  <sodipodi:namedview
     pagecolor="#ffffff"
     bordercolor="#666666"
     borderopacity="1"
     objecttolerance="10"
     gridtolerance="10"
     guidetolerance="10"
     inkscape:pageopacity="0"
     inkscape:pageshadow="2"
     inkscape:window-width="1600"
     inkscape:window-height="851"
     id="namedview18"
     showgrid="false"
     inkscape:showpageshadow="false"
     fit-margin-top="0"
     fit-margin-left="0"
     fit-margin-right="0"
     fit-margin-bottom="0"
     inkscape:zoom="0.97013299"
     inkscape:cx="771.5437"
     inkscape:cy="256"
     inkscape:window-x="0"
     inkscape:window-y="24"
     inkscape:window-maximized="1"
     inkscape:current-layer="svg16" />
  <g
     id="g14"
     style="fill-rule:evenodd"
     transform="matrix(0.73542241,0,0,0.73542241,-31.756499,0)">
    <g
       transform="matrix(3.5433,0,0,3.5433,-65.55,-385.39)"
       id="g8"
       style="fill:none">
      <path
         d="m 50.405,151.628 c -10.277,9.358 -23.233,0.282 -22.687,-10.044 0.406,-7.675 8.306,-15.776 18.357,-11.796 l 3.656,-8.466 c -21.793,-7.1 -33.377,11.536 -30.902,24.09 4.001,20.294 25.88,24.11 37.926,12.854 z m 19.386,-16.019 c 0.29,-8.16 -8.098,-9.86 -12.604,-11.641 l -3.656,8.37 7.409,3.271 0.192,28.093 h 8.563 z m 16.259,25.399 4.811,-7.696 m 0,0 c 6.28,3.31 11.732,2.732 16.356,-1.732 l 6.638,6.639 c -9.839,7.627 -16.99,8.172 -27.805,2.79 m -6.734,-6.735 c -8.265,-12.966 -1.838,-27.738 9.099,-32.613 11.605,-5.173 27.3,-0.403 31.598,15.295 z"
         id="path2"
         inkscape:connector-curvature="0" />
      <path
         d="m 84.655,143.642 c -0.155,-15.278 15.977,-19.286 23.283,-10.006 z m 48.25,9.285 -0.193,-43.487 h -8.466 l 0.096,43.968 c -0.026,8.15 8.397,9.259 12.508,11.16 l 3.367,-8.37 z m 40.312,-0.963 c -8.495,9.27 -27.865,-1.282 -20.878,-15.49 l -8.466,-4.233 c -9.438,21.37 14.666,43.058 35.405,26.458 z m 3.031,-4.089 c 5.983,-14.747 -10.694,-24.817 -20.878,-15.49 l -6.253,-6.927 c 16.784,-14.983 45.551,1.02 35.501,26.362 z"
         id="path4"
         inkscape:connector-curvature="0" />
      <ellipse
         cx="65.413002"
         cy="114.827"
         rx="6.1090002"
         ry="6.0609999"
         id="ellipse6" />
    </g>
    <path
       d="m 113.049,151.875 c -36.414,33.159 -82.32,0.998 -80.385,-35.59 1.439,-27.194 29.43,-55.897 65.044,-41.795 l 12.955,-30 C 33.443,19.33 -7.601,85.367 1.167,129.848 c 14.177,71.909 91.704,85.433 134.382,45.549 z m 37.329,-56.761 0.682,99.544 h 30.34 l 0.34,-99.544 C 182.77,66.199 153.047,60.174 137.082,53.865 L 124.128,83.524 Z M 247.73,45.689 c -38.753,17.273 -61.524,69.617 -32.24,115.559 L 359.692,99.885 C 344.463,44.264 288.852,27.36 247.731,45.689 Z m -13.32,77.889 c -0.55,-54.133 56.61,-68.337 82.498,-35.454 z m 79.943,28.127 c -16.384,15.816 -35.701,17.862 -57.954,6.136 l -17.045,27.272 c 38.317,19.07 63.658,17.139 98.52,-9.886 z M 374.692,2.39 l 0.34,155.792 c -0.092,28.877 29.752,32.805 44.318,39.545 L 431.281,168.068 405.373,156.478 404.69,2.39 Z m 69.544,80.79 c -33.443,75.72 51.966,152.57 125.452,93.749 l -21.477,-23.863 c -30.1,32.843 -98.734,-4.543 -73.976,-54.886 z"
       id="path10"
       inkscape:connector-curvature="0" />
    <path
       d="m 484.973,83.694 c 36.085,-33.05 95.175,2.632 73.977,54.886 l 29.658,13.977 C 624.218,62.765 522.288,6.061 462.815,59.149 Z M 166.23,42.953 c 11.955,0 21.647,-9.615 21.647,-21.476 C 187.877,9.616 178.185,0 166.23,0 c -11.956,0 -21.648,9.615 -21.648,21.477 0,11.862 9.692,21.476 21.648,21.476 z"
       id="path12"
       inkscape:connector-curvature="0"
       style="fill:#01aef0" />
  </g>
</svg>
