<?xml version="1.0" encoding="UTF-8" standalone="no"?>
<svg
   xmlns:dc="http://purl.org/dc/elements/1.1/"
   xmlns:cc="http://creativecommons.org/ns#"
   xmlns:rdf="http://www.w3.org/1999/02/22-rdf-syntax-ns#"
   xmlns:svg="http://www.w3.org/2000/svg"
   xmlns="http://www.w3.org/2000/svg"
   xmlns:xlink="http://www.w3.org/1999/xlink"
   xmlns:sodipodi="http://sodipodi.sourceforge.net/DTD/sodipodi-0.dtd"
   xmlns:inkscape="http://www.inkscape.org/namespaces/inkscape"
   inkscape:version="1.0 (1.0+r73+1)"
   sodipodi:docname="emu-qemu.svg"
   id="svg34"
   version="1.1"
   viewBox="-52.2096 -27.99025 193.0595 34.173982"
   width="512"
   height="162.78993">
  <metadata
     id="metadata38">
    <rdf:RDF>
      <cc:Work
         rdf:about="">
        <dc:format>image/svg+xml</dc:format>
        <dc:type
           rdf:resource="http://purl.org/dc/dcmitype/StillImage" />
        <dc:title></dc:title>
      </cc:Work>
    </rdf:RDF>
  </metadata>
  <sodipodi:namedview
     inkscape:current-layer="svg34"
     inkscape:window-maximized="1"
     inkscape:window-y="24"
     inkscape:window-x="0"
     inkscape:cy="81.394966"
     inkscape:cx="256"
     inkscape:zoom="3.5566406"
     fit-margin-bottom="0"
     fit-margin-right="0"
     fit-margin-left="0"
     fit-margin-top="0"
     inkscape:showpageshadow="false"
     showgrid="false"
     id="namedview36"
     inkscape:window-height="1033"
     inkscape:window-width="1920"
     inkscape:pageshadow="2"
     inkscape:pageopacity="0"
     guidetolerance="10"
     gridtolerance="10"
     objecttolerance="10"
     borderopacity="1"
     bordercolor="#666666"
     pagecolor="#ffffff" />
  <defs
     id="defs14">
    <linearGradient
       id="b">
      <stop
         id="stop2"
         offset="0" />
      <stop
         id="stop4"
         stop-opacity=".897"
         offset="1" />
    </linearGradient>
    <linearGradient
       id="a">
      <stop
         id="stop7"
         stop-color="#fff"
         offset="0" />
      <stop
         id="stop9"
         stop-opacity="0"
         stop-color="#fff"
         offset="1" />
    </linearGradient>
    <linearGradient
       xlink:href="#a"
       id="d"
       x1="142.819"
       y1="831.52301"
       x2="142.819"
       y2="878.90698"
       gradientUnits="userSpaceOnUse" />
    <radialGradient
       xlink:href="#b"
       id="c"
       cx="116.52"
       cy="98.281998"
       fx="116.52"
       fy="98.281998"
       r="55.859001"
       gradientTransform="matrix(0.97443,1.5089,-0.8356,0.53962,79.642,-130.285)"
       gradientUnits="userSpaceOnUse" />
  </defs>
  <g
     id="g32"
     transform="matrix(0.54871066,0,0,0.54871066,-86.416771,-72.245234)">
    <path
       style="fill:url(#c)"
       id="path16"
       fill="url(#c)"
       d="m 118.216,55.86 c -30.85,0 -55.875,24.87 -55.875,55.562 0,30.692 25.024,55.562 55.875,55.562 10.095,0 19.546,-2.652 27.719,-7.312 l 2.906,7.312 h 22.531 l -8.812,-21.78 c 7.215,-9.363 11.5,-21.073 11.5,-33.782 0,-30.692 -24.993,-55.563 -55.844,-55.563 z" />
    <ellipse
       style="fill:url(#d)"
       id="ellipse18"
       fill="url(#d)"
       transform="matrix(1.0465,0,0,1.29205,-31.641,-1016.861)"
       cx="142.5"
       cy="856.29102"
       rx="35.356998"
       ry="24.643" />
    <circle
       id="circle20"
       transform="translate(7.67,-777.604)"
       cx="115.662"
       cy="856.39301"
       r="6.566" />
    <path
       id="path22"
       d="m 111.35,81.924 37.258,5.376 -1.044,5.401 -37.258,-5.376 z" />
    <path
       id="path24"
       d="m 144.925,89.017 h 6.566 v 2.904 h -6.566 z" />
    <path
       id="path26"
       fill="#ff6600"
       d="m 103.388,65.01 c -0.057,2.186 -3.866,0.284 -4.031,2.782 -4.224,-1.88 0.329,2.872 -0.094,3.312 h -0.031 l -0.313,-0.03 a 4.903,4.903 0 0 1 -0.937,-0.47 c -2.95,2.35 -3.022,7.234 -6.063,9.938 -1.994,4.305 -2.48,8.983 -3.937,13.469 -0.718,4.303 -1.349,8.597 -0.281,12.906 0.32,3.501 -0.69,8.258 2.5,10.719 4.727,3.883 8.655,8.795 12.625,13.468 6.219,7.654 11.73,15.863 16.593,24.438 0.325,-2.118 1.11,4.264 2.532,4.687 -0.492,-3.192 -1.133,-8.263 -1.438,-12.187 -1.581,-10.291 -6.653,-19.65 -8.562,-29.844 -0.06,-0.43 -0.129,-0.872 -0.188,-1.312 v -1.282 h -0.156 c -0.626,-5.043 -0.85,-10.465 2.812,-14.406 3.74,-3.772 9.307,-4.722 13.813,-7.344 a 14.855,14.855 0 0 1 3.125,-1.406 c 0.009,-0.003 0.023,0.003 0.031,0 3.117,-0.963 6.449,-0.933 9.688,-0.406 0.047,0.008 0.108,0.023 0.156,0.031 0.294,0.05 0.614,0.099 0.906,0.156 2.371,0.212 7.145,1.137 8,-0.5 -3.272,-2.786 -7.985,-2.592 -11.969,-3.687 -0.63,-0.115 -1.412,-0.24 -2.187,-0.313 l -3.906,-0.875 -0.97,-0.25 v 0.031 l -13.968,-2.718 a 6.808,6.808 0 0 0 -0.687,-0.563 l 13.625,1.688 v -0.063 c 0.48,0.107 0.955,0.194 1.437,0.25 v 0.031 l 9.625,1.782 c 1.661,0.62 3.432,1.083 5.094,1.187 2.742,0.4 6.225,4.491 7.125,4.688 -0.441,-4.307 -4.742,-6.236 -8.313,-7.5 -4.17,-2.028 -10.402,-1.954 -11.062,-7.563 -0.176,-0.39 -0.35,-0.781 -0.563,-1.156 l -1.625,-2.156 0.063,-0.032 c -2.217,-2.616 -5.34,-4.521 -8.656,-5.25 -3.292,-1.136 -6.988,-2.267 -10.47,-2.718 -1.18,3.478 -2.502,-2.756 -5.343,-0.907 -2.49,0.295 -2.146,0.953 -4,-0.625 z m 17.906,10.157 c 0.902,-0.024 1.933,0.142 2.969,0.5 2.763,0.954 4.561,2.965 4.031,4.5 -0.53,1.535 -3.206,1.986 -5.969,1.031 -2.762,-0.954 -4.561,-2.934 -4.03,-4.469 0.33,-0.959 1.496,-1.523 3,-1.562 z" />
    <text
       id="text30"
       word-spacing="0"
       letter-spacing="0"
       font-family="sans-serif"
       font-weight="700"
       style="line-height:0%;-inkscape-font-specification:'Sans Bold';text-align:start"
       x="184.894"
       y="166.37399"><tspan
         id="tspan28"
         font-size="95.541px"
         x="184.894"
         y="166.37399"
         style="line-height:1.25">EMU</tspan></text>
  </g>
</svg>
