<?xml version="1.0" encoding="UTF-8" standalone="no"?>
<!-- Created with Inkscape (http://www.inkscape.org/) -->

<svg
   width="512"
   height="512"
   viewBox="0 0 512 512"
   version="1.1"
   id="svg1"
   xml:space="preserve"
   inkscape:version="1.3.2 (1:1.3.2+202311252150+091e20ef0f)"
   sodipodi:docname="concept-strada.svg"
   xmlns:inkscape="http://www.inkscape.org/namespaces/inkscape"
   xmlns:sodipodi="http://sodipodi.sourceforge.net/DTD/sodipodi-0.dtd"
   xmlns="http://www.w3.org/2000/svg"
   xmlns:svg="http://www.w3.org/2000/svg"><sodipodi:namedview
     id="namedview1"
     pagecolor="#ffffff"
     bordercolor="#000000"
     borderopacity="0.25"
     inkscape:showpageshadow="false"
     inkscape:pageopacity="0.0"
     inkscape:pagecheckerboard="0"
     inkscape:deskcolor="#d1d1d1"
     inkscape:document-units="px"
     showborder="false"
     inkscape:zoom="1.5332031"
     inkscape:cx="255.67389"
     inkscape:cy="256"
     inkscape:window-width="1920"
     inkscape:window-height="1031"
     inkscape:window-x="0"
     inkscape:window-y="476"
     inkscape:window-maximized="1"
     inkscape:current-layer="layer1" /><defs
     id="defs1" /><g
     inkscape:label="Camada 1"
     inkscape:groupmode="layer"
     id="layer1"
     transform="translate(156.76866,144.49365)"><circle
       r="256"
       cy="111.50635"
       cx="99.231339"
       id="path822"
       style="fill:none;fill-opacity:1;stroke:none;stroke-width:7.0415;stroke-linecap:round;stroke-linejoin:round;stroke-miterlimit:4;stroke-dasharray:none;stroke-dashoffset:0;stroke-opacity:1;paint-order:stroke fill markers" /><g
       id="g1"
       transform="matrix(4.0917017,0,0,4.0917017,-325.21545,-341.60796)"><path
         style="font-weight:300;font-size:208.362px;line-height:1;font-family:Ubuntu;-inkscape-font-specification:'Ubuntu Light';text-align:center;text-anchor:middle;fill:none;stroke:#000000;stroke-width:0.998412;stroke-linecap:round;stroke-linejoin:round;stroke-dasharray:none;stroke-dashoffset:1.3;paint-order:stroke fill markers"
         d="m 68.042066,161.50637 c 0.409271,0.27285 1.296025,0.75035 2.660264,1.43249 1.364239,0.54572 3.205959,1.22787 5.525165,2.04644 2.319204,0.68215 5.04768,1.29608 8.185428,1.84181 3.27417,0.54571 7.025825,0.81857 11.254964,0.81857 7.639733,0 13.915233,-1.22786 18.826483,-3.68359 5.04768,-2.59216 7.57153,-6.88968 7.57153,-12.89256 0,-2.86502 -0.4775,-5.32075 -1.43246,-7.36717 -0.81854,-2.04645 -2.251,-3.88824 -4.29735,-5.52539 -2.04635,-1.63716 -4.77483,-3.2061 -8.18543,-4.70681 -3.27416,-1.50072 -7.36688,-3.2743 -12.278139,-5.32075 -3.956289,-1.63715 -7.707944,-3.27429 -11.254964,-4.91144 -3.547018,-1.77358 -6.684764,-3.75181 -9.413242,-5.93468 -2.728476,-2.31931 -4.911256,-5.04788 -6.548342,-8.18576 -1.637086,-3.13788 -2.455628,-6.95789 -2.455628,-11.460047 0,-8.595047 3.205959,-15.55294 9.617878,-20.873675 6.548342,-5.320742 15.484101,-7.98111 26.807277,-7.98111 7.23046,0 13.16489,0.61393 17.80331,1.841794 4.77483,1.227862 8.11722,2.319297 10.02715,3.274302"
         id="text1"
         aria-label="s"
         sodipodi:nodetypes="ccccscscsccccsscscc" /><path
         d="m 130.1459,54.934168 c -0.0288,0.0036 -0.14721,0.01618 -0.26032,0.02698 -0.29083,0.02877 -0.78454,0.129476 -1.08257,0.222988 -0.66965,0.206803 -1.27287,0.521504 -1.82583,0.951295 -0.23339,0.179829 -0.73967,0.681552 -0.9192,0.909935 -0.79352,1.005244 -1.18669,2.078824 -1.22978,3.353815 -0.0197,0.606024 0.0593,1.177879 0.24057,1.744338 0.13286,0.417207 0.28187,0.737298 0.63913,1.384684 0.48115,0.870374 0.59603,1.059191 1.40393,2.301813 0.89227,1.373894 1.19747,1.884606 1.67322,2.801734 0.42908,0.827218 0.75404,1.586093 1.02871,2.395324 0.24418,0.717514 0.39497,1.280383 0.61041,2.292819 0.0718,0.330888 0.13105,0.604229 0.13465,0.607821 0.006,0.0069 0.0215,-0.06657 0.17953,-0.814625 0.24236,-1.145513 0.4578,-1.889999 0.8079,-2.780156 0.54935,-1.400868 1.16335,-2.524801 2.47751,-4.538883 0.91201,-1.397269 1.05743,-1.643638 1.50626,-2.544585 0.42908,-0.864972 0.54399,-1.17068 0.64631,-1.744339 0.0646,-0.361458 0.0826,-0.579045 0.0826,-0.969279 0,-1.071775 -0.2693,-2.019479 -0.82943,-2.924019 -0.38599,-0.62041 -0.92998,-1.203056 -1.51345,-1.620259 -0.73428,-0.523304 -1.65527,-0.882961 -2.59422,-1.012439 -0.32675,-0.04676 -0.94972,-0.07014 -1.17592,-0.04497 z"
         id="path1"
         style="fill:#000000;stroke:none;stroke-width:0.999995;stroke-linecap:round;stroke-linejoin:round;stroke-dasharray:none;paint-order:stroke fill markers" /><path
         d="m 67.63211,142.65779 c -0.0288,0.004 -0.14748,0.0162 -0.260792,0.027 -0.291368,0.0288 -0.78598,0.12951 -1.08454,0.22303 -0.670873,0.20683 -1.275191,0.52159 -1.829153,0.95145 -0.233814,0.17986 -0.741014,0.68165 -0.920866,0.91007 -0.794976,1.00541 -1.188865,2.07916 -1.232028,3.35437 -0.01982,0.60611 0.05936,1.17806 0.241013,1.7446 0.133089,0.41728 0.282373,0.73742 0.64029,1.38492 0.482018,0.87051 0.597125,1.05936 1.406484,2.30218 0.893897,1.37412 1.199655,1.88491 1.676271,2.80218 0.42986,0.82736 0.755404,1.58635 1.030585,2.39572 0.244607,0.71763 0.395685,1.28059 0.611517,2.29319 0.07191,0.33093 0.131294,0.60433 0.134894,0.60792 0.0054,0.007 0.02159,-0.0665 0.179859,-0.81477 0.242801,-1.14568 0.458634,-1.8903 0.809359,-2.7806 0.550363,-1.40109 1.165471,-2.52521 2.482029,-4.53961 0.913675,-1.39749 1.05936,-1.6439 1.509005,-2.545 0.429861,-0.86511 0.544969,-1.17086 0.64749,-1.74461 0.0647,-0.36152 0.08274,-0.57914 0.08274,-0.96944 0,-1.07195 -0.269787,-2.01981 -0.83094,-2.92449 -0.386698,-0.62051 -0.931665,-1.20325 -1.516205,-1.62052 -0.735618,-0.52339 -1.65828,-0.8831 -2.598941,-1.0126 -0.327339,-0.0468 -0.951442,-0.0701 -1.178065,-0.045 z"
         id="path2"
         style="fill:#000000;stroke:none;stroke-width:0.999996;stroke-linecap:round;stroke-linejoin:round;stroke-dasharray:none;paint-order:stroke fill markers" /></g></g></svg>
