<?xml version="1.0" encoding="UTF-8" standalone="no"?>
<!-- Created with Inkscape (http://www.inkscape.org/) -->

<svg
   version="1.1"
   id="svg2"
   xml:space="preserve"
   width="511.99997"
   height="66.27018"
   viewBox="0 0 511.99995 66.270178"
   sodipodi:docname="hw-microdigital-2.svg"
   inkscape:version="1.1.1 (1:1.1+202109281949+c3084ef5ed)"
   xmlns:inkscape="http://www.inkscape.org/namespaces/inkscape"
   xmlns:sodipodi="http://sodipodi.sourceforge.net/DTD/sodipodi-0.dtd"
   xmlns="http://www.w3.org/2000/svg"
   xmlns:svg="http://www.w3.org/2000/svg"><defs
     id="defs6" /><sodipodi:namedview
     id="namedview4"
     pagecolor="#ffffff"
     bordercolor="#666666"
     borderopacity="1.0"
     inkscape:pageshadow="2"
     inkscape:pageopacity="0.0"
     inkscape:pagecheckerboard="0"
     showgrid="false"
     inkscape:zoom="3.5097658"
     inkscape:cx="255.99999"
     inkscape:cy="33.193098"
     inkscape:current-layer="g8"
     inkscape:showpageshadow="false"
     fit-margin-top="0"
     fit-margin-left="0"
     fit-margin-right="0"
     fit-margin-bottom="0" /><g
     id="g8"
     inkscape:groupmode="layer"
     inkscape:label="hw-microdigital"
     transform="matrix(1.3333333,0,0,-1.3333333,-365.89296,596.77299)"><g
       id="g1168"
       transform="matrix(1.3714856,0,0,1.3714856,-111.04637,237.69048)"><g
         id="g172"
         transform="translate(518.6807,131.5039)"><path
           d="M 0,0 V 8.738 H 2.521 5.237 Z M 33.794,-1.714 V 19.957 L 11.946,19.933 5.356,8.938 v 11.011 l -30.32,0.013 v -6.807 c -3.166,4.667 -8.498,7.629 -14.366,7.629 -5.849,0 -11.021,-2.914 -14.17,-7.356 v 6.53 h -11.28 v -6.564 c -3.522,4.978 -9.495,6.548 -13.238,6.555 l -12.404,-0.004 v -6.893 c -3.12,4.658 -8.431,7.732 -14.449,7.732 -6.249,0 -11.721,-3.327 -14.782,-8.292 -1.969,5.779 -8.227,7.459 -11.825,7.466 l -13.674,0.005 v -6.498 c -3.189,4.483 -8.405,7.319 -14.14,7.319 -5.975,0 -11.254,-3.033 -14.382,-7.639 v 6.817 l -20.679,0.004 -8.199,-12.697 V 19.94 l -12.192,0.021 -21.496,-33.012 h 13.744 l 9.046,14.04 v -14.057 h 10.906 l 8.471,12.841 v -12.824 l 20.399,-0.002 v 6.739 c 3.128,-4.608 8.407,-7.642 14.382,-7.642 5.735,0 10.951,2.836 14.14,7.318 v -6.419 h 11.154 v 8.393 l 6.284,-8.393 h 13.543 l -9.533,12.424 c 0.596,0.359 1.167,0.801 1.698,1.32 1.316,-8.284 8.487,-14.643 17.135,-14.643 6.018,0 11.329,3.075 14.449,7.733 v -6.832 l 12.404,0.006 c 3.741,0 9.715,1.561 13.238,6.534 v -6.546 h 11.28 v 6.462 c 3.149,-4.443 8.321,-7.357 14.17,-7.357 5.966,0 11.237,3.025 14.366,7.62 v -6.727 h 11.28 V 8.738 h 2.403 v -21.785 l 16.343,-0.006 4.774,7.964 h 3.883 l -0.002,-7.964 27.898,-0.01 v 11.349 z"
           style="fill:none;stroke:#000000;stroke-width:1.5;stroke-linecap:butt;stroke-linejoin:miter;stroke-miterlimit:4;stroke-dasharray:none;stroke-opacity:1"
           id="path174" /></g><g
         id="g868"><g
           id="g134"
           transform="translate(294.6377,121.2891)"><path
             d="M 0,0 13.429,20.838 V -0.018 h 6.545 L 32.807,19.434 V 0 h 5.311 V 27.344 H 31.234 L 18.656,7.867 V 27.326 L 10.836,27.338 -6.969,0 Z"
             style="fill:#e1660d;fill-opacity:1;fill-rule:evenodd;stroke:none"
             id="path136" /></g><g
           id="g138"
           transform="translate(398.7603,121.2832)"><path
             d="m 0,0 h -6.375 l -9.718,12.975 -0.82,-0.008 V 0 h -5.483 v 27.348 l 10.836,-0.004 c 0,0 9.617,-0.018 9.617,-8.53 0,-7.74 -6.556,-7.74 -6.556,-7.74 z m -16.913,22.77 z m 0,0 v -7.911 h 5.353 c 0,0 4.223,0 4.223,3.955 0,3.956 -4.223,3.956 -4.223,3.956 z"
             style="fill:#e1660d;fill-opacity:1;fill-rule:evenodd;stroke:none"
             id="path140" /></g><g
           id="g142"
           transform="translate(431.0947,121.2852)"><path
             d="m 0,0 v 27.33 l 9.568,0.002 c 0,0 13.261,-0.023 13.261,-13.676 C 22.829,0.006 9.568,0.006 9.568,0.006 Z M 8.797,4.732 Z M 9.57,4.615 c 0,0 7.891,-0.021 7.891,9.041 0,9.065 -7.893,9.059 -7.893,9.059 L 5.344,22.721 5.346,4.594 Z"
             style="fill:#e1660d;fill-opacity:1;fill-rule:evenodd;stroke:none"
             id="path144" /></g><path
           d="m 456.735,148.627 h 5.609 v -27.348 h -5.609 z"
           style="fill:#e1660d;fill-opacity:1;fill-rule:evenodd;stroke:none"
           id="path146" /><path
           d="m 336.562,148.631 h 5.61 v -27.344 h -5.61 z"
           style="fill:#e1660d;fill-opacity:1;fill-rule:evenodd;stroke:none"
           id="path148" /><path
           d="m 496.552,148.631 h 5.609 v -27.354 h -5.609 z"
           style="fill:#e1660d;fill-opacity:1;fill-rule:evenodd;stroke:none"
           id="path150" /><g
           id="g152"
           transform="translate(521.2002,148.5957)"><path
             d="m 0,0 v -5.518 h -5.355 v -21.785 h -5.61 v 21.785 h -5.353 V 0.021 H 0 Z"
             style="fill:#e1660d;fill-opacity:1;fill-rule:evenodd;stroke:none"
             id="path154" /></g><g
           id="g156"
           transform="translate(557.4609,121.2754)"><path
             d="m 0,0 h -13.428 v 27.35 h 5.606 V 5.68 H 0 Z"
             style="fill:#e1660d;fill-opacity:1;fill-rule:evenodd;stroke:none"
             id="path158" /></g><g
           id="g160"
           transform="translate(413.8091,126.1172)"><path
             d="M 0,0 C -4.86,0 -8.8,3.939 -8.8,8.801 -8.8,13.66 -4.86,17.6 0,17.6 4.86,17.6 8.8,13.66 8.8,8.801 8.8,3.939 4.86,0 0,0 m 0,23.338 c -8.029,0 -14.537,-6.51 -14.537,-14.537 0,-8.03 6.508,-14.537 14.537,-14.537 8.029,0 14.546,6.507 14.546,14.537 0,8.027 -6.517,14.537 -14.546,14.537"
             style="fill:#e1660d;fill-opacity:1;fill-rule:evenodd;stroke:none"
             id="path162" /></g><g
           id="g164"
           transform="translate(367.3452,131.1777)"><path
             d="m 0,0 c -1.407,-2.988 -4.436,-5.061 -7.957,-5.061 -4.859,0 -8.799,3.94 -8.799,8.801 0,4.86 3.94,8.799 8.799,8.799 3.521,0 6.55,-2.072 7.957,-5.059 h 6.077 c -1.653,6.213 -7.301,10.797 -14.034,10.797 -8.028,0 -14.537,-6.509 -14.537,-14.537 0,-8.029 6.509,-14.537 14.537,-14.537 6.734,0 12.381,4.584 14.034,10.797 z"
             style="fill:#e1660d;fill-opacity:1;fill-rule:evenodd;stroke:none"
             id="path166" /></g><g
           id="g168"
           transform="translate(479.3506,134.918)"><path
             d="M 0,0 V -3.74 H 7.957 C 6.55,-6.729 3.521,-8.801 0,-8.801 c -4.859,0 -8.8,3.94 -8.8,8.801 0,4.859 3.941,8.799 8.8,8.799 3.52,0 6.549,-2.072 7.956,-5.059 h 6.077 C 12.381,9.953 6.733,14.537 0,14.537 -8.029,14.537 -14.537,8.027 -14.537,0 c 0,-8.029 6.508,-14.537 14.537,-14.537 8.029,0 14.537,6.508 14.537,14.537 z"
             style="fill:#e1660d;fill-opacity:1;fill-rule:evenodd;stroke:none"
             id="path170" /></g><g
           id="g176"
           transform="translate(535.4238,134.9199)"><path
             d="M 0,0 H -4.937 L 0,8.182 Z m -3.192,13.705 -16.366,-27.334 6.272,-0.004 4.773,7.963 h 8.326 l -0.004,-7.963 h 5.613 v 27.336 z"
             style="fill:#e1660d;fill-opacity:1;fill-rule:nonzero;stroke:none"
             id="path178" /></g></g></g></g></svg>
