<?xml version="1.0" encoding="UTF-8" standalone="no"?>
<svg
   xmlns:dc="http://purl.org/dc/elements/1.1/"
   xmlns:cc="http://creativecommons.org/ns#"
   xmlns:rdf="http://www.w3.org/1999/02/22-rdf-syntax-ns#"
   xmlns:svg="http://www.w3.org/2000/svg"
   xmlns="http://www.w3.org/2000/svg"
   xmlns:sodipodi="http://sodipodi.sourceforge.net/DTD/sodipodi-0.dtd"
   xmlns:inkscape="http://www.inkscape.org/namespaces/inkscape"
   sodipodi:docname="os-netbsd.svg"
   inkscape:version="1.0 (1.0+r73+1)"
   version="1.1"
   id="svg3295"
   height="401.54022"
   width="512">
  <defs
     id="defs3297" />
  <sodipodi:namedview
     fit-margin-bottom="0"
     fit-margin-right="0"
     fit-margin-left="0"
     fit-margin-top="0"
     inkscape:showpageshadow="false"
     inkscape:document-rotation="0"
     inkscape:window-maximized="1"
     inkscape:window-y="24"
     inkscape:window-x="0"
     inkscape:window-height="1033"
     inkscape:window-width="1920"
     showgrid="false"
     inkscape:current-layer="layer1"
     inkscape:document-units="px"
     inkscape:cy="200.77011"
     inkscape:cx="256"
     inkscape:zoom="2.0446271"
     inkscape:pageshadow="2"
     inkscape:pageopacity="0.0"
     borderopacity="1.0"
     bordercolor="#666666"
     pagecolor="#ffffff"
     id="base" />
  <metadata
     id="metadata3300">
    <rdf:RDF>
      <cc:Work
         rdf:about="">
        <dc:format>image/svg+xml</dc:format>
        <dc:type
           rdf:resource="http://purl.org/dc/dcmitype/StillImage" />
        <dc:title></dc:title>
      </cc:Work>
    </rdf:RDF>
  </metadata>
  <g
     transform="translate(0.06649744,-779.42705)"
     id="layer1"
     inkscape:groupmode="layer"
     inkscape:label="Layer 1">
    <g
       transform="matrix(1.4979248,0,0,1.4979248,0.03311073,-388.09607)"
       id="g113">
      <g
         id="g100">
        <path
           id="path10"
           style="fill:#777777;stroke:none;stroke-width:0.0327708;stroke-miterlimit:10"
           d="m 68.918793,797.2455 c 0,0 -1.014723,-2.31034 -3.876129,-0.76418 -2.379266,1.29198 -1.141998,3.6776 -1.141998,3.6776 l 44.714744,92.55433 h 10.84688 L 68.918049,797.2455"
           inkscape:connector-curvature="0" />
        <path
           id="path12"
           style="fill:#777777;stroke:none;stroke-width:0.0327708;stroke-miterlimit:10"
           d="m 195.84609,1037.0009 -33.82743,-63.90338 h -14.56753 l 33.98043,70.33088 c 0,0 3.42459,6.6193 10.77244,2.9603 7.34538,-3.659 3.64375,-9.3879 3.64375,-9.3879"
           inkscape:connector-curvature="0" />
        <path
           id="path14"
           style="fill:#f26711;stroke:none;stroke-width:0.0327708;stroke-miterlimit:10"
           d="m 320.52893,790.90381 c -42.39511,-19.91715 -80.752,-10.40542 -123.6524,2.16139 -43.1882,12.64452 -81.6038,19.4881 -124.758917,2.25286 4.70147,8.22298 7.0551,12.33367 11.759052,20.55018 4.318571,7.55838 8.642932,15.11595 12.963157,22.67109 4.703128,8.22137 7.054278,12.32881 11.758228,20.54856 34.36001,9.50606 62.81528,-2.82195 93.34879,-17.76385 36.66568,-17.93223 69.78438,-34.06492 111.67667,-24.71753 -35.40286,-17.35343 -67.49691,-13.05251 -104.51489,-3.22184 36.24226,-18.06014 70.36411,-32.10673 111.42031,-22.48086"
           inkscape:connector-curvature="0" />
      </g>
      <g
         id="g95">
        <path
           id="path16"
           style="fill:#f26711;stroke:none;stroke-width:0.0327708;stroke-miterlimit:10"
           d="m 69.477842,938.63342 c 0,6.93263 0,13.64589 0.217418,17.16887 -0.760754,1.27416 -3.810797,2.45281 -6.424103,2.45281 -0.109908,0 -3.704858,-5.4399 -8.823134,-11.62697 L 29.286678,916.13152 c -6.20652,-7.67819 -9.910716,-12.04791 -11.871523,-13.64831 -0.543336,1.0645 -0.543336,2.87618 -0.543336,6.82253 v 20.69023 c 0,8.63745 0.434173,16.63216 1.633316,19.51401 0.980735,2.23748 3.484878,2.8778 6.316511,3.40803 l 3.04996,0.42904 c 0.869917,0.85484 0.653327,3.09556 0,3.7294 -5.881593,-0.20804 -10.238207,-0.31975 -14.59482,-0.31975 -4.0298674,0 -8.059007,0.11171 -12.1972935,0.31975 -0.65411224,-0.63384 -0.87164518,-2.87456 0,-3.7294 l 1.8507999,-0.32057 c 2.9407801,-0.64032 5.0091129,-1.27902 5.9890532,-3.5165 1.0891534,-2.88185 1.5258074,-10.87656 1.5258074,-19.51401 v -27.08696 c 0,-5.86246 0,-7.56729 -0.7624077,-9.06083 -0.763317,-1.8133 -2.3966335,-2.88104 -6.2090589,-3.62579 l -3.04830614,-0.42823 c -0.76242387,-0.85322 -0.6540957,-3.41207 0.43413967,-3.73021 5.11988077,0.20804 10.56479607,0.31814 15.03230907,0.31814 3.702377,0 6.861501,-0.10686 9.148971,-0.31895 1.090807,4.79796 8.16989,12.89952 17.971443,24.31196 l 9.149054,10.55761 c 4.90243,5.54514 7.951481,9.27373 10.458187,11.72978 0.434917,-1.06855 0.434917,-2.88347 0.434917,-4.79877 v -14.71767 c 0,-8.63583 -0.434917,-16.63378 -1.63497,-19.51725 -0.980734,-2.23586 -3.375797,-2.87294 -6.316511,-3.40641 l -2.941623,-0.42823 c -0.87,-0.85322 -0.6525,-3.09151 0,-3.73021 5.883164,0.20804 10.130697,0.31814 14.596474,0.31814 4.028213,0 7.950654,-0.10686 12.199013,-0.31895 0.654071,0.63951 0.869917,2.8778 0,3.73264 l -1.960806,0.31814 c -2.830724,0.64194 -4.901604,1.27902 -5.883165,3.52055 -1.195836,2.8778 -1.633234,10.87575 -1.633234,19.51482 v 25.48575"
           inkscape:connector-curvature="0" />
        <path
           id="path18"
           style="fill:#f26711;stroke:none;stroke-width:0.0327708;stroke-miterlimit:10"
           d="m 95.355365,926.79598 c 1.527461,0 3.26746,-0.21614 4.468258,-0.95846 0.544167,-0.32623 0.759177,-1.39316 0.759177,-2.45119 0,-3.52055 -2.067485,-5.86812 -5.770771,-5.86812 -4.575768,0 -8.495727,4.2653 -8.495727,7.67576 0,1.49597 1.523326,1.60201 5.00994,1.60201 z m -7.186593,4.6911 c -2.50497,0 -2.724124,0.21129 -2.724124,1.91773 0,7.99956 5.229094,15.78298 15.357312,15.78298 3.05079,0 7.1899,-0.63708 10.12987,-5.54432 1.19832,-0.21209 2.83246,0.64032 2.83246,2.44957 -4.4666,9.06569 -12.52568,12.16206 -19.061425,12.16206 -14.704066,0 -22.653893,-10.13424 -22.653893,-21.75716 0,-13.43622 9.911461,-23.88778 23.525547,-23.88778 11.326531,0 17.426451,7.14472 17.426451,15.3588 0,2.02539 -0.54416,3.51812 -3.91913,3.51812 H 88.168772"
           inkscape:connector-curvature="0" />
        <path
           id="path20"
           style="fill:#f26711;stroke:none;stroke-width:0.0327708;stroke-miterlimit:10"
           d="m 134.47722,919.86578 c -1.41499,0 -1.52415,0.10362 -1.52415,2.45281 v 15.99022 c 0,5.97498 0,12.58705 7.62407,12.58705 1.52498,0 3.26664,-0.74556 4.57577,-1.59797 1.08667,0.31733 1.74083,1.48949 1.52167,2.77014 -3.04913,3.19755 -8.9299,6.18707 -15.68232,6.18707 -9.04154,0 -12.19901,-5.12014 -12.19901,-12.16206 v -23.77445 c 0,-2.24234 -0.10916,-2.45281 -2.06997,-2.45281 h -3.37497 c -1.19914,-0.4347 -1.52581,-2.56128 -0.65498,-3.31008 3.3758,-1.16893 6.42576,-3.09151 9.04072,-4.79553 1.95998,-1.38507 4.6841,-3.62255 8.0599,-8.32174 0.76083,-0.42338 2.72329,-0.31409 3.26828,0.53589 v 7.99875 c 0,2.02459 0.10917,2.13144 2.06915,2.13144 h 9.69487 c 0.54416,0.42499 0.87,1.06855 0.87,2.02701 0,1.17298 -0.32584,3.08908 -1.41499,3.73426 h -9.80486"
           inkscape:connector-curvature="0" />
        <path
           id="path22"
           style="fill:#777777;stroke:none;stroke-width:0.0327708;stroke-miterlimit:10"
           d="m 173.81162,938.73704 c 0,8.31851 1.08998,13.54227 9.58736,13.54227 8.0599,0 12.30652,-6.07617 12.30652,-14.71525 0,-9.27777 -5.44659,-15.78055 -15.90064,-15.78055 -5.99241,0 -5.99241,0.10523 -5.99241,4.37377 v 12.57814 z m 0,-24.63253 c 0,2.77499 0.11082,2.98385 5.77408,2.98385 9.36656,0 12.85234,-5.86084 12.85234,-12.26001 0,-9.27696 -5.88242,-13.86283 -13.39815,-13.86283 -5.11745,0 -5.22827,0.85646 -5.22827,5.54675 z M 158.78015,903.7598 c 0,-10.76727 -0.2175,-11.93782 -4.79162,-12.47452 l -2.94162,-0.42904 c -0.97999,-0.53347 -1.19832,-3.73103 0.43665,-3.83788 8.27823,-0.53185 16.22897,-0.96089 27.12298,-0.96089 10.45405,0 17.42811,1.17541 22.21724,3.94878 4.6841,2.77176 7.51408,7.25239 7.51408,13.53984 0,8.95964 -7.73158,12.47776 -11.10738,13.33341 -1.0908,0.20886 -2.18078,0.63871 -2.18078,1.17136 0,0.31895 0.54747,0.63628 1.52828,0.85323 8.60407,1.8141 15.89982,7.35357 16.00981,17.69585 0.10999,9.81205 -5.88076,15.5717 -12.74069,17.92009 -6.86489,2.34514 -15.03148,2.6649 -21.67639,2.6649 -3.91996,0 -8.05907,-0.43066 -11.21902,-0.43066 -5.33908,0 -10.67569,0.1109 -16.88229,0.32218 -0.87,-0.6387 -0.87,-3.40965 0,-3.7294 l 3.15912,-0.64113 c 4.89995,-0.95846 5.55411,-1.70564 5.55411,-11.30317 V 903.7598"
           inkscape:connector-curvature="0" />
        <path
           id="path24"
           style="fill:#777777;stroke:none;stroke-width:0.0327708;stroke-miterlimit:10"
           d="m 236.34159,958.46395 c -10.01822,0 -16.22813,-2.77256 -18.51395,-4.04997 -2.06914,-2.34595 -3.48413,-10.02333 -3.48413,-17.27572 0.76083,-1.38426 3.26746,-1.49354 4.13828,-0.32056 2.17748,6.93101 9.47324,16.74063 18.73311,16.74063 8.05825,0 11.76401,-5.43747 11.76401,-10.76727 0,-8.63665 -8.27657,-13.75517 -14.81314,-16.95354 -7.8424,-3.84354 -16.33813,-10.23704 -16.44481,-20.79708 0,-12.04791 9.47654,-20.36885 25.26885,-20.36885 3.5933,0 8.05825,0.42904 12.41734,1.7105 1.41499,0.4258 2.39415,0.63627 3.70246,0.85079 0.86752,2.34595 1.96081,8.1048 1.96081,15.25033 -0.54582,1.27659 -3.26912,1.38507 -4.24828,0.32299 -1.85247,-5.44232 -6.53823,-13.22737 -14.3798,-13.22737 -7.18659,0 -11.10655,4.58749 -11.10655,9.91567 0,4.90724 4.46081,9.38301 9.90741,12.15639 l 7.19155,3.73588 c 6.75159,3.51812 15.35731,9.70115 15.35731,21.43093 0,13.11727 -11.00483,21.64625 -27.45047,21.64625"
           inkscape:connector-curvature="0" />
        <path
           id="path26"
           style="fill:#777777;stroke:none;stroke-width:0.0327708;stroke-miterlimit:10"
           d="m 287.71539,937.45478 c 0,5.86813 0.21916,9.7052 2.17748,11.94592 1.96412,2.13386 5.11993,3.09232 9.04155,3.09232 18.84144,0 25.26885,-16.41764 25.26885,-30.92322 0,-19.19507 -10.34737,-30.60428 -30.06295,-30.60428 -2.93583,0 -5.00994,0.53347 -5.66244,1.38993 -0.65415,0.85079 -0.76249,2.87618 -0.76249,6.17979 v 38.92116 z m -15.57398,-33.80102 c 0,-10.12938 -0.21833,-12.15477 -5.2291,-12.68824 l -2.06831,-0.21128 c -1.0875,-0.53347 -1.0875,-3.62903 0.21915,-3.73588 9.14906,-0.53185 17.64313,-0.96089 29.19047,-0.96089 8.93073,0 17.8598,0.8597 25.37719,3.52136 14.26981,5.01086 22.1089,17.59386 22.1089,30.9208 0,14.29187 -6.96992,25.81036 -19.49394,31.88653 -7.40575,3.62822 -16.33978,5.00924 -27.55798,5.00924 -5.11662,0 -10.56818,-0.64113 -14.48648,-0.64113 -5.22992,0 -10.78485,0.1109 -16.99063,0.32218 -0.87082,-0.6387 -0.87082,-3.19674 0,-3.7294 l 3.3758,-0.53347 c 4.90078,-0.8516 5.55493,-1.59797 5.55493,-11.41083 v -37.74899"
           inkscape:connector-curvature="0" />
      </g>
    </g>
  </g>
  <style
     type="text/css"
     id="style4" />
</svg>
