<?xml version="1.0" encoding="UTF-8" standalone="no"?>
<svg
   xmlns:dc="http://purl.org/dc/elements/1.1/"
   xmlns:cc="http://creativecommons.org/ns#"
   xmlns:rdf="http://www.w3.org/1999/02/22-rdf-syntax-ns#"
   xmlns:svg="http://www.w3.org/2000/svg"
   xmlns="http://www.w3.org/2000/svg"
   xmlns:sodipodi="http://sodipodi.sourceforge.net/DTD/sodipodi-0.dtd"
   xmlns:inkscape="http://www.inkscape.org/namespaces/inkscape"
   id="Layer_1"
   viewBox="0 0 83.552708 95.62112"
   width="447.45752"
   height="512"
   version="1.1"
   sodipodi:docname="google-play.svg"
   inkscape:version="0.92.4 (unknown)">
  <metadata
     id="metadata43">
    <rdf:RDF>
      <cc:Work
         rdf:about="">
        <dc:format>image/svg+xml</dc:format>
        <dc:type
           rdf:resource="http://purl.org/dc/dcmitype/StillImage" />
        <dc:title></dc:title>
      </cc:Work>
    </rdf:RDF>
  </metadata>
  <defs
     id="defs41" />
  <sodipodi:namedview
     pagecolor="#ffffff"
     bordercolor="#666666"
     borderopacity="1"
     objecttolerance="10"
     gridtolerance="10"
     guidetolerance="10"
     inkscape:pageopacity="0"
     inkscape:pageshadow="2"
     inkscape:window-width="1600"
     inkscape:window-height="851"
     id="namedview39"
     showgrid="false"
     fit-margin-top="0"
     fit-margin-left="0"
     fit-margin-right="0"
     fit-margin-bottom="0"
     inkscape:showpageshadow="false"
     inkscape:zoom="1.2597656"
     inkscape:cx="223.72876"
     inkscape:cy="256"
     inkscape:window-x="0"
     inkscape:window-y="24"
     inkscape:window-maximized="1"
     inkscape:current-layer="Layer_1" />
  <style
     id="style2">.st0{fill:url(#SVGID_1_)}.st1{fill:url(#SVGID_2_)}.st2{fill:url(#SVGID_3_)}.st3{fill:url(#SVGID_4_)}</style>
  <linearGradient
     id="SVGID_1_"
     gradientUnits="userSpaceOnUse"
     y1="112.094"
     x2="261.746"
     y2="112.094">
    <stop
       offset="0"
       stop-color="#63be6b"
       id="stop4" />
    <stop
       offset=".506"
       stop-color="#5bbc6a"
       id="stop6" />
    <stop
       offset="1"
       stop-color="#4ab96a"
       id="stop8" />
  </linearGradient>
  <linearGradient
     id="SVGID_2_"
     gradientUnits="userSpaceOnUse"
     x1="0.152"
     y1="223.39301"
     x2="179.896"
     y2="223.39301">
    <stop
       offset="0"
       stop-color="#3ec6f2"
       id="stop13" />
    <stop
       offset="1"
       stop-color="#45afe3"
       id="stop15" />
  </linearGradient>
  <linearGradient
     id="SVGID_3_"
     gradientUnits="userSpaceOnUse"
     x1="179.896"
     y1="229.464"
     x2="407.97601"
     y2="229.464">
    <stop
       offset="0"
       stop-color="#faa51a"
       id="stop20" />
    <stop
       offset=".387"
       stop-color="#fab716"
       id="stop22" />
    <stop
       offset=".741"
       stop-color="#fac412"
       id="stop24" />
    <stop
       offset="1"
       stop-color="#fac80f"
       id="stop26" />
  </linearGradient>
  <linearGradient
     id="SVGID_4_"
     gradientUnits="userSpaceOnUse"
     x1="1.744"
     y1="345.521"
     x2="272.29599"
     y2="345.521">
    <stop
       offset="0"
       stop-color="#ec3b50"
       id="stop31" />
    <stop
       offset="1"
       stop-color="#e7515b"
       id="stop33" />
  </linearGradient>
  <g
     id="g49"
     transform="matrix(0.20482148,0,0,0.20482148,-0.0353,2.1324608e-4)">
    <path
       id="path11"
       d="M 261.7,142.3 15,1.3 C 11.9,-0.5 8,-0.4 5,1.4 1.9,3.2 0,6.4 0,10 0,10 0.1,23 0.2,44.4 l 179.7,179.7 z"
       class="st0"
       style="fill:url(#SVGID_1_)"
       inkscape:connector-curvature="0" />
    <path
       id="path18"
       d="M 0.2,44.4 C 0.5,121.6 1.4,309 1.8,402.3 L 180,224.1 Z"
       class="st1"
       style="fill:url(#SVGID_2_)"
       inkscape:connector-curvature="0" />
    <path
       id="path29"
       d="m 402.9,223 -141.2,-80.7 -81.9,81.8 92.4,92.4 130.8,-76.2 c 3.1,-1.8 5,-5.1 5,-8.6 0,-3.6 -2,-6.9 -5.1,-8.7 z"
       class="st2"
       style="fill:url(#SVGID_3_)"
       inkscape:connector-curvature="0" />
    <path
       id="path36"
       d="m 1.7,402.3 c 0.2,33.3 0.3,54.6 0.3,54.6 0,3.6 1.9,6.9 5,8.6 3.1,1.8 6.9,1.8 10,0 L 272.3,316.6 179.9,224.2 Z"
       class="st3"
       style="fill:url(#SVGID_4_)"
       inkscape:connector-curvature="0" />
  </g>
</svg>
