<?xml version="1.0" encoding="UTF-8" standalone="no"?>
<svg
   xmlns:dc="http://purl.org/dc/elements/1.1/"
   xmlns:cc="http://creativecommons.org/ns#"
   xmlns:rdf="http://www.w3.org/1999/02/22-rdf-syntax-ns#"
   xmlns:svg="http://www.w3.org/2000/svg"
   xmlns="http://www.w3.org/2000/svg"
   xmlns:sodipodi="http://sodipodi.sourceforge.net/DTD/sodipodi-0.dtd"
   xmlns:inkscape="http://www.inkscape.org/namespaces/inkscape"
   width="496.19077"
   height="512"
   viewBox="0 0 496.19077 512"
   version="1.1"
   id="svg20"
   sodipodi:docname="ubuntu.svg"
   inkscape:version="0.92.4 (unknown)">
  <metadata
     id="metadata24">
    <rdf:RDF>
      <cc:Work
         rdf:about="">
        <dc:format>image/svg+xml</dc:format>
        <dc:type
           rdf:resource="http://purl.org/dc/dcmitype/StillImage" />
        <dc:title>ubuntu</dc:title>
      </cc:Work>
    </rdf:RDF>
  </metadata>
  <sodipodi:namedview
     pagecolor="#ffffff"
     bordercolor="#666666"
     borderopacity="1"
     objecttolerance="10"
     gridtolerance="10"
     guidetolerance="10"
     inkscape:pageopacity="0"
     inkscape:pageshadow="2"
     inkscape:window-width="1600"
     inkscape:window-height="851"
     id="namedview22"
     showgrid="false"
     inkscape:showpageshadow="false"
     fit-margin-top="0"
     fit-margin-left="0"
     fit-margin-right="0"
     fit-margin-bottom="0"
     inkscape:zoom="1.2597656"
     inkscape:cx="248.09538"
     inkscape:cy="256"
     inkscape:window-x="0"
     inkscape:window-y="24"
     inkscape:window-maximized="1"
     inkscape:current-layer="svg20" />
  <!-- Generator: Sketch 48.2 (47327) - http://www.bohemiancoding.com/sketch -->
  <title
     id="title2">ubuntu</title>
  <desc
     id="desc4">Created with Sketch.</desc>
  <defs
     id="defs6" />
  <g
     id="Get-OpenVPN"
     transform="matrix(16.009224,0,0,16.009224,-14984.634,-9301.3591)"
     style="fill:none;fill-rule:evenodd;stroke:none;stroke-width:1">
    <g
       id="ubuntu"
       transform="translate(936,581)"
       style="fill-rule:nonzero">
      <ellipse
         id="Oval"
         cx="3.1171987"
         cy="15.993218"
         rx="3.1171987"
         ry="3.1112053"
         style="fill:#ff6309" />
      <ellipse
         id="ellipse9"
         cx="25.469473"
         cy="28.870146"
         rx="3.1174109"
         ry="3.1114173"
         style="fill:#ffb515" />
      <ellipse
         id="ellipse11"
         cx="25.466713"
         cy="3.1112053"
         rx="3.1171987"
         ry="3.1112053"
         style="fill:#c90016" />
      <path
         d="m 18.018219,8.2945695 c 3.881582,0 7.101973,2.8766095 7.635343,6.6059865 h 5.340493 C 30.751151,11.970119 29.534295,9.2386755 27.498911,7.0847152 26.195425,7.7471788 24.592555,7.759894 23.231103,6.9755762 21.868589,6.1901987 21.078089,4.7976689 21.002288,3.3381722 20.023822,3.1107477 19.022442,2.9961261 18.017794,2.9965563 c -1.948753,0 -3.831897,0.4244768 -5.544541,1.2295629 l 2.674281,4.6221987 c 0.912481,-0.3665484 1.887071,-0.5545446 2.870685,-0.5537484 z"
         id="Shape"
         inkscape:connector-curvature="0"
         style="fill:#ff6309" />
      <path
         d="m 10.305164,15.993218 c 0,-2.452768 1.155069,-4.640847 2.950521,-6.0516021 L 10.582466,5.320053 C 9.949231,5.7616893 9.356045,6.2579324 8.8097329,6.8030729 7.2627055,8.3471258 6.1532877,10.211391 5.5428425,12.24604 c 1.2300205,0.795126 2.0445137,2.175576 2.0445137,3.747178 0,1.571179 -0.8144932,2.951842 -2.0445137,3.746756 0.6104452,2.034648 1.719863,3.898702 3.2668904,5.443178 0.5459045,0.544875 1.1385857,1.04097 1.7712471,1.482596 l 2.673643,-4.622198 c -1.795027,-1.410543 -2.949459,-3.598411 -2.949459,-6.050332 z"
         id="path14"
         inkscape:connector-curvature="0"
         style="fill:#ffb515" />
      <path
         d="m 25.653774,17.082278 c -0.531884,3.730649 -3.752911,6.609166 -7.635555,6.609166 -1.014507,0 -1.984,-0.197086 -2.871746,-0.554173 l -2.674069,4.622411 c 1.712219,0.80551 3.596425,1.230199 5.545603,1.230199 1.018329,0 2.019034,-0.117192 2.986616,-0.34204 0.07453,-1.461404 0.865028,-2.856477 2.228603,-3.642278 1.361877,-0.784742 2.965384,-0.77245 4.26887,-0.108503 2.033472,-2.154385 3.249479,-4.885404 3.491322,-7.814782 z"
         id="path16"
         inkscape:connector-curvature="0"
         style="fill:#c90016" />
    </g>
  </g>
</svg>
