<?xml version="1.0" encoding="UTF-8" standalone="no"?>
<!-- Created with Inkscape (http://www.inkscape.org/) -->

<svg
   width="511.99997"
   height="511.99997"
   viewBox="0 0 135.46665 135.46666"
   version="1.1"
   id="svg1"
   inkscape:version="1.5-dev (1:1.5.0+202501030121+f7a01b6aea)"
   sodipodi:docname="concept-blocksh-6x6.svg"
   xml:space="preserve"
   xmlns:inkscape="http://www.inkscape.org/namespaces/inkscape"
   xmlns:sodipodi="http://sodipodi.sourceforge.net/DTD/sodipodi-0.dtd"
   xmlns="http://www.w3.org/2000/svg"
   xmlns:svg="http://www.w3.org/2000/svg"><sodipodi:namedview
     id="namedview1"
     pagecolor="#ffffff"
     bordercolor="#000000"
     borderopacity="0.25"
     inkscape:showpageshadow="false"
     inkscape:pageopacity="0.0"
     inkscape:pagecheckerboard="0"
     inkscape:deskcolor="#d1d1d1"
     inkscape:document-units="px"
     showgrid="false"
     showguides="false"
     inkscape:current-layer="layer1" /><defs
     id="defs1" /><g
     inkscape:label="Camada 1"
     inkscape:groupmode="layer"
     id="layer1"
     transform="translate(-20.185188,-99.316689)"><g
       id="g2"><circle
         r="67.73333"
         cy="167.05002"
         cx="87.918518"
         id="path822"
         style="fill:none;fill-opacity:1;stroke:none;stroke-width:1.86306;stroke-linecap:round;stroke-linejoin:round;stroke-miterlimit:4;stroke-dasharray:none;stroke-dashoffset:0;stroke-opacity:1;paint-order:stroke fill markers" /><g
         id="g1"
         transform="matrix(0.70685155,0,0,0.70685155,25.773175,50.09258)"><rect
           style="opacity:1;fill:#000000;stroke:#ffffff;stroke-width:2.64583;stroke-linecap:round;stroke-linejoin:miter;stroke-dasharray:none;stroke-dashoffset:16.5;paint-order:markers fill stroke"
           id="rect1"
           width="26.458334"
           height="26.458334"
           x="8.5435143"
           y="86.087524" /><rect
           style="opacity:1;fill:#000000;stroke:#ffffff;stroke-width:2.64583;stroke-linecap:round;stroke-linejoin:miter;stroke-dasharray:none;stroke-dashoffset:16.5;paint-order:markers fill stroke"
           id="rect2"
           width="26.458334"
           height="26.458334"
           x="35.001846"
           y="86.087524" /><rect
           style="opacity:1;fill:#000000;stroke:#ffffff;stroke-width:2.64583;stroke-linecap:round;stroke-linejoin:miter;stroke-dasharray:none;stroke-dashoffset:16.5;paint-order:markers fill stroke"
           id="rect3"
           width="26.458334"
           height="26.458334"
           x="61.460182"
           y="86.087524" /><rect
           style="opacity:1;fill:#000000;stroke:#ffffff;stroke-width:2.64583;stroke-linecap:round;stroke-linejoin:miter;stroke-dasharray:none;stroke-dashoffset:16.5;paint-order:markers fill stroke"
           id="rect4"
           width="26.458334"
           height="26.458334"
           x="8.5435143"
           y="112.54586" /><rect
           style="opacity:1;fill:#000000;stroke:#ffffff;stroke-width:2.64583;stroke-linecap:round;stroke-linejoin:miter;stroke-dasharray:none;stroke-dashoffset:16.5;paint-order:markers fill stroke"
           id="rect5"
           width="26.458334"
           height="26.458334"
           x="35.001846"
           y="112.54586" /><rect
           style="opacity:1;fill:#000000;stroke:#ffffff;stroke-width:2.64583;stroke-linecap:round;stroke-linejoin:miter;stroke-dasharray:none;stroke-dashoffset:16.5;paint-order:markers fill stroke"
           id="rect6"
           width="26.458334"
           height="26.458334"
           x="61.460182"
           y="112.54586" /><rect
           style="opacity:1;fill:#000000;stroke:#ffffff;stroke-width:2.64583;stroke-linecap:round;stroke-linejoin:miter;stroke-dasharray:none;stroke-dashoffset:16.5;paint-order:markers fill stroke"
           id="rect7"
           width="26.458334"
           height="26.458334"
           x="87.918518"
           y="86.087524" /><rect
           style="opacity:1;fill:#000000;stroke:#ffffff;stroke-width:2.64583;stroke-linecap:round;stroke-linejoin:miter;stroke-dasharray:none;stroke-dashoffset:16.5;paint-order:markers fill stroke"
           id="rect8"
           width="26.458334"
           height="26.458334"
           x="114.37685"
           y="86.087524" /><rect
           style="opacity:1;fill:#000000;stroke:#ffffff;stroke-width:2.64583;stroke-linecap:round;stroke-linejoin:miter;stroke-dasharray:none;stroke-dashoffset:16.5;paint-order:markers fill stroke"
           id="rect9"
           width="26.458334"
           height="26.458334"
           x="140.83517"
           y="86.087524" /><rect
           style="opacity:1;fill:#000000;stroke:#ffffff;stroke-width:2.64583;stroke-linecap:round;stroke-linejoin:miter;stroke-dasharray:none;stroke-dashoffset:16.5;paint-order:markers fill stroke"
           id="rect10"
           width="26.458334"
           height="26.458334"
           x="87.918518"
           y="112.54585" /><rect
           style="opacity:1;fill:#000000;stroke:#ffffff;stroke-width:2.64583;stroke-linecap:round;stroke-linejoin:miter;stroke-dasharray:none;stroke-dashoffset:16.5;paint-order:markers fill stroke"
           id="rect11"
           width="26.458334"
           height="26.458334"
           x="114.37685"
           y="112.54585" /><rect
           style="opacity:1;fill:#000000;stroke:#ffffff;stroke-width:2.64583;stroke-linecap:round;stroke-linejoin:miter;stroke-dasharray:none;stroke-dashoffset:16.5;paint-order:markers fill stroke"
           id="rect12"
           width="26.458334"
           height="26.458334"
           x="140.83517"
           y="112.54585" /><rect
           style="opacity:1;fill:#000000;stroke:#ffffff;stroke-width:2.64583;stroke-linecap:round;stroke-linejoin:miter;stroke-dasharray:none;stroke-dashoffset:16.5;paint-order:markers fill stroke"
           id="rect17"
           width="26.458334"
           height="26.458334"
           x="8.5435143"
           y="139.0042" /><rect
           style="opacity:1;fill:#000000;stroke:#ffffff;stroke-width:2.64583;stroke-linecap:round;stroke-linejoin:miter;stroke-dasharray:none;stroke-dashoffset:16.5;paint-order:markers fill stroke"
           id="rect18"
           width="26.458334"
           height="26.458334"
           x="35.001846"
           y="139.0042" /><rect
           style="opacity:1;fill:#000000;stroke:#ffffff;stroke-width:2.64583;stroke-linecap:round;stroke-linejoin:miter;stroke-dasharray:none;stroke-dashoffset:16.5;paint-order:markers fill stroke"
           id="rect19"
           width="26.458334"
           height="26.458334"
           x="61.460182"
           y="139.0042" /><rect
           style="opacity:1;fill:#000000;stroke:#ffffff;stroke-width:2.64583;stroke-linecap:round;stroke-linejoin:miter;stroke-dasharray:none;stroke-dashoffset:16.5;paint-order:markers fill stroke"
           id="rect20"
           width="26.458334"
           height="26.458334"
           x="8.5435143"
           y="165.46252" /><rect
           style="opacity:1;fill:#000000;stroke:#ffffff;stroke-width:2.64583;stroke-linecap:round;stroke-linejoin:miter;stroke-dasharray:none;stroke-dashoffset:16.5;paint-order:markers fill stroke"
           id="rect21"
           width="26.458334"
           height="26.458334"
           x="35.001846"
           y="165.46252" /><rect
           style="opacity:1;fill:#000000;stroke:#ffffff;stroke-width:2.64583;stroke-linecap:round;stroke-linejoin:miter;stroke-dasharray:none;stroke-dashoffset:16.5;paint-order:markers fill stroke"
           id="rect22"
           width="26.458334"
           height="26.458334"
           x="61.460182"
           y="165.46252" /><rect
           style="opacity:1;fill:#000000;stroke:#ffffff;stroke-width:2.64583;stroke-linecap:round;stroke-linejoin:miter;stroke-dasharray:none;stroke-dashoffset:16.5;paint-order:markers fill stroke"
           id="rect23"
           width="26.458334"
           height="26.458334"
           x="87.918518"
           y="139.0042" /><rect
           style="opacity:1;fill:#000000;stroke:#ffffff;stroke-width:2.64583;stroke-linecap:round;stroke-linejoin:miter;stroke-dasharray:none;stroke-dashoffset:16.5;paint-order:markers fill stroke"
           id="rect24"
           width="26.458334"
           height="26.458334"
           x="114.37685"
           y="139.0042" /><rect
           style="opacity:1;fill:#000000;stroke:#ffffff;stroke-width:2.64583;stroke-linecap:round;stroke-linejoin:miter;stroke-dasharray:none;stroke-dashoffset:16.5;paint-order:markers fill stroke"
           id="rect25"
           width="26.458334"
           height="26.458334"
           x="140.83517"
           y="139.0042" /><rect
           style="opacity:1;fill:#000000;stroke:#ffffff;stroke-width:2.64583;stroke-linecap:round;stroke-linejoin:miter;stroke-dasharray:none;stroke-dashoffset:16.5;paint-order:markers fill stroke"
           id="rect27"
           width="26.458334"
           height="26.458334"
           x="114.37685"
           y="165.46252" /><rect
           style="opacity:1;fill:#000000;stroke:#ffffff;stroke-width:2.64583;stroke-linecap:round;stroke-linejoin:miter;stroke-dasharray:none;stroke-dashoffset:16.5;paint-order:markers fill stroke"
           id="rect28"
           width="26.458334"
           height="26.458334"
           x="140.83517"
           y="165.46252" /><rect
           style="opacity:1;fill:#000000;stroke:#ffffff;stroke-width:2.64583;stroke-linecap:round;stroke-linejoin:miter;stroke-dasharray:none;stroke-dashoffset:16.5;paint-order:markers fill stroke"
           id="rect33"
           width="26.458334"
           height="26.458334"
           x="8.5435143"
           y="191.92085" /><rect
           style="opacity:1;fill:#000000;stroke:#ffffff;stroke-width:2.64583;stroke-linecap:round;stroke-linejoin:miter;stroke-dasharray:none;stroke-dashoffset:16.5;paint-order:markers fill stroke"
           id="rect34"
           width="26.458334"
           height="26.458334"
           x="35.001846"
           y="191.92085" /><rect
           style="opacity:1;fill:#000000;stroke:#ffffff;stroke-width:2.64583;stroke-linecap:round;stroke-linejoin:miter;stroke-dasharray:none;stroke-dashoffset:16.5;paint-order:markers fill stroke"
           id="rect36"
           width="26.458334"
           height="26.458334"
           x="8.5435143"
           y="218.37918" /><rect
           style="opacity:1;fill:#000000;stroke:#ffffff;stroke-width:2.64583;stroke-linecap:round;stroke-linejoin:miter;stroke-dasharray:none;stroke-dashoffset:16.5;paint-order:markers fill stroke"
           id="rect37"
           width="26.458334"
           height="26.458334"
           x="35.001846"
           y="218.37918" /><rect
           style="opacity:1;fill:#000000;stroke:#ffffff;stroke-width:2.64583;stroke-linecap:round;stroke-linejoin:miter;stroke-dasharray:none;stroke-dashoffset:16.5;paint-order:markers fill stroke"
           id="rect38"
           width="26.458334"
           height="26.458334"
           x="61.460182"
           y="218.37918" /><rect
           style="fill:#000000;stroke:#ffffff;stroke-width:2.64583;stroke-linecap:round;stroke-linejoin:miter;stroke-dasharray:none;stroke-dashoffset:16.5;paint-order:markers fill stroke"
           id="rect26"
           width="26.458334"
           height="26.458334"
           x="87.918518"
           y="165.46252" /><rect
           style="fill:#000000;stroke:#ffffff;stroke-width:2.64583;stroke-linecap:round;stroke-linejoin:miter;stroke-dasharray:none;stroke-dashoffset:16.5;paint-order:markers fill stroke"
           id="rect35"
           width="26.458334"
           height="26.458334"
           x="61.460182"
           y="191.92085" /><rect
           style="fill:#000000;stroke:#ffffff;stroke-width:2.64583;stroke-linecap:round;stroke-linejoin:miter;stroke-dasharray:none;stroke-dashoffset:16.5;paint-order:markers fill stroke"
           id="rect39"
           width="26.458334"
           height="26.458334"
           x="87.918518"
           y="191.92085" /><rect
           style="fill:#000000;stroke:#ffffff;stroke-width:2.64583;stroke-linecap:round;stroke-linejoin:miter;stroke-dasharray:none;stroke-dashoffset:16.5;paint-order:markers fill stroke"
           id="rect40"
           width="26.458334"
           height="26.458334"
           x="114.37685"
           y="191.92085" /><rect
           style="opacity:1;fill:#000000;stroke:#ffffff;stroke-width:2.64583;stroke-linecap:round;stroke-linejoin:miter;stroke-dasharray:none;stroke-dashoffset:16.5;paint-order:markers fill stroke"
           id="rect41"
           width="26.458334"
           height="26.458334"
           x="140.83517"
           y="191.92085" /><rect
           style="opacity:1;fill:#000000;stroke:#ffffff;stroke-width:2.64583;stroke-linecap:round;stroke-linejoin:miter;stroke-dasharray:none;stroke-dashoffset:16.5;paint-order:markers fill stroke"
           id="rect42"
           width="26.458334"
           height="26.458334"
           x="87.918518"
           y="218.37918" /><rect
           style="opacity:1;fill:#000000;stroke:#ffffff;stroke-width:2.64583;stroke-linecap:round;stroke-linejoin:miter;stroke-dasharray:none;stroke-dashoffset:16.5;paint-order:markers fill stroke"
           id="rect43"
           width="26.458334"
           height="26.458334"
           x="114.37685"
           y="218.37918" /><rect
           style="opacity:1;fill:#000000;stroke:#ffffff;stroke-width:2.64571;stroke-linecap:round;stroke-linejoin:miter;stroke-dasharray:none;stroke-dashoffset:16.5;paint-order:markers fill stroke"
           id="rect44"
           width="26.458334"
           height="26.458334"
           x="140.83517"
           y="218.37918" /><g
           id="g16"
           transform="translate(16.845137,-15.030439)"
           style="stroke:#999999"><rect
             style="opacity:1;fill:#999999;stroke:#999999;stroke-width:2.64583;stroke-linecap:round;stroke-linejoin:miter;stroke-dasharray:none;stroke-dashoffset:16.5;paint-order:markers fill stroke"
             id="rect13"
             width="26.458334"
             height="26.458334"
             x="87.918518"
             y="165.46252" /><rect
             style="opacity:1;fill:#999999;stroke:#999999;stroke-width:2.64583;stroke-linecap:round;stroke-linejoin:miter;stroke-dasharray:none;stroke-dashoffset:16.5;paint-order:markers fill stroke"
             id="rect14"
             width="26.458334"
             height="26.458334"
             x="61.460182"
             y="191.92085" /><rect
             style="opacity:1;fill:#999999;stroke:#999999;stroke-width:2.64583;stroke-linecap:round;stroke-linejoin:miter;stroke-dasharray:none;stroke-dashoffset:16.5;paint-order:markers fill stroke"
             id="rect15"
             width="26.458334"
             height="26.458334"
             x="87.918518"
             y="191.92085" /><rect
             style="opacity:1;fill:#999999;stroke:#999999;stroke-width:2.64583;stroke-linecap:round;stroke-linejoin:miter;stroke-dasharray:none;stroke-dashoffset:16.5;paint-order:markers fill stroke"
             id="rect16"
             width="26.458334"
             height="26.458334"
             x="114.37685"
             y="191.92085" /></g><g
           id="g57"
           style="stroke:#999999"><rect
             style="opacity:1;fill:#999999;stroke:#999999;stroke-width:2.64583;stroke-linecap:round;stroke-linejoin:miter;stroke-dasharray:none;stroke-dashoffset:16.5;paint-order:markers fill stroke"
             id="rect29"
             width="26.458334"
             height="26.458334"
             x="8.5435143"
             y="86.087524" /><rect
             style="opacity:1;fill:#999999;stroke:#999999;stroke-width:2.64583;stroke-linecap:round;stroke-linejoin:miter;stroke-dasharray:none;stroke-dashoffset:16.5;paint-order:markers fill stroke"
             id="rect30"
             width="26.458334"
             height="26.458334"
             x="35.001846"
             y="86.087524" /><rect
             style="opacity:1;fill:#999999;stroke:#999999;stroke-width:2.64583;stroke-linecap:round;stroke-linejoin:miter;stroke-dasharray:none;stroke-dashoffset:16.5;paint-order:markers fill stroke"
             id="rect31"
             width="26.458334"
             height="26.458334"
             x="61.460182"
             y="86.087524" /><rect
             style="opacity:1;fill:#999999;stroke:#999999;stroke-width:2.64583;stroke-linecap:round;stroke-linejoin:miter;stroke-dasharray:none;stroke-dashoffset:16.5;paint-order:markers fill stroke"
             id="rect32"
             width="26.458334"
             height="26.458334"
             x="8.5435143"
             y="112.54586" /><rect
             style="opacity:1;fill:#999999;stroke:#999999;stroke-width:2.64583;stroke-linecap:round;stroke-linejoin:miter;stroke-dasharray:none;stroke-dashoffset:16.5;paint-order:markers fill stroke"
             id="rect45"
             width="26.458334"
             height="26.458334"
             x="35.001846"
             y="112.54586" /><rect
             style="opacity:1;fill:#999999;stroke:#999999;stroke-width:2.64583;stroke-linecap:round;stroke-linejoin:miter;stroke-dasharray:none;stroke-dashoffset:16.5;paint-order:markers fill stroke"
             id="rect46"
             width="26.458334"
             height="26.458334"
             x="61.460182"
             y="112.54586" /><rect
             style="opacity:1;fill:#999999;stroke:#999999;stroke-width:2.64583;stroke-linecap:round;stroke-linejoin:miter;stroke-dasharray:none;stroke-dashoffset:16.5;paint-order:markers fill stroke"
             id="rect47"
             width="26.458334"
             height="26.458334"
             x="87.918518"
             y="86.087524" /><rect
             style="opacity:1;fill:#999999;stroke:#999999;stroke-width:2.64583;stroke-linecap:round;stroke-linejoin:miter;stroke-dasharray:none;stroke-dashoffset:16.5;paint-order:markers fill stroke"
             id="rect48"
             width="26.458334"
             height="26.458334"
             x="114.37685"
             y="86.087524" /><rect
             style="opacity:1;fill:#999999;stroke:#999999;stroke-width:2.64583;stroke-linecap:round;stroke-linejoin:miter;stroke-dasharray:none;stroke-dashoffset:16.5;paint-order:markers fill stroke"
             id="rect49"
             width="26.458334"
             height="26.458334"
             x="140.83517"
             y="86.087524" /><rect
             style="opacity:1;fill:#999999;stroke:#999999;stroke-width:2.64583;stroke-linecap:round;stroke-linejoin:miter;stroke-dasharray:none;stroke-dashoffset:16.5;paint-order:markers fill stroke"
             id="rect50"
             width="26.458334"
             height="26.458334"
             x="114.37685"
             y="112.54585" /><rect
             style="opacity:1;fill:#999999;stroke:#999999;stroke-width:2.64583;stroke-linecap:round;stroke-linejoin:miter;stroke-dasharray:none;stroke-dashoffset:16.5;paint-order:markers fill stroke"
             id="rect51"
             width="26.458334"
             height="26.458334"
             x="140.83517"
             y="112.54585" /><rect
             style="opacity:1;fill:#999999;stroke:#999999;stroke-width:2.64583;stroke-linecap:round;stroke-linejoin:miter;stroke-dasharray:none;stroke-dashoffset:16.5;paint-order:markers fill stroke"
             id="rect52"
             width="26.458334"
             height="26.458334"
             x="8.5435143"
             y="139.0042" /><rect
             style="opacity:1;fill:#999999;stroke:#999999;stroke-width:2.64583;stroke-linecap:round;stroke-linejoin:miter;stroke-dasharray:none;stroke-dashoffset:16.5;paint-order:markers fill stroke"
             id="rect53"
             width="26.458334"
             height="26.458334"
             x="35.001846"
             y="139.0042" /><rect
             style="opacity:1;fill:#999999;stroke:#999999;stroke-width:2.64583;stroke-linecap:round;stroke-linejoin:miter;stroke-dasharray:none;stroke-dashoffset:16.5;paint-order:markers fill stroke"
             id="rect55"
             width="26.458334"
             height="26.458334"
             x="8.5435143"
             y="191.92085" /><rect
             style="opacity:1;fill:#999999;stroke:#999999;stroke-width:2.64583;stroke-linecap:round;stroke-linejoin:miter;stroke-dasharray:none;stroke-dashoffset:16.5;paint-order:markers fill stroke"
             id="rect56"
             width="26.458334"
             height="26.458334"
             x="8.5435143"
             y="218.37918" /><rect
             style="opacity:1;fill:#999999;stroke:#999999;stroke-width:2.64583;stroke-linecap:round;stroke-linejoin:miter;stroke-dasharray:none;stroke-dashoffset:16.5;paint-order:markers fill stroke"
             id="rect57"
             width="26.458334"
             height="26.458334"
             x="35.001846"
             y="218.37918" /></g></g></g></g></svg>
