<?xml version="1.0" encoding="UTF-8" standalone="no"?>
<svg
   id="features"
   viewBox="0 0 512 512"
   version="1.1"
   sodipodi:docname="logo.svg"
   width="512"
   height="512"
   inkscape:version="1.1 (1:1.1+202105261517+ce6663b3b7)"
   inkscape:export-filename="/home/arkanon/git/show_tz.java/logo.png"
   inkscape:export-xdpi="96"
   inkscape:export-ydpi="96"
   xmlns:inkscape="http://www.inkscape.org/namespaces/inkscape"
   xmlns:sodipodi="http://sodipodi.sourceforge.net/DTD/sodipodi-0.dtd"
   xmlns="http://www.w3.org/2000/svg"
   xmlns:svg="http://www.w3.org/2000/svg">
  <defs
     id="defs24" />
  <sodipodi:namedview
     id="namedview22"
     pagecolor="#ffffff"
     bordercolor="#666666"
     borderopacity="1.0"
     inkscape:pageshadow="2"
     inkscape:pageopacity="0.0"
     inkscape:pagecheckerboard="0"
     showgrid="false"
     fit-margin-top="0"
     fit-margin-left="0"
     fit-margin-right="0"
     fit-margin-bottom="0"
     inkscape:showpageshadow="false"
     inkscape:zoom="1.6152344"
     inkscape:cx="255.38089"
     inkscape:cy="236.80774"
     inkscape:current-layer="features" />
  <style
     id="style2">.st0{fill:#fff}.st2{fill:#ffab40}</style>
  <circle
     r="256"
     cy="256"
     cx="256"
     id="path822"
     style="fill:none;fill-opacity:1;stroke:none;stroke-width:7.0415;stroke-linecap:round;stroke-linejoin:round;stroke-miterlimit:4;stroke-dasharray:none;stroke-dashoffset:0;stroke-opacity:1;paint-order:stroke fill markers" />
  <g
     id="features-timezone"
     transform="matrix(5.3045206,0,0,5.3045206,-11.914579,-0.55037605)">
    <path
       class="st0"
       d="M 79.4,59.3 C 72.9,61.5 63.8,60 61.8,59 c -2,-1 -4.8,-2 -8,-5.3 -4.2,-4.2 -6.9,-9.4 -6.9,-16.8 0,-6.6 3.5,-12.7 6.4,-15.6 1.4,-1.4 0.5,-2 -0.1,-2.3 C 51.5,18.1 45.6,17.4 43,17.4 22.1,17.4 5.2,34.5 5.2,55.5 c 0,21 17,38.1 37.8,38.1 18.7,0 34.4,-14.3 37.4,-32.8 0.1,-0.7 -0.3,-1.3 -1,-1.5 z"
       id="path4" />
    <path
       d="m 79.4,60.2 c -0.7,-0.1 -1.3,0.4 -1.4,1 -1.1,6.8 -4,12.8 -8.2,17.7 -2.8,-1.5 -6,-2.7 -9.4,-3.6 1.3,-3.9 2.2,-8.4 2.6,-13.2 0.1,-0.7 -0.4,-1.3 -1.1,-1.3 -0.7,-0.1 -1.3,0.4 -1.3,1.1 -0.4,4.6 -1.3,9 -2.6,12.8 -4.3,-1 -8.9,-1.5 -13.6,-1.6 V 56.7 h 8.3 c 0.7,0 1.2,-0.6 1.2,-1.2 0,-0.7 -0.6,-1.2 -1.2,-1.2 H 44.4 V 38.6 h 2.1 c 0.7,0 1.2,-0.6 1.2,-1.3 0,-0.7 -0.6,-1.2 -1.3,-1.2 h -2 V 19.9 c 2,0.1 4,0.3 5.9,0.7 0.7,0.1 1.3,-0.3 1.5,-1 0.1,-0.7 -0.3,-1.3 -1,-1.5 -2.5,-0.5 -5.1,-0.8 -7.6,-0.8 -20.9,0 -37.8,17.1 -37.8,38.1 0,21 17,38.1 37.8,38.1 18.7,0 34.4,-13.4 37.4,-31.9 -0.1,-0.7 -0.5,-1.3 -1.2,-1.4 z M 57.1,77 c -3,7.9 -7.7,13.2 -12.8,14 V 75.6 c 4.4,0 8.7,0.5 12.8,1.4 z M 29,77 c 4,-0.9 8.4,-1.4 12.8,-1.5 V 91 C 36.6,90.3 32,85 29,77 Z M 41.8,20 v 16.2 c -4.5,-0.1 -9,-0.6 -13.1,-1.5 3,-8.4 7.8,-13.9 13.1,-14.7 z m 0,18.6 V 54.2 H 25.4 c 0.1,-6.3 1,-12.2 2.6,-17.3 4.3,1.1 9,1.6 13.8,1.7 z m 0,18.1 v 16.4 c -4.7,0.1 -9.4,0.6 -13.6,1.6 -1.7,-5.2 -2.7,-11.4 -2.8,-18 z M 34.4,21 C 31.1,23.9 28.3,28.4 26.3,34 23.1,33.1 20.2,32 17.7,30.7 22.2,26.1 28,22.6 34.4,21 Z M 16,32.6 c 2.8,1.5 6,2.8 9.6,3.8 C 24,41.6 23,47.7 22.9,54.3 H 7.7 C 8,46 11.1,38.5 16,32.6 Z m 0.4,46.3 C 11.2,72.9 8,65.2 7.7,56.8 h 15.2 c 0.1,6.8 1.1,13.2 2.8,18.6 -3.4,0.8 -6.5,2 -9.3,3.5 z m 10.2,-1.3 c 2,5.3 4.7,9.6 7.8,12.4 -6.2,-1.6 -11.8,-4.8 -16.2,-9.2 2.5,-1.3 5.3,-2.3 8.4,-3.2 z m 24.9,12.5 c 3.2,-2.8 5.9,-7.1 7.9,-12.4 3.1,0.8 6,1.9 8.5,3.2 -4.4,4.4 -10,7.6 -16.4,9.2 z"
       fill="#1565c0"
       id="path6" />
    <path
       class="st2"
       d="m 73.5,56.9 c -12,0 -21.7,-9.8 -21.7,-21.7 0,-12 9.8,-21.7 21.7,-21.7 11.9,0 21.7,9.8 21.7,21.7 0,11.9 -9.7,21.7 -21.7,21.7 z"
       id="path8" />
    <path
       class="st0"
       d="m 73.5,16.9 c -10.1,0 -18.2,8.2 -18.2,18.2 0,10.1 8.2,18.2 18.2,18.2 10.1,0 18.2,-8.2 18.2,-18.2 0,-10 -8.2,-18.2 -18.2,-18.2 z"
       id="path10" />
    <path
       class="st2"
       d="m 73.8,38.6 c -0.2,0 -0.5,0 -0.7,-0.1 C 72.4,38.2 72,37.6 72,36.9 V 21.5 c 0,-1 0.8,-1.8 1.8,-1.8 1,0 1.8,0.8 1.8,1.8 v 11.2 l 4.3,-4.2 c 0.7,-0.7 1.8,-0.7 2.5,0 0.7,0.7 0.7,1.8 0,2.5 l -7.3,7.2 c -0.4,0.3 -0.8,0.4 -1.3,0.4 z"
       id="path12" />
    <circle
       class="st2"
       cx="59.099998"
       cy="35.099998"
       r="1.9"
       id="circle14" />
    <circle
       class="st2"
       cx="87.699997"
       cy="35.099998"
       r="1.9"
       id="circle16" />
    <circle
       class="st2"
       cx="74.099998"
       cy="49.200001"
       r="1.9"
       id="circle18" />
  </g>
</svg>
