<?xml version="1.0" encoding="UTF-8" standalone="no"?>
<svg
   xmlns:dc="http://purl.org/dc/elements/1.1/"
   xmlns:cc="http://creativecommons.org/ns#"
   xmlns:rdf="http://www.w3.org/1999/02/22-rdf-syntax-ns#"
   xmlns:svg="http://www.w3.org/2000/svg"
   xmlns="http://www.w3.org/2000/svg"
   xmlns:sodipodi="http://sodipodi.sourceforge.net/DTD/sodipodi-0.dtd"
   xmlns:inkscape="http://www.inkscape.org/namespaces/inkscape"
   inkscape:version="1.0 (1.0+r73+1)"
   sodipodi:docname="db-oracle.svg"
   id="svg8"
   version="1.1"
   width="512"
   viewBox="0 0 19.316736 19.326039"
   text-rendering="geometricPrecision"
   shape-rendering="geometricPrecision"
   image-rendering="optimizeQuality"
   height="512"
   fill-rule="evenodd"
   clip-rule="evenodd">
  <metadata
     id="metadata14">
    <rdf:RDF>
      <cc:Work
         rdf:about="">
        <dc:format>image/svg+xml</dc:format>
        <dc:type
           rdf:resource="http://purl.org/dc/dcmitype/StillImage" />
        <dc:title></dc:title>
      </cc:Work>
    </rdf:RDF>
  </metadata>
  <defs
     id="defs12" />
  <sodipodi:namedview
     inkscape:current-layer="svg8"
     inkscape:window-maximized="1"
     inkscape:window-y="24"
     inkscape:window-x="0"
     inkscape:cy="256"
     inkscape:cx="256"
     inkscape:zoom="1.6386719"
     fit-margin-bottom="0"
     fit-margin-right="0"
     fit-margin-left="0"
     fit-margin-top="0"
     inkscape:showpageshadow="false"
     showgrid="false"
     id="namedview10"
     inkscape:window-height="1033"
     inkscape:window-width="1920"
     inkscape:pageshadow="2"
     inkscape:pageopacity="0"
     guidetolerance="10"
     gridtolerance="10"
     objecttolerance="10"
     borderopacity="1"
     bordercolor="#666666"
     pagecolor="#ffffff" />
  <g
     transform="translate(-120.5495,10.484428)"
     id="g21">
    <circle
       style="fill:#e32124;fill-opacity:1;fill-rule:evenodd;stroke-width:0.0415208;stroke-linecap:square;stroke-dashoffset:200;paint-order:stroke fill markers"
       id="path16"
       cx="130.1898"
       cy="-0.82140815"
       r="9.6630201" />
  </g>
  <path
     sodipodi:nodetypes="ccccccccssscccccsccccccccsssccssssssssssccccssscccccscccscsccccccccccsccccccc"
     d="m 17.075363,10.426249 c -0.34581,0 -0.63489,-0.232346 -0.72405,-0.5484445 h 1.9128 l 0.26476,-0.4106568 h -2.18026 c 0.0909,-0.3249963 0.38658,-0.5500792 0.72405,-0.551146 h 1.31843 l 0.26206,-0.4106568 h -1.61021 c -0.6457,0 -1.16713,0.5214263 -1.16713,1.1644298 0,0.6430023 0.52143,1.1644293 1.16713,1.1644293 h 1.38328 l 0.26205,-0.410657 h -1.61561 z m -5.48173,0.410657 c -1.55257,0 -1.55257,-2.3288593 0,-2.3288593 h 1.61021 l -0.26476,0.4106569 h -1.31844 c -0.97848,0.026204 -0.97848,1.4813444 0,1.5075454 h 1.61561 l -0.26476,0.410657 h -1.38327 z M 3.0832927,10.426249 c 0.41607,0 0.75647,-0.337712 0.75647,-0.7537726 0,-0.416061 -0.3377,-0.7537728 -0.75647,-0.7537728 h -1.29411 c -0.97847999,0.026204 -0.97847999,1.4813444 0,1.5075454 z m -1.32382,0.410657 c -0.64571,0 -1.16712999,-0.521427 -1.16712999,-1.1644296 0,-0.6430035 0.52141999,-1.1644297 1.16712999,-1.1644297 h 1.35354 c 1.55257,0 1.55257,2.3288593 0,2.3288593 z m 4.71715,-0.753773 c 0.43767,0 0.78889,-0.3539217 0.78889,-0.7888939 0,-0.4349723 -0.35122,-0.7888942 -0.78889,-0.7888942 h -1.96142 v 2.3315611 h 0.44847 V 8.9160017 h 1.48324 c 0.20533,0 0.37553,0.1702069 0.37553,0.3782374 0,0.2080305 -0.1702,0.3755356 -0.37553,0.3755356 h -1.2644 l 1.33464,1.1671313 h 0.65111 l -0.89967,-0.753773 h 0.20263 z m 7.4134503,0.343116 V 8.5080467 h -0.44578 v 2.1073203 c 0,0.05944 0.0216,0.113471 0.0649,0.156698 0.0433,0.04052 0.10268,0.06754 0.16481,0.06754 h 2.04518 l 0.26477,-0.410657 h -2.09111 z M 8.4056327,10.015591 h 1.19684 l -0.63219,-1.0185382 -1.16172,1.8425542 h -0.52684 l 1.41029,-2.2099844 c 0.0621,-0.089156 0.1648,-0.1431896 0.27827,-0.1431896 0.10807,0 0.21074,0.051332 0.27287,0.137786 l 1.4156903,2.215388 h -0.52953 L 9.8807627,10.428951 h -1.21036 l -0.26477,-0.410658 z"
     fill="#fefefe"
     id="path4"
     style="fill-rule:nonzero;stroke-width:1" />
</svg>
