<?xml version="1.0" encoding="UTF-8" standalone="no"?>
<svg
   xmlns:dc="http://purl.org/dc/elements/1.1/"
   xmlns:cc="http://creativecommons.org/ns#"
   xmlns:rdf="http://www.w3.org/1999/02/22-rdf-syntax-ns#"
   xmlns:svg="http://www.w3.org/2000/svg"
   xmlns="http://www.w3.org/2000/svg"
   xmlns:xlink="http://www.w3.org/1999/xlink"
   xmlns:sodipodi="http://sodipodi.sourceforge.net/DTD/sodipodi-0.dtd"
   xmlns:inkscape="http://www.inkscape.org/namespaces/inkscape"
   inkscape:version="1.0 (1.0+r73+1)"
   sodipodi:docname="os-edubuntu-2.svg"
   id="svg1508"
   height="485.43729"
   width="512"
   version="1.0">
  <metadata
     id="metadata20">
    <rdf:RDF>
      <cc:Work
         rdf:about="">
        <dc:format>image/svg+xml</dc:format>
        <dc:type
           rdf:resource="http://purl.org/dc/dcmitype/StillImage" />
        <dc:title></dc:title>
      </cc:Work>
    </rdf:RDF>
  </metadata>
  <sodipodi:namedview
     inkscape:current-layer="svg1508"
     inkscape:window-maximized="1"
     inkscape:window-y="24"
     inkscape:window-x="0"
     inkscape:cy="242.71864"
     inkscape:cx="256"
     inkscape:zoom="1.6912586"
     fit-margin-bottom="0"
     fit-margin-right="0"
     fit-margin-left="0"
     fit-margin-top="0"
     inkscape:showpageshadow="false"
     showgrid="false"
     id="namedview18"
     inkscape:window-height="1033"
     inkscape:window-width="1920"
     inkscape:pageshadow="2"
     inkscape:pageopacity="0"
     guidetolerance="10"
     gridtolerance="10"
     objecttolerance="10"
     borderopacity="1"
     bordercolor="#666666"
     pagecolor="#ffffff" />
  <defs
     id="defs1510" />
  <g
     transform="matrix(1.1651411,0,0,1.1651411,-0.13727186,-0.86356422)"
     id="g56">
    <g
       id="g38">
      <path
         style="fill:#f1480e"
         id="path3112"
         d="m 254.09532,85.160767 c 8.0753,20.912733 29.02338,40.420693 52.56014,40.650403 9.27688,-0.46826 17.59073,-3.33968 24.73835,-9.03833 16.86625,19.98505 27.10616,42.56762 29.24426,68.48987 h -48.75221 c -2.84491,-22.3617 -18.07667,-43.51298 -38.5123,-54.68058 -14.97554,-7.63354 -33.52046,-10.95555 -51.12886,-6.9179 -6.64401,-12.83743 -4.98301,-30.180777 -4.51475,-45.88079 2.84491,-29.253093 15.45263,-54.442028 34.94291,-77.04227293 -0.22088,27.10615693 -3.55172,57.79053993 1.42246,84.41959993 z" />
      <path
         style="fill:#f68b11"
         id="path3116"
         d="m 195.37709,137.70324 c -21.16896,18.059 -29.9599,42.7885 -26.16963,70.37176 3.322,16.87508 12.13945,31.85062 26.16963,44.00775 l -24.0227,41.59576 c -21.62838,-14.27756 -37.08985,-36.38304 -44.93544,-59.2395 11.39731,-5.19506 22.60025,-16.87509 25.21545,-29.4563 3.33084,-14.98437 -0.72448,-29.95107 -11.41498,-40.65924 -3.80794,-4.2762 -8.79095,-6.4143 -13.32337,-9.03833 7.36849,-22.11431 22.33519,-43.99008 43.75153,-58.983283 8.79095,12.872773 16.41566,27.609763 24.72951,41.401383 z" />
      <path
         style="fill:#d41308"
         id="path3120"
         d="m 360.1698,206.18428 c -2.1646,25.70137 -11.66236,48.98192 -29.00571,68.47221 -11.18526,-8.31386 -27.8218,-11.88324 -41.154,-5.93721 -11.8744,4.51475 -23.042,16.40683 -26.15196,28.76716 -1.17507,4.98301 -1.41362,10.46079 -1.17507,16.15944 -24.9769,5.01835 -51.62363,1.44013 -72.76608,-8.5524 6.66169,-14.0125 15.4438,-28.29006 23.75765,-42.3114 24.03153,9.49776 53.75289,4.26736 72.77491,-11.89208 14.72815,-12.13062 21.8846,-27.8218 25.67486,-44.70572 z" />
      <path
         style="fill:#f1480e"
         id="path2580"
         transform="matrix(1.0996925,0,0,1.0996925,39.682611,39.857906)"
         d="m 89.095453,141.16769 a 26.516504,26.516504 0 1 1 -53.033008,0 26.516504,26.516504 0 1 1 53.033008,0 z" />
      <path
         style="fill:#f68b11"
         id="path2586"
         transform="matrix(1.0996925,0,0,1.0996925,237.18715,153.22924)"
         d="m 89.095453,141.16769 a 26.516504,26.516504 0 1 1 -53.033008,0 26.516504,26.516504 0 1 1 53.033008,0 z" />
      <path
         style="fill:#d41308"
         id="path2588"
         transform="matrix(1.0996925,0,0,1.0996925,233.24173,-71.214954)"
         d="m 89.095453,141.16769 a 26.516504,26.516504 0 1 1 -53.033008,0 26.516504,26.516504 0 1 1 53.033008,0 z" />
    </g>
    <g
       id="g30">
      <path
         style="fill:#f1480e"
         id="e"
         d="m 42.633469,392.04503 3.074574,-1.74112 c 4.289927,-5.0138 0.815315,-11.7611 -1.230591,-16.66823 -4.705204,-8.58747 -13.593658,-13.19362 -23.415533,-12.3745 -8.38174,0.62101 -16.6644229,7.3645 -19.1179867,15.44526 -3.2688785,10.11524 -2.35069702,23.10694 4.3966035,31.28294 6.6444332,7.16258 16.8739662,8.59509 26.1815072,6.65206 4.084193,-1.42871 9.806635,-3.16602 10.62576,-8.48461 -0.201924,-1.84398 -0.819125,-3.5851 -2.350697,-4.91856 -1.333459,-1.02105 -3.166012,-1.11248 -4.811881,-0.80769 -4.49947,2.95265 -10.221912,5.61957 -15.837678,3.16601 -4.5109,-1.63063 -6.655863,-6.54157 -7.162578,-11.04485 l 0.403848,-0.41147 c 9.711388,0 19.537073,0.20574 29.244652,-0.0952 z M 20.551395,372.81655 c 5.112861,-1.52395 10.732436,0.71626 13.18981,5.52433 l 1.535382,4.60996 H 13.186893 c 0.716258,-4.00038 2.964088,-8.5989 7.364502,-10.13429 z" />
      <path
         style="fill:#f1480e"
         id="d"
         d="m 56.382152,392.63824 c 0,-24.15632 10.04064,-29.84019 22.95,-29.84019 6.45469,0 10.04063,2.84192 10.04063,2.84192 v -16.34106 c 0,-8.52575 12.909368,-8.52575 12.909368,0 v 43.33933 c 0,17.05152 -10.040628,24.15635 -22.949998,24.15635 -12.90936,0 -22.95,-7.10483 -22.95,-24.15635 m 32.99063,-1.42096 c 0,-14.92008 -7.17188,-16.34106 -10.04063,-16.34106 -4.30312,0 -10.04062,3.55242 -10.04062,16.34106 0,8.52576 3.58594,14.20962 10.04062,14.20962 6.45469,0 10.04063,-5.68386 10.04063,-14.20962" />
      <path
         style="fill:#f1480e"
         id="u1"
         d="M 160.45671,393.46882 V 370.2657 c 0,-3.51562 -2.8125,-6.32813 -6.32812,-6.32813 -3.51562,0 -6.32812,2.81251 -6.32812,6.32813 v 23.20312 c 0,8.43749 -3.51563,11.25 -9.84376,11.25 -6.32812,0 -9.84374,-2.81251 -9.84374,-11.25 V 370.2657 c 0,-3.51562 -2.81252,-6.32813 -6.32813,-6.32813 -3.51563,0 -6.32813,2.81251 -6.32813,6.32813 v 23.20312 c 0,16.87498 9.84377,23.90626 22.5,23.90626 12.65624,0 22.5,-7.03128 22.5,-23.90626" />
      <path
         style="fill:#d41308"
         id="b"
         d="m 220.56184,393.07447 c 0,-24.15632 -10.04064,-29.84019 -22.95,-29.84019 -6.45469,0 -10.04063,2.84192 -10.04063,2.84192 v -16.34106 c 0,-8.52575 -12.90937,-8.52575 -12.90937,0 v 43.33933 c 0,17.05152 10.04063,24.15635 22.95,24.15635 12.90936,0 22.95,-7.10483 22.95,-24.15635 m -32.99063,-1.42096 c 0,-14.92008 7.17188,-16.34106 10.04063,-16.34106 4.30312,0 10.04062,3.55242 10.04062,16.34106 0,8.52576 -3.58594,14.20962 -10.04062,14.20962 -6.45469,0 -10.04063,-5.68386 -10.04063,-14.20962" />
      <path
         style="fill:#d41308"
         id="u2"
         d="M 278.59161,393.46882 V 370.2657 c 0,-3.51562 -2.8125,-6.32813 -6.32812,-6.32813 -3.51562,0 -6.32812,2.81251 -6.32812,6.32813 v 23.20312 c 0,8.43749 -3.51563,11.25 -9.84376,11.25 -6.32812,0 -9.84374,-2.81251 -9.84374,-11.25 V 370.2657 c 0,-3.51562 -2.81252,-6.32813 -6.32813,-6.32813 -3.51563,0 -6.32813,2.81251 -6.32813,6.32813 v 23.20312 c 0,16.87498 9.84377,23.90626 22.5,23.90626 12.65624,0 22.5,-7.03128 22.5,-23.90626" />
      <use
         height="100%"
         width="100%"
         y="0"
         x="0"
         xlink:href="#u2"
         id="n"
         transform="rotate(180,285.94013,390.65632)" />
      <path
         style="fill:#d41308"
         id="t"
         d="m 354.0363,363.32363 c -7.71178,0 -7.71178,11.35384 0,11.35384 h 2.10321 v 24.69463 c 0,13.48267 3.29504,17.88231 14.65238,17.88231 5.46834,0 13.46055,-0.99347 13.46055,-6.67039 0,-3.54807 -3.22492,-4.47057 -4.13631,-4.47057 -1.96299,0 -3.99611,0.85153 -6.23954,0.85153 -3.92598,0 -5.11781,-1.98692 -5.11781,-8.65731 v -23.6302 h 5.60856 c 7.71178,0 7.71178,-11.35384 0,-11.35384 h -5.60856 v -13.48269 c 0,-8.51538 -12.61927,-8.51538 -12.61927,0 v 13.48269 h -2.10321" />
      <use
         height="100%"
         width="100%"
         y="0"
         x="0"
         xlink:href="#u2"
         id="u3"
         transform="translate(160.95798)" />
    </g>
  </g>
</svg>
