<?xml version="1.0" encoding="UTF-8" standalone="no"?>
<svg
   xmlns:dc="http://purl.org/dc/elements/1.1/"
   xmlns:cc="http://creativecommons.org/ns#"
   xmlns:rdf="http://www.w3.org/1999/02/22-rdf-syntax-ns#"
   xmlns:svg="http://www.w3.org/2000/svg"
   xmlns="http://www.w3.org/2000/svg"
   xmlns:sodipodi="http://sodipodi.sourceforge.net/DTD/sodipodi-0.dtd"
   xmlns:inkscape="http://www.inkscape.org/namespaces/inkscape"
   inkscape:version="1.0 (1.0+r73+1)"
   height="512"
   width="512"
   sodipodi:docname="spring-framework.svg"
   xml:space="preserve"
   viewBox="0 0 512 512"
   y="0px"
   x="0px"
   id="Layer_1"
   version="1.1"><metadata
   id="metadata15"><rdf:RDF><cc:Work
       rdf:about=""><dc:format>image/svg+xml</dc:format><dc:type
         rdf:resource="http://purl.org/dc/dcmitype/StillImage" /><dc:title>icon-framework</dc:title></cc:Work></rdf:RDF></metadata><defs
   id="defs13" /><sodipodi:namedview
   inkscape:current-layer="Layer_1"
   inkscape:window-maximized="1"
   inkscape:window-y="24"
   inkscape:window-x="0"
   inkscape:cy="256"
   inkscape:cx="256"
   inkscape:zoom="1.6386719"
   fit-margin-bottom="0"
   fit-margin-right="0"
   fit-margin-left="0"
   fit-margin-top="0"
   inkscape:showpageshadow="false"
   showgrid="false"
   id="namedview11"
   inkscape:window-height="1033"
   inkscape:window-width="1920"
   inkscape:pageshadow="2"
   inkscape:pageopacity="0"
   guidetolerance="10"
   gridtolerance="10"
   objecttolerance="10"
   borderopacity="1"
   bordercolor="#666666"
   pagecolor="#ffffff" />
<style
   id="style2"
   type="text/css">
	.st0{fill:#6DB33F;}
</style>
<title
   id="title4">icon-framework</title>
<path
   style="stroke-width:1.00392"
   id="path6"
   d="M 481.07922,163.13725 C 475.45725,128.70275 460.49882,98.484706 437.00706,74.992941 413.51529,51.501176 383.49804,36.643137 348.96314,31.021176 321.35529,11.243922 289.63137,0 256,0 222.36863,0 190.64471,11.243922 163.03686,31.021176 128.50196,36.643137 98.384314,51.501176 74.992941,74.992941 51.099608,98.785882 36.643137,129.20471 31.121569,162.83608 11.243922,190.54431 0,222.26824 0,256 c 0,33.73176 11.243922,65.45569 31.121569,93.16392 5.521568,33.63137 19.978039,64.0502 43.871372,87.84314 23.391373,23.39137 53.509019,38.3498 88.043919,43.97176 C 190.7451,500.75608 222.36863,512 256,512 c 33.63137,0 65.2549,-11.24392 92.96314,-31.02118 34.5349,-5.62196 64.65255,-20.58039 88.04392,-43.97176 23.89333,-23.89333 38.24941,-54.31216 43.87137,-87.84314 C 500.75608,321.45569 512,289.73176 512,256 c 0,-33.73176 -11.24392,-65.2549 -30.92078,-92.86275 z m -6.22432,61.94197 c -0.80314,6.02353 -1.90745,11.94666 -3.21255,17.97019 -7.22823,-22.48784 -17.16706,-43.97176 -29.51529,-64.05019 -5.52157,-22.88942 -13.65333,-45.07608 -24.49569,-66.05804 22.98981,14.85804 42.36549,32.72784 56.92236,52.80627 3.01176,19.57647 3.11215,39.6549 0.30117,59.33177 z m -28.41098,-24.69647 c 9.33647,17.76941 16.6651,36.44235 21.98588,55.81803 -5.32078,19.37569 -12.7498,38.04863 -22.08627,55.81804 6.32471,-36.94431 6.4251,-74.69176 0.10039,-111.63607 z m -270.35608,142.0549 c 6.52549,-4.51765 13.75373,-7.83059 21.38353,-9.83843 32.32628,-7.52942 46.88314,-9.93883 66.56,-18.47216 36.94432,-15.96235 75.09334,-53.50902 84.93177,-94.36863 -16.16314,38.95216 -59.73334,70.4753 -98.28392,81.92 -26.30275,7.83059 -80.11295,13.65333 -80.41412,13.65333 l -1.40549,-1.2047 c -30.72,-17.46824 -27.10588,-86.13647 31.9247,-104.50824 25.80079,-8.03137 56.11922,-0.70274 83.82745,-5.42117 29.5153,-5.01961 64.65255,-24.59608 80.21334,-52.20392 12.34823,46.58196 26.20235,118.9647 -9.73804,160.82823 -44.47373,51.60157 -142.45647,6.4251 -178.99922,29.61569 z M 312.01882,446.34353 C 294.24941,455.78039 275.37569,463.20941 256,468.5302 c -19.47608,-5.32079 -38.24941,-12.74981 -56.01882,-22.18667 37.0447,6.32471 74.99294,6.32471 112.03764,0 z M 118.06118,393.93882 c 13.15137,13.15138 27.40706,25.19843 42.46588,35.9404 -19.07451,-5.92314 -37.34588,-13.85412 -54.71373,-23.79295 -9.93882,-17.36784 -17.869801,-35.84 -23.792938,-54.91451 10.741961,15.36 22.889408,29.61569 36.040788,42.76706 z M 82.020392,160.72784 c 5.923137,-19.07451 13.95451,-37.54666 23.792938,-54.91451 17.36785,-9.838428 35.63922,-17.869801 54.71373,-23.792938 -15.15922,10.842353 -29.31451,22.789018 -42.46588,35.940388 -13.15138,13.25177 -25.298827,27.50746 -36.040788,42.76706 z m 67.664318,187.03059 c -8.53334,0.20079 -15.56079,-6.52549 -15.76157,-15.05882 -0.20079,-8.53334 6.52549,-15.56079 15.05882,-15.76157 8.53333,-0.20079 15.56079,6.52549 15.76157,15.05882 0,0 0,0.10039 0,0.10039 0.10039,8.53334 -6.62588,15.4604 -15.05882,15.66118 z M 199.98118,65.656471 C 217.75059,56.219608 236.62431,48.790588 256,43.469804 c 19.47608,5.320784 38.24941,12.749804 56.01882,22.186667 -37.0447,-6.324706 -74.99294,-6.324706 -112.03764,0 z M 393.93882,393.93882 c 13.15138,-13.15137 25.19843,-27.40706 36.04079,-42.56627 -5.92314,19.07451 -13.95451,37.44627 -23.79294,54.71372 -17.36785,9.83844 -35.63922,17.76942 -54.71373,23.79295 15.15922,-10.74197 29.31451,-22.78902 42.46588,-35.9404 z m 0,-275.87764 C 380.78745,104.9098 366.63216,92.862745 351.47294,82.120784 c 19.07451,5.923138 37.34588,13.95451 54.71373,23.792946 9.83843,17.36784 17.8698,35.7396 23.79294,54.91451 -10.74196,-15.36 -22.88941,-29.61569 -36.04079,-42.76706 z m 38.24942,-38.249415 c 19.47607,19.375686 32.72784,43.770985 39.45411,71.378825 -16.26353,-19.2753 -36.74353,-36.34196 -60.63686,-50.19608 -13.85412,-23.893334 -30.92078,-44.373334 -50.19608,-60.636863 27.80863,6.726275 52.00314,19.978039 71.37883,39.454118 z M 399.15922,94.368627 C 378.27765,83.626667 356.19137,75.494902 333.30196,70.073725 313.22353,57.625098 291.63922,47.585882 269.15137,40.357647 c 15.56079,-3.413333 31.42275,-5.12 47.3851,-5.220392 10.03922,0 19.97804,0.803137 29.81647,2.30902 20.17882,14.556862 37.94824,33.932549 52.80628,56.922352 z M 256,6.8266667 c 27.70824,0 54.01098,8.0313723 77.70353,22.2870583 -5.62196,-0.50196 -11.34431,-0.702745 -17.16706,-0.702745 -20.48,0.100393 -40.75922,2.810981 -60.53647,8.131765 -19.77725,-5.320784 -40.05647,-8.031372 -60.53647,-8.131765 -5.82275,0 -11.5451,0.200785 -17.16706,0.702745 C 201.98902,14.757647 228.29176,6.8266667 256,6.8266667 Z M 165.64706,37.446275 c 9.83843,-1.505883 19.87765,-2.30902 29.81647,-2.30902 15.96235,0.100392 31.82431,1.807059 47.3851,5.220392 -22.48785,7.228235 -44.07216,17.167059 -64.15059,29.716078 -22.78902,5.421177 -44.97569,13.653334 -65.85726,24.294902 14.85804,-22.989803 32.62746,-42.36549 52.80628,-56.922352 z M 79.811765,79.811765 C 99.187451,60.436078 123.48235,47.083922 151.19059,40.357647 131.91529,56.621176 114.84863,77.101176 100.99451,100.99451 77.201569,114.84863 56.821961,131.71451 40.558431,150.9898 47.184314,123.88392 60.03451,99.488627 79.811765,79.811765 Z M 37.546667,165.54667 c 14.657255,-20.07843 33.932549,-37.84785 56.82196,-52.60549 -10.74196,20.98196 -18.873725,43.16862 -24.395294,66.05804 -12.348235,20.07843 -22.287058,41.56235 -29.515294,64.05019 -5.722353,-26.8047 -6.826666,-53.00706 -2.911372,-77.50274 z M 65.656471,311.61725 C 56.32,293.94824 48.991373,275.27529 43.670588,256 48.991373,236.72471 56.32,218.05176 65.656471,200.38275 c -6.324706,36.84392 -6.324706,74.39058 0,111.2345 z M 29.31451,334.1051 C 14.858039,310.31216 6.8266667,283.90902 6.8266667,256 c 0,-27.90902 8.1317643,-54.31216 22.4878433,-78.1051 -2.108235,25.09804 0.401568,51.50118 7.429019,78.1051 -7.127843,26.60392 -9.637647,53.00706 -7.429019,78.1051 z m 11.143529,-65.05412 c 7.228236,22.38745 17.167059,43.87137 29.515294,63.9498 5.521569,22.88942 13.653334,45.07608 24.395294,66.05804 -22.889411,-14.75764 -42.164705,-32.62745 -56.82196,-52.60549 -3.915294,-24.49568 -2.810981,-50.69804 2.911372,-77.40235 z M 79.811765,432.18824 C 60.134902,412.51137 47.184314,388.11608 40.558431,361.0102 c 16.163138,19.1749 36.643138,36.14117 60.436079,49.99529 13.85412,23.79294 30.92078,44.37333 50.19608,60.63686 -27.80863,-6.72627 -52.003139,-19.97804 -71.378825,-39.45411 z m 33.129415,-14.55687 c 20.88157,10.74196 42.96784,18.87373 65.75686,24.2949 20.07843,12.44863 41.66274,22.48785 64.15059,29.71608 -15.56079,3.41334 -31.42275,5.12 -47.3851,5.12 -10.03922,0 -19.97804,-0.80313 -29.81647,-2.30902 -20.17882,-14.55686 -37.94824,-33.83215 -52.70588,-56.82196 z M 256,505.17333 c -27.70824,0 -54.01098,-8.03137 -77.70353,-22.28706 5.62196,0.50197 11.34431,0.70275 17.16706,0.70275 20.48,-0.10039 40.75922,-2.81098 60.53647,-8.13177 19.77725,5.32079 40.05647,8.03138 60.53647,8.13177 5.82275,0 11.5451,-0.20078 17.16706,-0.70275 C 310.01098,497.24235 283.70824,505.17333 256,505.17333 Z m 90.35294,-30.6196 c -9.83843,1.50588 -19.87765,2.30902 -29.81647,2.30902 -15.96235,-0.1004 -31.82431,-1.80706 -47.3851,-5.12 22.48785,-7.22824 44.07216,-17.26746 64.15059,-29.71608 22.78902,-5.42118 44.97569,-13.65334 65.85726,-24.29491 -14.85804,22.88942 -32.62746,42.16471 -52.80628,56.82197 z m 85.8353,-42.36549 c -19.37569,19.37568 -43.67059,32.72784 -71.37883,39.45411 19.2753,-16.26353 36.34196,-36.74353 50.19608,-60.63686 23.79294,-13.85412 44.17255,-30.72 60.43608,-49.99529 -6.52549,27.10588 -19.57647,51.50117 -39.25333,71.17804 z m 42.26509,-85.73491 c -14.65725,20.07843 -33.93255,37.84785 -56.82196,52.60549 10.74196,-20.88157 18.87373,-42.96784 24.3953,-65.85725 12.34823,-20.07843 22.28706,-41.46196 29.61568,-63.94981 5.62196,26.60393 6.72628,52.80628 2.81098,77.20157 z m 0.90353,-90.15215 c 2.6102,-9.93883 4.71843,-20.07843 6.12392,-30.21804 2.20863,-15.76157 2.71059,-31.82432 1.40549,-47.68628 14.25569,23.69255 22.28706,49.9953 22.28706,77.70353 0,27.70824 -8.13176,54.31216 -22.48784,78.1051 2.10824,-25.09804 -0.30118,-51.50118 -7.32863,-77.90431 z"
   class="st0" />
</svg>
