<?xml version="1.0" encoding="UTF-8" standalone="no"?>
<!-- Created with Inkscape (http://www.inkscape.org/) -->
<svg xmlns:dc="http://purl.org/dc/elements/1.1/" xmlns:cc="http://creativecommons.org/ns#" xmlns:rdf="http://www.w3.org/1999/02/22-rdf-syntax-ns#" xmlns:svg="http://www.w3.org/2000/svg" xmlns="http://www.w3.org/2000/svg" xmlns:xlink="http://www.w3.org/1999/xlink" xmlns:sodipodi="http://sodipodi.sourceforge.net/DTD/sodipodi-0.dtd" xmlns:inkscape="http://www.inkscape.org/namespaces/inkscape" version="1.0" width="200" height="200" id="svg2408" sodipodi:docname="desktop-mate.svg" inkscape:version="0.92.3 (2405546, 2018-03-11)">
  <metadata id="metadata44">
    <rdf:RDF>
      <cc:Work rdf:about="">
        <dc:format>image/svg+xml</dc:format>
        <dc:type rdf:resource="http://purl.org/dc/dcmitype/StillImage"/>
        <dc:title/>
      </cc:Work>
    </rdf:RDF>
  </metadata>
  <sodipodi:namedview pagecolor="#ffffff" bordercolor="#666666" borderopacity="1" objecttolerance="10" gridtolerance="10" guidetolerance="10" inkscape:pageopacity="0" inkscape:pageshadow="2" inkscape:window-width="1920" inkscape:window-height="1016" id="namedview42" showgrid="false" inkscape:zoom="1" inkscape:cx="-29.694915" inkscape:cy="48" inkscape:window-x="0" inkscape:window-y="27" inkscape:window-maximized="1" inkscape:current-layer="svg2408">
    <inkscape:grid type="xygrid" id="grid914"/>
  </sodipodi:namedview>
  <defs id="defs2410">
    <linearGradient x1="45.447727" y1="92.539597" x2="45.447727" y2="7.0165396" id="ButtonShadow" gradientUnits="userSpaceOnUse" gradientTransform="matrix(1.0058652,0,0,0.994169,2,2)">
      <stop id="stop3750" style="stop-color:#000000" offset="0"/>
      <stop id="stop3752" style="stop-color:#000000;stop-opacity:0.58823532" offset="1"/>
    </linearGradient>
    <linearGradient id="linearGradient3737">
      <stop id="stop3739" style="stop-color:#ffffff" offset="0"/>
      <stop id="stop3741" style="stop-color:#ffffff;stop-opacity:0" offset="1"/>
    </linearGradient>
    <linearGradient id="linearGradient3700">
      <stop id="stop3702" style="stop-color:#57c412" offset="0"/>
      <stop id="stop3704" style="stop-color:#92d74e" offset="1"/>
    </linearGradient>
    <filter id="filter3174" style="color-interpolation-filters:sRGB">
      <feGaussianBlur stdDeviation="1.71" id="feGaussianBlur3176"/>
    </filter>
    <linearGradient x1="36.357143" y1="6" x2="36.357143" y2="81.384666" id="linearGradient3188" xlink:href="#linearGradient3737" gradientUnits="userSpaceOnUse"/>
    <filter x="-0.192" y="-0.192" width="1.3839999" height="1.3839999" id="filter3794" style="color-interpolation-filters:sRGB">
      <feGaussianBlur stdDeviation="5.28" id="feGaussianBlur3796"/>
    </filter>
    <linearGradient x1="48" y1="20.220806" x2="48" y2="138.66119" id="linearGradient3613" xlink:href="#linearGradient3737" gradientUnits="userSpaceOnUse"/>
    <radialGradient cx="48" cy="90.171875" r="42" fx="48" fy="90.171875" id="radialGradient3619" xlink:href="#linearGradient3737" gradientUnits="userSpaceOnUse" gradientTransform="matrix(0.20589266,-0.22253446,0.39766525,0.36792664,2.2589297,67.505019)"/>
    <clipPath id="clipPath3613">
      <rect width="84" height="84" rx="6" ry="6" x="6" y="6" id="rect3615" style="fill:#ffffff"/>
    </clipPath>
    <linearGradient x1="48" y1="90" x2="48" y2="69.445343" id="linearGradient3617" xlink:href="#linearGradient3700" gradientUnits="userSpaceOnUse"/>
    <linearGradient x1="45.447727" y1="92.539597" x2="45.447727" y2="7.0165396" id="ButtonShadow-0" gradientUnits="userSpaceOnUse" gradientTransform="matrix(1.0058652,0,0,0.994169,100,0)">
      <stop id="stop3750-8" style="stop-color:#000000" offset="0"/>
      <stop id="stop3752-5" style="stop-color:#000000;stop-opacity:0.58823532" offset="1"/>
    </linearGradient>
    <linearGradient x1="32.251034" y1="6.1317081" x2="32.251034" y2="90.238609" id="linearGradient3772" xlink:href="#ButtonShadow-0" gradientUnits="userSpaceOnUse" gradientTransform="matrix(1.0238095,0,0,1.0119048,-1.1428571,-98.071429)"/>
    <filter id="filter3805" style="color-interpolation-filters:sRGB">
      <feGaussianBlur id="feGaussianBlur3807" stdDeviation="1.225"/>
    </filter>
    <linearGradient inkscape:collect="always" xlink:href="#ButtonShadow" id="linearGradient908" gradientUnits="userSpaceOnUse" x1="48" y1="90" x2="48" y2="69.445343" gradientTransform="translate(0,2)"/>
    <filter inkscape:collect="always" style="color-interpolation-filters:sRGB" id="filter910" x="-0.048" width="1.096" y="-0.048" height="1.096">
      <feGaussianBlur inkscape:collect="always" stdDeviation="1.68" id="feGaussianBlur912"/>
    </filter>
  </defs>
  <g id="g904" transform="scale(2)" style="stroke-width:0.5">
    <g transform="translate(2,2)" id="layer1" style="stroke-width:0.5">
      <rect width="84" height="84" rx="6" ry="6" x="6" y="8" id="rect906" style="fill:url(#linearGradient908);stroke-width:0.5;fill-opacity:1;filter:url(#filter910);opacity:0.9"/>
      <rect style="fill:url(#linearGradient3617);stroke-width:0.5" id="rect2419" y="6" x="6" ry="6" rx="6" height="84" width="84"/>
      <path inkscape:connector-curvature="0" style="opacity:0.45;fill:url(#linearGradient3188);stroke-width:0.5" id="rect3728" d="M 12,6 C 8.676,6 6,8.676 6,12 v 2 68 2 c 0,0.334721 0.04135,0.6507 0.09375,0.96875 0.0487,0.295596 0.09704,0.596915 0.1875,0.875 0.00988,0.03038 0.020892,0.0636 0.03125,0.09375 0.098865,0.287771 0.2348802,0.547452 0.375,0.8125 0.1445918,0.273507 0.3156161,0.535615 0.5,0.78125 0.1843839,0.245635 0.3737765,0.473472 0.59375,0.6875 0.439947,0.428056 0.94291,0.814526 1.5,1.09375 0.278545,0.139612 0.5734731,0.246947 0.875,0.34375 -0.2562018,-0.100222 -0.4867109,-0.236272 -0.71875,-0.375 -0.00741,-0.0044 -0.023866,0.0045 -0.03125,0 -0.031933,-0.0193 -0.062293,-0.04251 -0.09375,-0.0625 -0.120395,-0.0767 -0.2310226,-0.163513 -0.34375,-0.25 -0.1061728,-0.0808 -0.2132809,-0.161112 -0.3125,-0.25 C 8.4783201,88.557317 8.3087904,88.373362 8.15625,88.1875 8.0486711,88.057245 7.9378561,87.922215 7.84375,87.78125 7.818661,87.74287 7.805304,87.69538 7.78125,87.65625 7.716487,87.553218 7.6510225,87.451733 7.59375,87.34375 7.4927417,87.149044 7.3880752,86.928049 7.3125,86.71875 7.30454,86.69694 7.288911,86.6782 7.28125,86.65625 7.2494249,86.5643 7.2454455,86.469419 7.21875,86.375 7.1884177,86.268382 7.1483606,86.171969 7.125,86.0625 7.0521214,85.720988 7,85.364295 7,85 V 83 15 13 C 7,10.218152 9.2181517,8 12,8 h 2 68 2 c 2.781848,0 5,2.218152 5,5 v 2 68 2 c 0,0.364295 -0.05212,0.720988 -0.125,1.0625 -0.04415,0.206893 -0.08838,0.397658 -0.15625,0.59375 -0.0077,0.02195 -0.0233,0.04069 -0.03125,0.0625 -0.06274,0.173739 -0.138383,0.367449 -0.21875,0.53125 -0.04158,0.0828 -0.07904,0.169954 -0.125,0.25 -0.0546,0.09721 -0.126774,0.18835 -0.1875,0.28125 -0.09411,0.140965 -0.204921,0.275995 -0.3125,0.40625 -0.143174,0.17445 -0.303141,0.346998 -0.46875,0.5 -0.01117,0.0102 -0.01998,0.02115 -0.03125,0.03125 -0.138386,0.125556 -0.285091,0.234436 -0.4375,0.34375 -0.102571,0.07315 -0.204318,0.153364 -0.3125,0.21875 -0.0074,0.0045 -0.02384,-0.0044 -0.03125,0 -0.232039,0.138728 -0.462548,0.274778 -0.71875,0.375 0.301527,-0.0968 0.596455,-0.204138 0.875,-0.34375 0.55709,-0.279224 1.060053,-0.665694 1.5,-1.09375 0.219973,-0.214028 0.409366,-0.441865 0.59375,-0.6875 0.184384,-0.245635 0.355408,-0.507743 0.5,-0.78125 0.14012,-0.265048 0.276135,-0.524729 0.375,-0.8125 0.01041,-0.03078 0.02133,-0.06274 0.03125,-0.09375 0.09046,-0.278085 0.1388,-0.579404 0.1875,-0.875 C 89.95865,84.6507 90,84.334721 90,84 V 82 14 12 C 90,8.676 87.324,6 84,6 Z"/>
      <path inkscape:connector-curvature="0" style="opacity:0.2;fill:url(#radialGradient3619);stroke-width:0.5" id="path3615" d="M 12,90 C 8.676,90 6,87.324 6,84 V 82 14 12 c 0,-0.334721 0.04135,-0.6507 0.09375,-0.96875 0.0487,-0.295596 0.09704,-0.596915 0.1875,-0.875 C 6.29113,10.12587 6.302142,10.09265 6.3125,10.0625 6.411365,9.774729 6.5473802,9.515048 6.6875,9.25 6.8320918,8.976493 7.0031161,8.714385 7.1875,8.46875 7.3718839,8.223115 7.5612765,7.995278 7.78125,7.78125 8.221197,7.353194 8.72416,6.966724 9.28125,6.6875 9.559795,6.547888 9.8547231,6.440553 10.15625,6.34375 9.9000482,6.443972 9.6695391,6.580022 9.4375,6.71875 c -0.00741,0.0044 -0.023866,-0.0045 -0.03125,0 -0.031933,0.0193 -0.062293,0.04251 -0.09375,0.0625 -0.120395,0.0767 -0.2310226,0.163513 -0.34375,0.25 -0.1061728,0.0808 -0.2132809,0.161112 -0.3125,0.25 C 8.4783201,7.442683 8.3087904,7.626638 8.15625,7.8125 8.0486711,7.942755 7.9378561,8.077785 7.84375,8.21875 7.818661,8.25713 7.805304,8.30462 7.78125,8.34375 7.716487,8.446782 7.6510225,8.548267 7.59375,8.65625 7.4927417,8.850956 7.3880752,9.071951 7.3125,9.28125 7.30454,9.30306 7.288911,9.3218 7.28125,9.34375 7.2494249,9.4357 7.2454455,9.530581 7.21875,9.625 7.1884177,9.731618 7.1483606,9.828031 7.125,9.9375 7.0521214,10.279012 7,10.635705 7,11 v 2 68 2 c 0,2.781848 2.2181517,5 5,5 h 2 68 2 c 2.781848,0 5,-2.218152 5,-5 V 81 13 11 C 89,10.635705 88.94788,10.279012 88.875,9.9375 88.83085,9.730607 88.78662,9.539842 88.71875,9.34375 88.71105,9.3218 88.69545,9.30306 88.6875,9.28125 88.62476,9.107511 88.549117,8.913801 88.46875,8.75 88.42717,8.6672 88.38971,8.580046 88.34375,8.5 88.28915,8.40279 88.216976,8.31165 88.15625,8.21875 88.06214,8.077785 87.951329,7.942755 87.84375,7.8125 87.700576,7.63805 87.540609,7.465502 87.375,7.3125 87.36383,7.3023 87.35502,7.29135 87.34375,7.28125 87.205364,7.155694 87.058659,7.046814 86.90625,6.9375 86.803679,6.86435 86.701932,6.784136 86.59375,6.71875 c -0.0074,-0.0045 -0.02384,0.0044 -0.03125,0 -0.232039,-0.138728 -0.462548,-0.274778 -0.71875,-0.375 0.301527,0.0968 0.596455,0.204138 0.875,0.34375 0.55709,0.279224 1.060053,0.665694 1.5,1.09375 0.219973,0.214028 0.409366,0.441865 0.59375,0.6875 0.184384,0.245635 0.355408,0.507743 0.5,0.78125 0.14012,0.265048 0.276135,0.524729 0.375,0.8125 0.01041,0.03078 0.02133,0.06274 0.03125,0.09375 0.09046,0.278085 0.1388,0.579404 0.1875,0.875 C 89.95865,11.3493 90,11.665279 90,12 v 2 68 2 c 0,3.324 -2.676,6 -6,6 z"/>
    </g>
    <g transform="translate(2,2)" id="layer5" style="stroke-width:0.5">
      <rect style="opacity:0.1;fill:url(#linearGradient3613);stroke:#ffffff;stroke-width:0.25;stroke-linecap:round;filter:url(#filter3794)" id="rect3171" clip-path="url(#clipPath3613)" y="15" x="15" ry="12" rx="33" height="66" width="66"/>
    </g>
    <g style="fill:#ccffaa;stroke-width:0.5" id="layer1-9" transform="matrix(1.5869786,0,0,1.5869786,13.323738,10.031806)">
      <path inkscape:connector-curvature="0" style="fill:#ccffaa;fill-rule:evenodd;stroke:#fffdff;stroke-width:0.5" id="path5070" d="M 3.033391,11.648109 24.671136,24.418378 3.016816,37.198431 Z"/>
      <path inkscape:connector-curvature="0" style="opacity:0.18055558;fill:#ccffaa;stroke:#eeeeec;stroke-width:0.5" id="path5665" d="M 4.04192,13.453223 22.5645,24.420891 4.027734,35.311401 Z"/>
      <path inkscape:connector-curvature="0" style="fill:#ccffaa;stroke:#ffffff;stroke-width:0.5;stroke-linecap:round;stroke-linejoin:round" id="path5067" d="m 44.983184,24.545684 c 0,-11.316001 -9.170001,-20.5 -20.46875,-20.5 -6.524212,0 -12.313471,3.0771446 -16.0625,7.84375 l 2.5625,1.625 c 3.198502,-3.9147617 8.085497,-6.40625 13.53125,-6.40625 9.625499,-10e-8 17.4375,7.812 17.4375,17.4375 0,9.6255 -7.812,17.4375 -17.4375,17.4375 -5.430049,0 -10.301145,-2.47967 -13.5,-6.375 l -2.5625,1.625 c 3.749919,4.746873 9.522794,7.8125 16.03125,7.8125 11.29875,0 20.46875,-9.183999 20.46875,-20.5 z"/>
      <path inkscape:connector-curvature="0" style="fill:#ccffaa;stroke:#fffdff;stroke-width:0.5;stroke-linecap:round;stroke-linejoin:round" id="path5648" d="m 37.045684,24.576934 c 0,-6.91725 -5.614001,-12.53125 -12.53125,-12.53125 -3.682751,0 -6.987847,1.592947 -9.28125,4.125 l 2.65625,1.65625 c 1.708502,-1.687387 4.044211,-2.71875 6.625,-2.71875 5.226749,0 9.46875,4.27 9.46875,9.53125 0,5.261251 -4.242001,9.53125 -9.46875,9.53125 -2.628895,10e-7 -5.002549,-1.069255 -6.71875,-2.8125 l -2.5625,1.625 c 2.293403,2.532054 5.598499,4.125001 9.28125,4.125 6.91725,0 12.53125,-5.614 12.53125,-12.53125 z"/>
    </g>
  </g>
</svg>