<?xml version="1.0" encoding="UTF-8" standalone="no"?>
<svg
   xmlns:dc="http://purl.org/dc/elements/1.1/"
   xmlns:cc="http://creativecommons.org/ns#"
   xmlns:rdf="http://www.w3.org/1999/02/22-rdf-syntax-ns#"
   xmlns:svg="http://www.w3.org/2000/svg"
   xmlns="http://www.w3.org/2000/svg"
   xmlns:sodipodi="http://sodipodi.sourceforge.net/DTD/sodipodi-0.dtd"
   xmlns:inkscape="http://www.inkscape.org/namespaces/inkscape"
   inkscape:version="1.0 (1.0+r73+1)"
   sodipodi:docname="telecom-tim.svg"
   id="svg28"
   version="1.1"
   viewBox="0 0 512 135.33839"
   height="135.33839"
   width="512">
  <metadata
     id="metadata32">
    <rdf:RDF>
      <cc:Work
         rdf:about="">
        <dc:format>image/svg+xml</dc:format>
        <dc:type
           rdf:resource="http://purl.org/dc/dcmitype/StillImage" />
        <dc:title>TIMP</dc:title>
      </cc:Work>
    </rdf:RDF>
  </metadata>
  <sodipodi:namedview
     inkscape:current-layer="svg28"
     inkscape:window-maximized="1"
     inkscape:window-y="24"
     inkscape:window-x="0"
     inkscape:cy="67.669197"
     inkscape:cx="256"
     inkscape:zoom="3.5917969"
     fit-margin-bottom="0"
     fit-margin-right="0"
     fit-margin-left="0"
     fit-margin-top="0"
     inkscape:showpageshadow="false"
     showgrid="false"
     id="namedview30"
     inkscape:window-height="1033"
     inkscape:window-width="1920"
     inkscape:pageshadow="2"
     inkscape:pageopacity="0"
     guidetolerance="10"
     gridtolerance="10"
     objecttolerance="10"
     borderopacity="1"
     bordercolor="#666666"
     pagecolor="#ffffff" />
  <!-- Generator: Sketch 50.1 (55044) - http://www.bohemiancoding.com/sketch -->
  <title
     id="title2">TIMP</title>
  <desc
     id="desc4">Created with Sketch.</desc>
  <defs
     id="defs6" />
  <g
     transform="matrix(1.5526232,0,0,1.5526232,-209.78669,-129.51395)"
     fill-rule="evenodd"
     fill="none"
     stroke-width="0.644071"
     stroke="none"
     id="TIMP">
    <g
       style="stroke-width:0.414828"
       transform="translate(1)"
       opacity="0.4"
       id="Grid-Logo" />
    <g
       style="stroke-width:0.414828"
       fill-rule="nonzero"
       transform="translate(135,83)"
       id="TIMP3">
      <g
         style="stroke-width:0.267179"
         fill="#e20c20"
         id="Group">
        <rect
           style="stroke-width:0.644071"
           height="19.681082"
           width="106.82362"
           y="0.53513515"
           x="0.11758242"
           id="Rectangle-path" />
        <rect
           style="stroke-width:0.644071"
           height="19.681082"
           width="42.976372"
           y="34.308109"
           x="0.11758242"
           id="rect10" />
        <rect
           style="stroke-width:0.644071"
           height="19.681082"
           width="42.976372"
           y="67.843246"
           x="0.11758242"
           id="rect12" />
        <rect
           style="stroke-width:0.644071"
           height="19.681082"
           width="42.976372"
           y="34.308109"
           x="63.906044"
           id="rect14" />
        <rect
           style="stroke-width:0.644071"
           height="19.681082"
           width="42.976372"
           y="67.843246"
           x="63.906044"
           id="rect16" />
      </g>
      <g
         style="stroke-width:0.267179"
         fill="#1c3e85"
         transform="translate(126)"
         id="g24">
        <polyline
           style="stroke-width:0.644071"
           points="0.471676301 0.535135135 69.6901734 0.535135135 69.6901734 20.1567568 43.3352601 20.1567568 43.3352601 87.4648649 26.5907514 87.4648649 26.5907514 20.1567568 0.471676301 20.1567568"
           id="Shape" />
        <rect
           style="stroke-width:0.644071"
           height="86.989189"
           width="18.926012"
           y="0.53513515"
           x="78.239304"
           id="rect20" />
        <polygon
           style="stroke-width:0.644071"
           points="188.2578,26.637838 168.68324,74.205405 152.88208,74.205405 133.30751,25.924324 133.30751,87.405405 117.62428,87.405405 117.62428,0.41621622 138.79075,0.41621622 160.78266,53.92973 182.77457,0.5945946 203.88208,0.5945946 203.88208,87.583784 188.2578,87.405405 "
           id="polygon22" />
      </g>
    </g>
  </g>
</svg>
