<?xml version="1.0" encoding="UTF-8" standalone="no"?>
<svg
   xmlns:dc="http://purl.org/dc/elements/1.1/"
   xmlns:cc="http://creativecommons.org/ns#"
   xmlns:rdf="http://www.w3.org/1999/02/22-rdf-syntax-ns#"
   xmlns:svg="http://www.w3.org/2000/svg"
   xmlns="http://www.w3.org/2000/svg"
   xmlns:sodipodi="http://sodipodi.sourceforge.net/DTD/sodipodi-0.dtd"
   xmlns:inkscape="http://www.inkscape.org/namespaces/inkscape"
   inkscape:version="1.0 (1.0+r73+1)"
   sodipodi:docname="telecom-embratel.svg"
   id="svg12"
   version="1.1"
   viewBox="-97.32645 -41.188 359.89158 40.160105"
   width="512"
   height="130.00584">
  <metadata
     id="metadata18">
    <rdf:RDF>
      <cc:Work
         rdf:about="">
        <dc:format>image/svg+xml</dc:format>
        <dc:type
           rdf:resource="http://purl.org/dc/dcmitype/StillImage" />
        <dc:title></dc:title>
      </cc:Work>
    </rdf:RDF>
  </metadata>
  <defs
     id="defs16" />
  <sodipodi:namedview
     inkscape:current-layer="svg12"
     inkscape:window-maximized="1"
     inkscape:window-y="24"
     inkscape:window-x="0"
     inkscape:cy="65.002922"
     inkscape:cx="256"
     inkscape:zoom="3.5917969"
     fit-margin-bottom="0"
     fit-margin-right="0"
     fit-margin-left="0"
     fit-margin-top="0"
     inkscape:showpageshadow="false"
     showgrid="false"
     id="namedview14"
     inkscape:window-height="1033"
     inkscape:window-width="1920"
     inkscape:pageshadow="2"
     inkscape:pageopacity="0"
     guidetolerance="10"
     gridtolerance="10"
     objecttolerance="10"
     borderopacity="1"
     bordercolor="#666666"
     pagecolor="#ffffff" />
  <g
     style="stroke-width:1.80289"
     transform="matrix(0.55466592,0,0,0.55466592,-97.326353,-66.799406)"
     id="g36">
    <g
       style="stroke-width:1.80289"
       id="g22">
      <path
         style="stroke-width:3.2504"
         id="path2"
         fill="#004e8b"
         d="m 229.847,82.595 c -4.46,-5.554 -12.129,-8.492 -22.177,-8.492 -11.984,0 -22.088,2.818 -30.084,8.338 -4.94,-5.591 -13.248,-8.338 -25.431,-8.338 -14.505,0 -25.393,1.924 -36.403,6.427 l -0.421,0.17 -18.241,82.462 h 26.588 l 15.555,-70.326 c 3.17,-1.034 5.69,-1.409 9.64,-1.409 4.157,0 7.23,1.089 8.883,3.155 1.384,1.726 1.775,4.175 1.129,7.08 l -13.6,61.5 h 26.59 L 186.91,95.215 c 3.172,-2.537 6.756,-3.788 10.955,-3.788 3.691,0 6.335,0.961 7.855,2.853 1.448,1.805 1.837,4.47 1.125,7.7 l -13.533,61.182 h 26.593 l 13.452,-60.804 c 1.748,-7.89 0.535,-14.723 -3.51,-19.763 z m 147.514,-6.14 c -17.833,-2.44 -34.608,0.528 -48.451,5.776 l -18.238,80.931 h 26.58 l 15.376,-69.464 c 5.29,-1.165 9.51,-1.402 15.333,0.58 l 0.774,0.36 z m -67.463,7.283 c -4.815,-5.992 -12.123,-9.16 -21.142,-9.16 -6.054,0 -10.654,0.825 -15.415,2.675 0.65,-2.91 9.601,-43.12 9.601,-43.12 l -27.369,3.567 -19.403,87.345 -7.254,32.838 0.451,0.33 c 5.654,4.218 16.35,6.54 30.12,6.54 28.343,0 48.435,-17.35 55.123,-47.6 3.082,-13.922 1.408,-25.788 -4.712,-33.415 z m -21.83,34.63 c -4.355,19.708 -12.377,29.695 -23.842,29.695 -2.469,0 -4.709,-0.356 -6.345,-0.958 0.445,-2.013 11.842,-53.433 12.165,-54.964 2.579,-1.168 5.1,-1.669 8.581,-1.669 3.964,0 6.791,1.121 8.649,3.431 3.276,4.077 3.534,12.08 0.792,24.465 z m 199.284,-42.048 5.501,-24.918 -1.16,0.088 c -10.445,0.78 -18.832,2.68 -26.406,5.987 l -0.406,0.175 -4.773,21.253 c -2.92,0.44 -5.246,0.8 -7.84,1.3 l -0.49,0.12 -4.823,16.302 c 0,0 6.066,-0.565 9.49,-0.857 -1.544,6.98 -9.47,42.802 -9.483,42.88 0,0 -0.08,0.348 -0.08,0.402 v 0.001 c -0.459,2.22 -0.682,4.334 -0.682,6.333 0,4.819 1.32,8.941 3.923,12.139 3.733,4.58 9.78,6.903 17.982,6.903 5.353,0 10.28,-1.265 13.098,-2.45 l 0.418,-0.175 3.452,-15.585 0.22,-1.096 -7.113,0.256 c -2.068,0 -3.412,-0.422 -4.109,-1.29 -0.489,-0.612 -0.734,-1.535 -0.734,-2.812 0,-1.124 0.188,-2.528 0.571,-4.244 l 9.523,-43.135 c 0.525,-0.019 3.977,-0.204 7.227,-0.31 3.138,-0.101 6.094,-0.117 6.094,-0.117 l 3.699,-16.723 0.246,-1.106 c 0,0 -11.442,0.594 -13.345,0.68 z M 591.117,59.99 568.285,163.162 h 26.586 c 0,0 24.625,-111.292 25.099,-113.462 -11.494,5.026 -19.958,7.502 -28.853,10.29 z m -153.98,22.75 c -4.602,-5.73 -12.839,-8.637 -24.485,-8.637 -7.987,0 -16.109,1.11 -24.14,3.317 l -0.469,0.126 -5.362,18.475 1.615,-0.599 c 5.129,-1.892 12.822,-4.151 20.336,-4.151 5.609,0 9.154,1.019 10.84,3.124 0.855,1.062 1.278,2.428 1.278,4.142 0,0.936 -0.124,1.978 -0.382,3.125 0,0 -0.558,2.489 -0.748,3.365 -22.905,2.135 -49.588,7.741 -54.874,31.631 -0.545,2.454 -0.818,4.763 -0.818,6.915 0,4.672 1.277,8.622 3.82,11.785 5.008,6.234 14.895,9.394 29.398,9.394 14.062,0 26.614,-2.291 35.341,-6.45 l 0.381,-0.182 11.423,-51.623 c 2.281,-10.322 1.217,-18.314 -3.154,-23.757 z m -51.269,53.335 c 2.803,-12.673 12.337,-16.314 26.82,-17.802 -0.476,2.142 -6.345,28.67 -6.535,29.532 -2.36,0.978 -5.413,1.53 -8.71,1.53 -5.056,0 -8.56,-1.172 -10.408,-3.475 -1.118,-1.395 -1.677,-3.255 -1.677,-5.564 0,-1.27 0.17,-2.681 0.51,-4.221 z m 182.29,-52.313 c -4.96,-6.407 -13.06,-9.659 -24.077,-9.659 -24.646,0 -43.064,16.785 -49.278,44.9 -1.083,4.88 -1.62,9.467 -1.62,13.71 0,8.56 2.187,15.717 6.502,21.093 5.748,7.165 15.233,10.946 27.426,10.946 9.936,0 18.63,-1.31 26.579,-3.992 l 0.462,-0.158 4.365,-19.921 -1.862,0.779 c -2.93,1.365 -11.034,4.54 -22.912,4.54 -5.84,0 -9.92,-1.347 -12.477,-4.125 -2.221,-2.41 -3.31,-5.927 -3.31,-10.7 0,-0.733 0.046,-1.525 0.096,-2.322 8.456,-0.778 18.175,-1.9 27.525,-3.552 9.786,-1.726 18.684,-4.046 26.268,-7.144 l 0.15,-0.561 c 1.763,-6.803 1.7,-9.508 1.7,-14.91 0,-7.82 -1.85,-14.153 -5.537,-18.924 z m -28.266,6.71 c 3.413,0 5.845,0.964 7.441,2.95 1.484,1.851 2.23,4.634 2.23,8.309 0,2.571 -0.367,5.527 -1.095,8.971 -7.342,1.766 -19.76,3.539 -29.05,4.269 3.034,-15.555 10.433,-24.499 20.474,-24.499 z" />
      <path
         style="stroke-width:3.2504"
         id="path6"
         fill="#004e8b"
         d="m 66.426,75.745 c 1.307,-6.355 2.544,-12.36 2.665,-12.96 h 36.101 c 1.951,0 2.866,-0.614 3.171,-0.872 h 0.147 l 0.048,-0.228 -3.417,-0.98 3.784,-18.527 H 44.6 L 35.196,87.741 C 43.76,83.897 54.132,79.877 66.425,75.745 Z m -7.374,35.678 H 88.297 L 92.463,91.338 H 63.218 l 1.792,-8.73 c -6.499,2.505 -11.324,4.39 -16.058,6.405 -4.737,2.02 -11.172,4.905 -15.522,7.213 l -13.765,66.78 h 69.541 l 4.839,-22.994 H 53.15 l 5.901,-28.589 z" />
    </g>
    <g
       style="stroke-width:1.80289"
       id="g27">
      <path
         style="stroke-width:3.2504"
         id="path4"
         fill="#ffd629"
         d="m 468.53,3.596 c -121.59,9.347 -182.835,20.516 -268.72,37.489 0.797,-0.158 1.593,-0.258 2.398,-0.39 C 280.48,28.145 373.95,17.842 460.3,13.31 637.147,4.2 668.177,27.946 572.967,60.516 a 0.074,0.074 0 0 1 0.025,0.022 c 6.19,-1.845 24.35,-7.25 29.971,-9.106 87.76,-30.717 53.152,-62.245 -134.433,-47.836 z" />
      <path
         style="stroke-width:3.2504"
         id="path8"
         fill="#75b851"
         d="m 68.767,70.55 c -79.114,25.666 -84.365,47.507 -44.122,48.793 l -1.599,-0.276 c 0.007,0 0.014,0.005 0.022,0.005 -11.665,-1.101 -16.277,-3.73 -16.803,-8.304 -1.4,-12.222 30.777,-29.71 112.36,-52.312 18.826,-5.216 39.71,-9.408 61.666,-13.8 -0.05,0.009 -0.103,0.017 -0.151,0.03 0.342,-0.07 0.692,-0.148 1.033,-0.219 0.344,-0.061 0.678,-0.134 1.02,-0.202 -35.227,5.58 -76.558,14.365 -113.426,26.286 z M 315.746,23.372 C 281.347,27.856 248.327,32.91 217.466,38.305 292.453,26.845 379.492,17.552 460.3,13.31 637.07,4.202 668.146,27.92 573.096,60.473 616.148,47.408 641.293,34.663 639.97,24.526 636.893,0.936 491.737,0.42 315.746,23.372 Z" />
      <path
         style="stroke-width:3.2504"
         id="path10"
         fill="#ffd629"
         d="M 74.186,74.347 C 108.838,61.98 147.273,51.45 180.291,44.656 158.335,49.048 137.451,53.24 118.625,58.456 37.042,81.057 2.816,99.402 5.273,110.776 c 0.973,4.502 6.13,7.195 17.795,8.296 -10.063,-1.745 -13.692,-2.905 -13.832,-7.514 -0.231,-7.916 20.545,-21.306 64.95,-37.21 z" />
    </g>
  </g>
</svg>
