<?xml version="1.0" encoding="UTF-8" standalone="no"?>
<svg
   xmlns:dc="http://purl.org/dc/elements/1.1/"
   xmlns:cc="http://creativecommons.org/ns#"
   xmlns:rdf="http://www.w3.org/1999/02/22-rdf-syntax-ns#"
   xmlns:svg="http://www.w3.org/2000/svg"
   xmlns="http://www.w3.org/2000/svg"
   xmlns:sodipodi="http://sodipodi.sourceforge.net/DTD/sodipodi-0.dtd"
   xmlns:inkscape="http://www.inkscape.org/namespaces/inkscape"
   inkscape:version="1.0 (1.0+r73+1)"
   sodipodi:docname="itil.svg"
   viewBox="0 0 512 511.91309"
   height="511.91309"
   width="512"
   version="1.1"
   id="svg">
  <metadata
     id="metadata13">
    <rdf:RDF>
      <cc:Work
         rdf:about="">
        <dc:format>image/svg+xml</dc:format>
        <dc:type
           rdf:resource="http://purl.org/dc/dcmitype/StillImage" />
        <dc:title></dc:title>
      </cc:Work>
    </rdf:RDF>
  </metadata>
  <defs
     id="defs11" />
  <sodipodi:namedview
     inkscape:current-layer="svg"
     inkscape:window-maximized="1"
     inkscape:window-y="24"
     inkscape:window-x="0"
     inkscape:cy="255.95654"
     inkscape:cx="256"
     inkscape:zoom="1.6389501"
     fit-margin-bottom="0"
     fit-margin-right="0"
     fit-margin-left="0"
     fit-margin-top="0"
     inkscape:showpageshadow="false"
     showgrid="false"
     id="namedview9"
     inkscape:window-height="1033"
     inkscape:window-width="1920"
     inkscape:pageshadow="2"
     inkscape:pageopacity="0"
     guidetolerance="10"
     gridtolerance="10"
     objecttolerance="10"
     borderopacity="1"
     bordercolor="#666666"
     pagecolor="#ffffff" />
  <g
     transform="matrix(1.3427819,0,0,1.3427819,-12.309229,-11.821911)"
     id="svgg">
    <path
       fill-rule="evenodd"
       fill="#2669a0"
       stroke="none"
       d="M 187.167,8.891 C 67.87,16.793 -14.655,131.49 15.366,247.665 c 2.994,11.588 11.008,33.158 11.939,32.137 0.152,-0.166 6.538,-10.802 14.193,-23.635 7.655,-12.834 14.011,-23.435 14.126,-23.558 0.115,-0.123 11.984,0.639 26.376,1.694 14.392,1.055 26.223,1.874 26.292,1.821 0.07,-0.054 -0.562,-2.166 -1.403,-4.694 -6.546,-19.676 -6.891,-39.742 -1.03,-59.828 1.877,-6.431 6.858,-18.058 7.655,-17.866 0.222,0.054 6.927,4.35 14.9,9.548 l 14.495,9.451 -1.091,2.588 c -13.233,31.377 0.394,67.607 30.902,82.157 9.65,4.602 15.476,5.791 28.78,5.871 42.062,0.253 72.246,-42.318 58.849,-82.999 -1.327,-4.029 -1.819,-5.12 -4.453,-9.866 -1.427,-2.571 -2.24,-3.889 -5.538,-8.976 -0.472,-0.727 -2.431,-2.956 -4.353,-4.952 -26.919,-27.957 -70.346,-25.992 -95.679,4.329 l -1.159,1.387 -14.5,-9.491 c -7.975,-5.22 -14.544,-9.614 -14.598,-9.764 -0.131,-0.363 2.708,-4.079 6.191,-8.104 17.857,-20.641 46.08,-33.582 73.235,-33.582 h 2.065 L 215.335,79.599 C 222.912,67.645 229.104,57.707 229.096,57.515 229.088,57.324 223.303,46.292 216.241,33 L 203.402,8.833 196.117,8.807 c -4.006,-0.014 -8.034,0.023 -8.95,0.084 m -21.408,48.693 c 0.935,0.846 1.228,1.52 2.121,4.879 0.444,1.67 0.882,3.282 0.974,3.582 0.114,0.372 -0.091,0.609 -0.646,0.748 -0.447,0.112 -1.027,0.286 -1.289,0.387 -0.363,0.139 -0.697,-0.668 -1.414,-3.415 -1.288,-4.94 -2.05,-5.666 -4.121,-3.924 l -1,0.842 0.994,3.706 c 1.05,3.921 1.029,4.087 -0.546,4.418 l -1.001,0.21 -1.317,-5.092 c -0.725,-2.8 -1.284,-5.167 -1.243,-5.258 0.212,-0.472 1.737,-0.56 2.1,-0.122 0.34,0.41 0.526,0.359 1.264,-0.346 1.676,-1.603 3.756,-1.853 5.124,-0.615 M 140,61 c 0.803,0.803 0.816,0.972 0.148,1.926 -0.981,1.4 -2.815,0.765 -2.815,-0.976 0,-1.533 1.537,-2.08 2.667,-0.95 m 14.697,1.578 c 3.589,3.847 1.539,9.428 -3.49,9.504 -2.541,0.039 -4.365,-1.466 -5.212,-4.3 -1.557,-5.205 5.028,-9.143 8.702,-5.204 M 150,63.236 c -2.118,0.779 -2.248,3.884 -0.253,6.014 1.43,1.527 4.26,0.4 4.246,-1.691 -0.02,-2.857 -2.037,-5.042 -3.993,-4.323 m -16.299,2.847 c 0.393,0.779 0.747,1.455 0.786,1.502 0.039,0.047 1.621,-0.628 3.515,-1.5 1.893,-0.872 3.495,-1.435 3.559,-1.252 0.064,0.184 1.091,2.359 2.282,4.834 l 2.165,4.5 -0.921,0.401 c -1.513,0.66 -1.593,0.581 -3.435,-3.401 -0.975,-2.109 -1.858,-3.826 -1.962,-3.817 -0.105,0.008 -1.112,0.496 -2.238,1.083 l -2.048,1.067 1.277,2.753 c 1.364,2.938 1.984,3.487 2.951,2.612 0.564,-0.511 0.659,-0.507 1.357,0.059 l 0.752,0.609 -1.216,1.067 c -2.47,2.169 -4.032,1.444 -6.011,-2.791 -1.366,-2.924 -1.54,-3.149 -2.284,-2.962 -1.104,0.277 -1.493,-0.732 -0.619,-1.607 0.582,-0.581 0.599,-0.765 0.198,-2.099 -0.415,-1.377 -0.398,-1.491 0.283,-1.968 0.924,-0.647 0.783,-0.727 1.609,0.91 m -4.368,6.555 c 0.747,0.522 4.667,6.478 4.667,7.09 0,0.522 -1.33,0.964 -1.93,0.643 -0.485,-0.26 -0.677,-0.138 -1.026,0.651 -1.047,2.364 -4.139,3.209 -5.587,1.526 -1.364,-1.586 -0.856,-3.22 1.703,-5.472 1.579,-1.39 1.706,-2.101 0.492,-2.751 -0.867,-0.463 -1.657,-0.094 -2.985,1.397 -1.629,1.827 -2.961,1.187 -1.852,-0.889 1.468,-2.746 4.344,-3.715 6.518,-2.195 m -8.714,4.223 c 0.352,0.774 0.29,0.956 -0.613,1.801 -1.408,1.315 -1.277,2.133 0.827,5.156 2.143,3.078 2.111,2.939 0.861,3.83 l -0.974,0.692 -2.798,-4.086 c -1.539,-2.248 -2.906,-4.268 -3.037,-4.489 -0.484,-0.813 1.36,-1.615 2.124,-0.924 0.638,0.578 0.658,0.571 0.658,-0.244 0,-2.032 2.222,-3.338 2.952,-1.736 m 7.609,1.463 c -1.313,1.153 -1.54,2.002 -0.718,2.684 1.339,1.112 3.66,-1.645 2.545,-3.023 l -0.599,-0.739 -1.228,1.078 M 114,83.417 c 2.376,1.622 2.331,1.91 -0.658,4.223 -2.929,2.265 -3.02,2.414 -1.934,3.174 1.466,1.028 3.363,0.24 4.441,-1.843 0.653,-1.264 2.151,-1.394 2.151,-0.187 0,3.861 -5.846,6.128 -8.896,3.45 -4.806,-4.22 -0.288,-12.357 4.896,-8.817 m -4.182,2.068 c -0.814,0.814 -1.004,1.642 -0.612,2.663 0.193,0.504 1.183,-0.098 3.597,-2.191 0.473,-0.41 -0.453,-1.29 -1.359,-1.29 -0.444,0 -1.176,0.368 -1.626,0.818 m -5.264,5.541 c 4.422,2.141 5.315,7.611 1.553,9.511 l -1.393,0.704 1.474,1.447 1.474,1.447 -0.894,0.934 -0.895,0.934 -0.968,-0.918 c -0.533,-0.505 -2.779,-2.839 -4.992,-5.187 l -4.024,-4.269 0.726,-0.725 c 0.617,-0.617 0.825,-0.664 1.389,-0.312 0.588,0.367 0.663,0.329 0.664,-0.339 0.005,-2.824 3.153,-4.55 5.886,-3.227 m -3.863,2.852 c -1.014,1.289 -0.865,1.965 0.873,3.978 1.715,1.986 2.244,2.153 3.558,1.12 1.428,-1.124 1.225,-2.717 -0.578,-4.52 -1.724,-1.724 -2.822,-1.889 -3.853,-0.578 m -6.464,4.742 c 5.079,2.621 6.161,8.329 2.337,12.326 -3.277,3.425 -8.796,3.098 -11.687,-0.692 -4.847,-6.355 2.314,-15.265 9.35,-11.634 m -5.434,2.192 c -2.684,1.168 -3.728,4.616 -2.112,6.974 2.794,4.078 8.106,3.668 9.474,-0.732 1.1,-3.542 -3.874,-7.76 -7.362,-6.242 M 200.667,113.5 c 0,3.278 0.042,3.5 0.666,3.5 0.625,0 0.667,-0.222 0.667,-3.5 0,-3.278 -0.042,-3.5 -0.667,-3.5 -0.624,0 -0.666,0.222 -0.666,3.5 m 5.804,-2.002 c -0.808,1.232 -0.379,2.366 1.201,3.171 1.46,0.745 1.593,1.029 0.793,1.693 -0.448,0.372 -0.685,0.357 -1.467,-0.092 -1.195,-0.686 -1.955,-0.143 -1.108,0.792 0.865,0.957 3.281,0.829 3.961,-0.209 0.814,-1.242 0.487,-2.216 -1.101,-3.281 -1.891,-1.267 -1.348,-2.695 0.573,-1.505 0.94,0.583 1.654,-0.325 0.774,-0.984 -1.006,-0.751 -3.012,-0.522 -3.626,0.415 m -25.138,0.8 c 0,0.806 0.834,1.137 1.338,0.53 0.49,-0.59 0.15,-1.161 -0.691,-1.161 -0.412,0 -0.647,0.228 -0.647,0.631 m 14.734,0.102 c -0.695,0.694 -0.439,0.965 0.815,0.864 1.667,-0.134 1.764,0.537 0.147,1.021 -1.68,0.504 -2.123,1.563 -1.025,2.452 0.498,0.403 0.996,0.533 1.459,0.38 0.387,-0.128 1.041,-0.208 1.454,-0.178 0.842,0.06 1.125,-2.947 0.405,-4.294 -0.399,-0.745 -2.59,-0.91 -3.255,-0.245 m -2.79,1.887 c 0.09,1.585 0.006,1.994 -0.446,2.168 -0.873,0.335 -1.101,0.002 -1.346,-1.96 -0.189,-1.515 -0.34,-1.828 -0.881,-1.828 -0.598,0 -0.633,0.157 -0.42,1.916 0.38,3.13 0.581,3.308 3.233,2.87 l 1.25,-0.207 v -1.929 c 0,-2.3 -0.218,-2.983 -0.953,-2.984 -0.458,-0.001 -0.529,0.318 -0.437,1.954 m -7.104,-1.166 c -0.341,0.249 -0.915,0.376 -1.275,0.282 -0.607,-0.158 -0.639,-0.05 -0.431,1.463 0.428,3.113 0.554,3.467 1.23,3.467 0.618,0 0.675,-1.424 0.128,-3.225 -0.162,-0.535 0.726,-1.224 1.296,-1.005 0.274,0.105 0.557,0.936 0.695,2.037 0.237,1.9 0.352,2.06 1.126,1.569 0.354,-0.224 0.371,-0.672 0.082,-2.245 -0.468,-2.552 -1.455,-3.364 -2.851,-2.343 m -7.84,0.712 c 0,0.459 -0.15,0.834 -0.333,0.834 -0.183,0 -0.333,0.225 -0.333,0.5 0,0.275 0.218,0.5 0.485,0.5 0.298,0 0.571,0.481 0.71,1.25 0.368,2.039 0.717,2.468 1.91,2.352 1.168,-0.113 1.533,-1.102 0.407,-1.103 -0.857,-10e-4 -1.531,-2.405 -0.804,-2.865 1.132,-0.717 1.584,-0.338 1.977,1.659 0.329,1.671 0.478,1.935 1.017,1.794 0.727,-0.19 0.717,-0.119 0.287,-2.087 -0.721,-3.296 -0.58,-3.068 -1.752,-2.833 -0.589,0.119 -1.321,0.286 -1.627,0.371 -0.353,0.099 -0.636,-0.093 -0.773,-0.524 -0.309,-0.975 -1.171,-0.862 -1.171,0.152 m 33.334,-0.166 c -2.117,2.116 0.73,5.993 3.232,4.402 0.665,-0.422 -0.053,-1.171 -0.873,-0.91 -0.797,0.252 -1.693,-0.298 -1.693,-1.039 0,-0.309 0.253,-0.411 0.75,-0.303 2.087,0.452 2.413,0.382 2.521,-0.547 0.222,-1.924 -2.505,-3.035 -3.937,-1.603 m 2.583,0.916 c 0.087,0.262 -0.182,0.417 -0.722,0.417 -0.842,0 -1.096,-0.321 -0.628,-0.789 0.343,-0.343 1.19,-0.11 1.35,0.372 m 2.592,0.167 c -1.003,4.418 -0.996,4.25 -0.179,4.25 0.515,0 0.71,-0.296 0.875,-1.327 0.227,-1.422 0.575,-1.863 1.625,-2.058 1.202,-0.223 1.077,-1.393 -0.13,-1.215 -0.568,0.083 -1.033,0.027 -1.033,-0.124 0,-0.627 -1.001,-0.217 -1.158,0.474 m 9.513,-0.276 c -0.518,0.624 -0.189,1.193 0.688,1.193 0.498,0 0.643,-0.186 0.564,-0.724 -0.134,-0.905 -0.711,-1.121 -1.252,-0.469 m -5.862,2.743 c 0.217,2.324 0.518,3.094 1.217,3.111 0.258,0.006 2.903,-3.466 3.169,-4.16 0.438,-1.142 -1.148,-0.463 -2.084,0.892 l -0.962,1.393 -0.166,-1.807 c -0.132,-1.426 -0.299,-1.832 -0.793,-1.926 -0.585,-0.111 -0.609,0.051 -0.381,2.497 m -22.241,-1.8 c -0.165,0.5 -1.585,0.77 -1.585,0.301 0,-0.351 0.55,-0.649 1.277,-0.692 0.245,-0.014 0.383,0.162 0.308,0.391 m -23.707,0.418 c -0.525,0.274 -1.162,0.498 -1.416,0.498 -0.604,0 -0.589,0.188 0.226,2.826 0.526,1.703 0.808,2.183 1.194,2.035 0.278,-0.107 0.557,-0.194 0.62,-0.194 0.063,0 -0.122,-0.832 -0.412,-1.849 -0.378,-1.33 -0.424,-1.951 -0.164,-2.211 0.626,-0.626 1.355,-0.028 1.778,1.459 0.492,1.73 0.763,2.082 1.41,1.834 1.017,-0.39 -0.891,-4.909 -2.068,-4.898 -0.117,0.002 -0.643,0.227 -1.168,0.5 m 50.546,2.577 c -0.674,2.285 -0.619,2.892 0.26,2.916 0.506,0.014 1.705,-4.754 1.265,-5.033 -0.735,-0.466 -0.786,-0.396 -1.525,2.117 m -56.323,-1.013 c -1.432,0.692 -1.564,3.528 -0.211,4.517 1.021,0.747 2.653,0.513 3.445,-0.494 1.698,-2.159 -0.761,-5.218 -3.234,-4.023 m -6.065,0.391 c -2.943,1.662 -1.638,6.877 1.721,6.877 1.915,0 4.381,-2.046 3.072,-2.548 -0.319,-0.122 -0.799,0.081 -1.194,0.505 -1.351,1.449 -3.401,0.632 -3.833,-1.528 -0.263,-1.318 0.753,-2.429 2.222,-2.429 0.796,0 1,-0.131 0.914,-0.584 -0.14,-0.741 -1.809,-0.91 -2.902,-0.293 m 65.355,0.315 c -1.059,1.128 -1.011,3.359 0.089,4.08 1.021,0.669 2.309,0.512 2.464,-0.301 0.091,-0.481 -0.027,-0.569 -0.545,-0.405 -1.191,0.378 -1.929,-0.683 -1.354,-1.945 0.503,-1.104 1.244,-1.344 2.011,-0.65 0.499,0.452 0.709,0.483 1.035,0.151 0.324,-0.329 0.245,-0.549 -0.378,-1.059 -1.063,-0.868 -2.435,-0.815 -3.322,0.129 m -145.921,0.028 c 1.673,0.699 1.659,0.867 -0.347,4.028 -2.001,3.154 -1.992,3.49 0.097,3.501 1.286,0.006 2.78,-1.581 2.78,-2.954 0,-1.049 0.54,-1.708 1.4,-1.708 1.356,0 0.673,3.467 -1.076,5.459 -2.132,2.429 -5.293,2.327 -7.873,-0.253 -3.991,-3.992 -0.119,-10.22 5.019,-8.073 m 88.897,1.117 c 0.686,1.789 -1.126,2.75 -1.948,1.033 -0.549,-1.145 -0.223,-1.95 0.791,-1.95 0.572,0 0.908,0.267 1.157,0.917 M 233,119.434 c -2.744,1.38 -1.412,5.827 1.524,5.09 1.02,-0.256 0.721,-1.116 -0.435,-1.255 -0.833,-0.1 -1.753,-1.05 -1.378,-1.424 0.102,-0.103 0.752,0.049 1.443,0.338 1.574,0.658 2.179,0.439 2.179,-0.788 0,-1.633 -1.836,-2.714 -3.333,-1.961 m -154.373,0.568 c -1.05,0.614 -1.409,2.14 -0.788,3.343 l 0.559,1.08 1.361,-2.072 c 1.548,-2.356 0.961,-3.574 -1.132,-2.351 M 235,120.833 c 0.448,0.541 0.251,0.603 -0.917,0.29 -0.412,-0.11 -0.75,-0.333 -0.75,-0.495 0,-0.484 1.22,-0.333 1.667,0.205 m -41.562,3.169 c -2.416,0.974 -1.542,4.998 1.086,4.998 2.354,0 3.38,-2.793 1.658,-4.515 -0.856,-0.856 -1.525,-0.974 -2.744,-0.483 m 4.04,0.248 c 2.022,5.471 2.489,5.725 3.939,2.143 1.088,-2.688 1.092,-2.726 0.294,-2.726 -0.44,0 -0.808,0.491 -1.261,1.683 l -0.64,1.683 -0.605,-1.683 c -0.454,-1.262 -0.773,-1.683 -1.274,-1.683 -0.497,0 -0.614,0.15 -0.453,0.583 m 6.533,-0.166 c -1.708,0.882 -1.594,4.34 0.158,4.78 1.312,0.329 2.649,0.018 2.776,-0.647 0.1,-0.531 -0.03,-0.585 -0.928,-0.387 -0.65,0.142 -1.228,0.077 -1.531,-0.175 -0.857,-0.711 -0.527,-0.988 1.181,-0.988 1.518,0 1.666,-0.069 1.666,-0.77 0,-1.65 -1.767,-2.614 -3.322,-1.813 m -13.825,0.218 c -0.103,0.166 -0.51,0.217 -0.906,0.114 -0.689,-0.18 -0.71,-0.113 -0.502,1.615 0.119,0.991 0.218,2.14 0.219,2.552 0.002,0.543 0.2,0.75 0.716,0.75 0.653,0 0.699,-0.134 0.54,-1.583 -0.211,-1.931 -0.055,-2.417 0.775,-2.417 0.416,0 0.639,-0.232 0.639,-0.666 0,-0.688 -1.112,-0.962 -1.481,-0.365 m 18.322,0.778 c -0.105,0.598 -0.319,1.807 -0.476,2.688 -0.27,1.513 -0.247,1.596 0.418,1.5 0.562,-0.081 0.759,-0.435 0.981,-1.761 0.289,-1.732 0.78,-2.357 1.429,-1.819 0.272,0.226 0.292,0.808 0.07,2.03 -0.241,1.325 -0.211,1.776 0.129,1.992 0.758,0.481 0.858,0.341 1.153,-1.627 0.24,-1.598 0.399,-1.916 0.955,-1.916 0.725,0 0.813,0.611 0.421,2.916 -0.229,1.347 0.839,1.941 1.199,0.667 0.946,-3.35 0.479,-4.877 -1.436,-4.695 -0.765,0.073 -1.422,-0.055 -1.677,-0.329 -0.231,-0.247 -0.727,-0.37 -1.101,-0.272 -0.374,0.098 -0.949,0.035 -1.278,-0.141 -0.505,-0.271 -0.626,-0.153 -0.787,0.767 m -23.668,0.041 c -0.341,0.249 -0.895,0.382 -1.23,0.294 -0.751,-0.196 -0.753,-0.052 -0.043,3.651 0.569,2.968 1.621,4.189 1.587,1.842 -0.012,-0.773 0.124,-0.908 0.909,-0.908 1.272,0 2.086,-1.284 1.827,-2.881 -0.343,-2.114 -1.687,-2.995 -3.05,-1.998 m 21.16,0.248 c 0,0.164 -0.375,0.298 -0.833,0.298 -0.867,0 -1.144,-0.503 -0.417,-0.757 0.536,-0.187 1.25,0.075 1.25,0.459 m -10.393,0.734 c 0.194,1.687 -1.23,2.559 -1.957,1.199 -0.626,-1.17 -0.123,-2.363 0.945,-2.24 0.713,0.083 0.928,0.303 1.012,1.041 m -16.527,0.484 c -0.323,0.323 -0.868,0.533 -1.211,0.467 -0.343,-0.066 -0.941,0.037 -1.329,0.229 -0.389,0.192 -0.944,0.395 -1.233,0.45 -0.529,0.101 0.447,4.943 0.993,4.929 0.919,-0.024 1.073,-0.617 0.584,-2.261 -0.427,-1.439 -0.433,-1.75 -0.041,-2.076 0.69,-0.573 1.047,-0.172 1.49,1.674 0.316,1.318 0.541,1.668 1.072,1.668 0.563,0 0.638,-0.15 0.461,-0.917 -0.877,-3.786 0.024,-5.083 1.158,-1.669 0.968,2.913 2.242,2.785 1.416,-0.142 -0.741,-2.631 -2.118,-3.594 -3.36,-2.352 m 7.443,0.22 c 0.338,1.345 0.05,2.026 -0.858,2.026 -0.83,0 -1.426,-1.349 -1.067,-2.416 0.261,-0.778 1.706,-0.485 1.925,0.39 m 30.144,-0.14 c -0.915,0.915 -0.905,3.095 0.019,4.019 0.497,0.497 1.023,0.657 1.916,0.583 1.437,-0.119 1.777,-1.085 0.398,-1.129 -1.425,-0.045 -1.584,-0.12 -1.772,-0.84 -0.169,-0.645 -0.088,-0.681 1.045,-0.459 2.088,0.409 2.221,0.377 2.331,-0.571 0.222,-1.924 -2.505,-3.035 -3.937,-1.603 m -142.426,0.416 c 0.294,0.643 0.182,0.9 -0.782,1.795 -1.815,1.685 -1.467,3.594 0.872,4.788 2.614,1.333 4.732,0.563 4.816,-1.752 0.049,-1.357 0.389,-1.914 1.17,-1.914 1.323,0 1.1,3.29 -0.348,5.13 -2.64,3.357 -8.753,1.668 -9.856,-2.724 -0.639,-2.545 3.159,-7.442 4.128,-5.323 m 97.176,-0.529 c -0.609,0.246 -0.54,0.594 0.782,4.007 1.078,2.783 1.262,3.061 1.827,2.758 0.607,-0.324 0.599,-0.414 -0.236,-2.577 -0.475,-1.233 -1.023,-2.73 -1.216,-3.325 -0.36,-1.105 -0.429,-1.157 -1.157,-0.863 m 47.833,1.029 c 0.081,0.242 -0.144,0.417 -0.536,0.417 -0.729,0 -1.168,-0.435 -0.805,-0.798 0.336,-0.336 1.183,-0.095 1.341,0.381 m 2.164,1.833 c -0.414,1.268 -0.668,2.443 -0.564,2.611 0.442,0.715 1.065,0.202 1.515,-1.245 0.532,-1.715 1.373,-2.51 1.996,-1.888 0.283,0.284 0.237,0.806 -0.182,2.069 -0.566,1.705 -0.488,2.37 0.28,2.37 0.409,0 1.541,-3.015 1.541,-4.105 0,-0.695 -1.502,-1.696 -2.164,-1.442 -0.277,0.106 -0.503,0.065 -0.503,-0.091 0,-1.451 -1.249,-0.331 -1.919,1.721 m 6.836,-1.073 c -0.226,0.361 -0.589,0.657 -0.808,0.657 -0.219,0 -0.386,0.417 -0.371,0.931 0.015,0.512 -0.145,1.252 -0.356,1.645 -0.661,1.235 -0.471,2.398 0.461,2.822 1.149,0.524 1.989,-0.198 1.044,-0.896 -0.924,-0.682 -0.091,-2.952 1.006,-2.742 0.946,0.18 1.381,-0.751 0.463,-0.991 -0.524,-0.137 -0.591,-0.316 -0.354,-0.941 0.388,-1.019 -0.502,-1.418 -1.085,-0.485 m -163.324,6.509 c 1.378,0.965 0.769,2.815 -0.926,2.815 -1.065,0 -1.667,-0.56 -1.667,-1.548 0,-0.636 1.074,-1.786 1.667,-1.786 0.102,0 0.518,0.234 0.926,0.519 m 7.12,3.516 c 5.288,2.416 5.057,2.237 4.592,3.57 -0.469,1.347 -0.117,1.412 -5.342,-0.986 -5.34,-2.451 -5.022,-2.199 -4.455,-3.535 0.567,-1.335 -0.042,-1.446 5.205,0.951 m -4.576,4.531 c 6.773,6.334 6.262,5.725 5.85,6.974 L 72.948,151 h -5.79 -5.79 l 0.349,-1.001 c 0.493,-1.415 0.634,-1.454 4.926,-1.365 2.259,0.046 3.719,-0.043 3.524,-0.216 -0.184,-0.162 -1.555,-1.379 -3.048,-2.705 l -2.714,-2.41 0.353,-1.151 c 0.448,-1.457 0.317,-1.493 2.712,0.747 m 132.355,2.098 c 0.727,0.276 0.813,0.434 0.525,0.972 -0.294,0.55 -0.481,0.59 -1.298,0.282 -1.19,-0.449 -2.052,-0.144 -2.052,0.725 0,0.488 0.36,0.772 1.356,1.07 2.515,0.754 3.251,2.515 1.781,4.262 -1.183,1.406 -4.804,1.32 -4.804,-0.113 0,-0.782 0.585,-0.934 1.839,-0.481 1.006,0.364 1.243,0.347 1.71,-0.12 0.768,-0.768 0.356,-1.497 -1.07,-1.891 -1.709,-0.472 -2.479,-1.267 -2.479,-2.564 0,-1.951 2.216,-3.007 4.492,-2.142 m 3.842,1.146 c 0,0.586 0.207,0.84 0.746,0.917 1.077,0.154 1.213,1.273 0.155,1.273 -0.682,0 -0.848,0.203 -1.021,1.25 -0.335,2.031 -0.266,2.417 0.433,2.417 0.832,0 1.242,0.655 0.646,1.032 -1.705,1.08 -3.141,-0.308 -2.821,-2.725 0.186,-1.399 0.124,-1.785 -0.34,-2.125 -0.619,-0.452 -0.379,-1.182 0.388,-1.182 0.264,0 0.48,-0.275 0.48,-0.611 0,-0.724 0.28,-1.056 0.889,-1.056 0.249,0 0.445,0.358 0.445,0.81 m 5.105,1.805 c 0.718,-0.402 1.228,-0.095 1.228,0.738 0,0.459 -0.23,0.647 -0.793,0.647 -1.087,0 -1.459,0.557 -1.729,2.592 -0.205,1.545 -0.32,1.742 -1.021,1.742 -0.911,0 -0.902,0.057 -0.438,-3.103 0.498,-3.395 0.502,-3.403 1.42,-2.801 0.532,0.348 0.94,0.405 1.333,0.185 m -18.104,1.22 c 1.121,1.193 0.763,1.907 -1.158,2.314 -0.91,0.193 -1.622,0.464 -1.582,0.601 0.039,0.138 0.072,0.4 0.072,0.584 0,0.47 2.117,0.416 2.6,-0.067 0.615,-0.615 1.32,0.193 0.759,0.869 -1.212,1.461 -3.833,1.31 -4.875,-0.28 -2.055,-3.136 1.661,-6.707 4.184,-4.021 m 23.123,-0.184 c 1.456,0.553 1.682,1.46 1.009,4.053 -0.551,2.127 -1.114,2.803 -1.633,1.963 -0.114,-0.183 -0.789,-0.333 -1.501,-0.333 -0.931,0 -1.431,-0.194 -1.777,-0.689 -1.05,-1.499 0.277,-2.844 2.512,-2.545 1.19,0.16 1.295,0.112 1.202,-0.545 -0.079,-0.553 -0.34,-0.726 -1.118,-0.743 -0.559,-0.012 -1.196,-0.133 -1.417,-0.27 -1.315,-0.812 0.966,-1.559 2.723,-0.891 m 5.376,0.683 c -0.121,0.55 -0.096,1.002 0.057,1.005 0.63,0.011 1.118,0.584 0.926,1.086 -0.158,0.411 -0.389,0.468 -0.986,0.241 -0.715,-0.272 -0.824,-0.167 -1.305,1.245 -0.643,1.887 -0.649,2.089 -0.061,2.089 0.679,0 0.955,0.988 0.342,1.223 -1.839,0.706 -2.727,-0.987 -1.861,-3.549 0.372,-1.104 0.537,-2.007 0.366,-2.007 -0.172,0 -0.312,-0.225 -0.312,-0.5 0,-0.275 0.264,-0.5 0.587,-0.5 0.322,0 0.774,-0.3 1.003,-0.667 0.678,-1.087 1.507,-0.865 1.244,0.334 m -41.227,0.588 c 0.127,0.892 -0.728,1.336 -1.437,0.747 -0.369,-0.306 -0.404,-0.565 -0.14,-1.057 0.452,-0.846 1.44,-0.651 1.577,0.31 m 9.917,-0.398 c -0.819,0.819 -0.619,1.124 0.522,0.797 1.257,-0.361 1.422,-0.501 1.135,-0.965 -0.317,-0.512 -1.051,-0.438 -1.657,0.168 m -3.252,0.393 c -0.073,0.384 -0.479,0.619 -1.19,0.688 -1.321,0.127 -1.793,1.358 -1.038,2.703 0.596,1.062 1.479,1.26 2.302,0.514 0.388,-0.351 0.858,-0.481 1.225,-0.338 0.524,0.203 0.465,0.348 -0.493,1.207 -2.851,2.557 -6.852,-1.635 -4.144,-4.342 1.201,-1.201 3.541,-1.504 3.338,-0.432 m -5.003,3.55 c 1.438,3.072 1.516,3.417 0.833,3.679 -1.038,0.398 -3.687,-4.905 -2.746,-5.5 0.779,-0.493 0.871,-0.406 1.913,1.821 M 63.081,152.621 c 0.136,0.132 0.071,0.706 -0.144,1.276 -0.657,1.741 0.174,2.563 3.639,3.597 1.608,0.48 3.1,0.931 3.316,1.003 0.454,0.15 -0.131,2.503 -0.623,2.503 -0.514,0 -9.429,-2.755 -9.704,-2.999 -0.573,-0.508 0.147,-2.001 0.966,-2.001 0.787,0 0.789,-0.006 0.239,-1.158 -0.999,-2.095 0.73,-3.757 2.311,-2.221 m 148.293,0.014 c -0.637,0.403 -0.163,1.032 0.777,1.032 0.904,0 1.379,-0.854 0.634,-1.139 -0.666,-0.256 -0.863,-0.241 -1.411,0.107 m 13.077,0.516 c 2.081,1.928 0.777,3.98 -1.723,2.713 L 221,154.989 v 0.798 c 0,0.941 0.518,1.439 1.663,1.598 1.155,0.16 1.344,1.282 0.216,1.282 -2.299,0 -3.77,-1.533 -3.394,-3.536 0.491,-2.617 3.14,-3.673 4.966,-1.98 m -47.835,3.147 c 0.533,3.911 0.054,4.279 -2.712,2.084 -1.073,-0.852 -2.264,-1.793 -2.648,-2.091 l -0.698,-0.543 0.735,-0.393 c 0.649,-0.348 0.928,-0.232 2.388,0.99 0.909,0.761 1.652,1.322 1.652,1.247 0,-0.075 -0.16,-1.002 -0.355,-2.061 -0.318,-1.72 -0.292,-1.972 0.25,-2.368 0.8,-0.587 0.918,-0.321 1.388,3.135 m 45.226,-2.312 c -0.207,0.335 1.765,1.518 2.053,1.23 0.091,-0.091 0.067,-0.477 -0.054,-0.858 -0.229,-0.72 -1.623,-0.98 -1.999,-0.372 m 8.345,2.585 c 1.553,1.298 1.811,1.762 0.98,1.762 -0.275,0 -0.8,0.3 -1.167,0.667 -0.799,0.799 -1.915,0.856 -2.926,0.148 -1.216,-0.852 -0.838,0.032 0.426,0.996 1.918,1.463 1.455,3.189 -0.855,3.189 -2.039,0 -3.983,-2.037 -3.261,-3.416 0.169,-0.321 0.508,-0.584 0.756,-0.584 0.247,0 0.527,-0.3 0.623,-0.666 0.096,-0.367 0.395,-0.667 0.664,-0.667 0.308,0 0.49,-0.33 0.49,-0.891 0,-2.041 2.148,-2.312 4.27,-0.538 m -59.218,0.038 c 0.247,0.462 0.171,0.742 -0.315,1.157 -0.742,0.636 -0.617,1.146 0.745,3.037 0.517,0.717 0.9,1.322 0.853,1.345 -0.047,0.022 -0.332,0.228 -0.633,0.458 -0.476,0.362 -0.773,0.108 -2.25,-1.923 -1.706,-2.345 -1.991,-2.98 -1.369,-3.058 0.183,-0.023 0.48,-0.06 0.66,-0.083 0.18,-0.023 0.564,-0.38 0.852,-0.792 0.637,-0.909 1.026,-0.947 1.457,-0.141 m 56.364,0.868 c 0,0.697 0.159,0.856 0.857,0.856 0.697,0 0.837,-0.139 0.75,-0.75 -0.164,-1.15 -1.607,-1.246 -1.607,-0.106 m 7.94,0.111 c 0.137,0.959 -0.805,1.356 -1.52,0.641 -0.443,-0.443 -0.457,-0.615 -0.088,-1.06 0.599,-0.723 1.478,-0.494 1.608,0.419 m -1.657,1.518 c 0.358,0.431 -2.925,4.894 -3.6,4.894 -1.118,0 -0.876,-0.992 0.752,-3.081 1.784,-2.29 2.222,-2.568 2.848,-1.813 m -26.411,0.743 c 29.513,5.147 43.752,39.609 26.476,64.079 -19.955,28.264 -64.523,20.326 -73.159,-13.03 -7.526,-29.07 17.265,-56.179 46.683,-51.049 m -39.34,0.854 c 0.631,0.7 0.626,0.711 -0.849,2.022 -1.187,1.055 -1.387,1.38 -1,1.625 0.922,0.584 1.634,0.292 2.279,-0.933 0.497,-0.944 1.372,-0.98 1.372,-0.058 0,1.139 -1.767,2.641 -3.107,2.641 -1.476,0 -3.227,-1.823 -3.227,-3.36 0,-2.225 3.082,-3.542 4.532,-1.937 m 56.864,0.207 c 0.123,0.638 1.776,1.363 2.181,0.957 0.312,-0.313 -1.124,-1.534 -1.805,-1.534 -0.282,0 -0.441,0.243 -0.376,0.577 m -59.84,0.646 c -0.317,0.316 -0.276,1.444 0.053,1.444 0.151,0 0.627,-0.375 1.058,-0.833 l 0.783,-0.834 h -0.836 c -0.46,0 -0.936,0.1 -1.058,0.223 m 72.311,0.555 c 1.113,0.957 1.185,2.652 0.156,3.681 l -0.685,0.685 -1.457,-1.43 c -1.227,-1.205 -1.491,-1.34 -1.676,-0.858 -0.35,0.911 0.072,1.707 1.14,2.149 1.227,0.508 1.308,1.329 0.13,1.329 -0.505,0 -1.261,-0.402 -1.834,-0.975 -2.728,-2.728 1.302,-7.096 4.226,-4.581 M 63.55,162.017 c 0.324,0.324 0.161,1.293 -1.046,6.233 -0.163,0.665 -0.057,0.75 0.932,0.75 1.832,0 2.685,-1.198 2.494,-3.501 -0.154,-1.864 0.193,-2.499 1.369,-2.499 1.192,0 1.12,4.606 -0.101,6.435 -3.472,5.2 -12.162,0.578 -9.753,-5.188 0.865,-2.07 4.82,-3.515 6.105,-2.23 m 96.783,1.323 c 0,0.392 -0.341,0.83 -0.815,1.046 -1.04,0.474 -1.344,1.264 -0.724,1.884 0.424,0.424 0.628,0.396 1.635,-0.226 3.14,-1.941 5.999,0.874 3.684,3.626 -1.08,1.283 -2.433,1.886 -2.83,1.26 -0.433,-0.682 -0.352,-0.823 0.884,-1.552 0.734,-0.434 1.166,-0.944 1.166,-1.377 0,-1.045 -0.962,-1.204 -2.373,-0.392 -3.129,1.801 -5.565,-1.509 -2.925,-3.975 1.224,-1.144 2.298,-1.281 2.298,-0.294 M 235,162.919 c 0,0.164 0.388,0.662 0.862,1.106 l 0.863,0.808 -0.113,-1 C 236.508,162.903 235,162.048 235,162.919 m -174.333,0.984 c -1.661,0.611 -2.256,2.794 -1.057,3.879 0.985,0.892 1.276,0.66 1.677,-1.338 0.575,-2.863 0.549,-2.971 -0.62,-2.541 m 180.642,2.975 c 0.38,0.483 0.691,1.158 0.691,1.5 0,0.912 -0.965,0.759 -1.333,-0.211 -0.175,-0.459 -0.546,-0.834 -0.825,-0.834 -0.61,0 -0.615,0.068 -0.123,1.711 0.454,1.515 -0.23,2.623 -1.62,2.623 -0.997,0 -2.432,-1.505 -2.432,-2.549 0,-1.04 0.923,-1.029 1.321,0.016 0.688,1.812 1.646,1.48 1.077,-0.373 -0.755,-2.46 1.679,-3.873 3.244,-1.883 m -186.983,6.91 c -0.004,0.208 -0.301,0.754 -0.659,1.212 -0.738,0.943 -0.898,3.302 -0.267,3.933 1.11,1.11 2.234,0.361 3.767,-2.509 1.22,-2.283 1.846,-2.806 3.569,-2.982 4.791,-0.487 6.958,5.388 3.473,9.412 l -1.042,1.204 -0.777,-0.829 -0.777,-0.829 0.84,-1.283 c 1.177,-1.799 1.4,-2.95 0.759,-3.927 -1.217,-1.858 -2.725,-1.386 -3.97,1.242 -1.737,3.668 -4.686,4.7 -7.098,2.485 -2.016,-1.853 -2.09,-5.679 -0.149,-7.745 0.781,-0.831 2.351,-0.416 2.331,0.616 M 174.667,200 v 12.333 H 177 179.333 V 200 187.667 H 177 174.667 V 200 m 7.666,-10.5 v 1.833 h 3.667 3.667 v 10.5 10.5 h 2.333 2.333 v -10.5 -10.5 H 198 201.667 V 189.5 187.667 H 192 182.333 V 189.5 M 205,200 v 12.333 h 2.333 2.334 V 200 187.667 H 207.333 205 V 200 m 10,0 v 12.333 h 7.167 7.166 v -1.833 -1.833 h -4.833 -4.833 v -10.5 -10.5 H 217.333 215 V 200 m -90.66,-2.572 c -1.585,0.802 -2.187,3.357 -1.143,4.847 0.428,0.612 0.623,0.68 1.014,0.355 0.336,-0.279 0.378,-0.508 0.136,-0.749 -0.641,-0.642 -0.403,-2.47 0.394,-3.029 1.991,-1.394 4.1,-0.187 3.788,2.168 -0.241,1.817 0.17,2.356 0.948,1.245 2.069,-2.954 -1.751,-6.55 -5.137,-4.837 m 147.226,6.166 c -2.049,2.263 1.586,5.587 3.747,3.426 0.943,-0.943 0.877,-3.447 -0.096,-3.631 -0.531,-0.101 -0.585,0.029 -0.387,0.927 0.142,0.651 0.077,1.228 -0.175,1.531 -0.728,0.877 -1.04,0.512 -0.94,-1.097 0.114,-1.816 -1.006,-2.419 -2.149,-1.156 m -147.399,0.471 c -2.204,1.249 -1.259,4.602 1.296,4.602 1.644,0 2.67,-0.962 2.67,-2.5 0,-2.048 -2.099,-3.161 -3.966,-2.102 M 272.738,205 c -0.081,0.55 -0.28,1 -0.442,1 -0.458,0 -0.349,-1.59 0.121,-1.779 0.229,-0.093 0.428,-0.18 0.442,-0.195 0.014,-0.014 -0.041,0.424 -0.121,0.974 m -146.265,0.202 c 0.29,0.112 0.527,0.559 0.527,0.994 0,1.307 -2.396,1.563 -2.878,0.307 -0.409,-1.064 0.974,-1.829 2.351,-1.301 m 144.205,3.443 c -1.037,1.938 0.135,3.688 2.47,3.688 2.124,0 3.496,-2.44 2.048,-3.642 -0.575,-0.477 -0.992,0.038 -0.725,0.895 0.271,0.872 -0.282,1.497 -1.324,1.497 -1.175,0 -1.921,-0.926 -1.452,-1.803 0.346,-0.646 0.163,-1.28 -0.37,-1.28 -0.166,0 -0.457,0.29 -0.647,0.645 m -145.111,1.11 c -3.089,0.446 -3.129,1.412 -0.059,1.412 2.88,0 3.199,1.284 0.428,1.723 -1.444,0.229 -1.788,0.412 -1.871,0.992 -0.12,0.841 4.063,0.312 4.632,-0.586 0.361,-0.57 0.391,-1.763 0.053,-2.104 -0.138,-0.139 -0.25,-0.563 -0.25,-0.943 0,-0.866 -0.162,-0.893 -2.933,-0.494 M 267.833,213 c -0.307,0.498 0.121,1 0.853,1 0.425,0 0.647,-0.229 0.647,-0.667 0,-0.707 -1.115,-0.955 -1.5,-0.333 m 2.08,0.632 c -0.163,0.622 2.322,1.368 4.555,1.368 1.091,0 0.429,-1.124 -0.803,-1.364 -3.498,-0.682 -3.575,-0.682 -3.752,-0.004 m -153.746,0.578 c -1.284,0.236 -2.821,0.517 -3.417,0.625 -1.126,0.203 -1.255,0.378 -0.806,1.086 0.326,0.513 7.059,-0.518 7.051,-1.079 -0.014,-0.944 -0.522,-1.057 -2.828,-0.632 m 12.166,0.586 c 0,0.271 -0.516,0.56 -1.244,0.696 -2.279,0.428 -3.012,1.395 -2.121,2.801 0.367,0.58 1.08,0.17 0.958,-0.55 -0.117,-0.682 2.427,-1.534 2.819,-0.945 0.739,1.112 0.269,1.759 -1.578,2.173 -1.491,0.333 -1.834,0.538 -1.834,1.092 0,0.543 0.152,0.641 0.75,0.483 0.413,-0.109 1.553,-0.379 2.533,-0.599 l 1.783,-0.401 -0.199,-1.244 c -0.109,-0.684 -0.29,-1.482 -0.402,-1.773 -0.145,-0.38 -0.005,-0.529 0.5,-0.529 0.402,0 0.702,-0.214 0.702,-0.5 0,-0.311 -0.315,-0.5 -0.833,-0.5 -0.459,0 -0.834,-0.15 -0.834,-0.333 0,-0.184 -0.225,-0.334 -0.5,-0.334 -0.275,0 -0.5,0.209 -0.5,0.463 m 141.224,0.425 c -0.514,0.514 -0.134,1.092 1.36,2.069 l 1.583,1.035 -1.167,0.009 c -2.391,0.017 -2.544,0.157 -3.587,3.268 -0.278,0.832 -0.272,1.137 0.026,1.243 2.971,1.062 4.617,1.398 4.779,0.976 0.265,-0.691 -0.114,-1.079 -1.305,-1.334 -3.072,-0.657 -2.789,-2.665 0.421,-2.987 2.095,-0.21 2.332,-0.307 2.326,-0.95 -0.009,-0.872 -3.942,-3.823 -4.436,-3.329 m -155.14,2.374 c -3.335,0.834 -3.097,2.114 0.249,1.342 3.015,-0.696 3.136,0.757 0.128,1.525 -1.041,0.265 -1.666,0.617 -1.735,0.976 -0.127,0.661 0.533,0.718 2.38,0.205 0.947,-0.263 1.396,-0.251 1.755,0.046 0.69,0.573 0.051,1.211 -1.47,1.468 -1.613,0.272 -2.2,0.657 -1.96,1.283 0.174,0.454 0.399,0.454 2.132,0.003 2.848,-0.742 3.464,-1.638 2.282,-3.325 -0.268,-0.383 -0.4,-0.785 -0.292,-0.893 0.303,-0.303 -0.654,-3.23 -1.042,-3.188 -0.189,0.021 -1.281,0.272 -2.427,0.558 m 16.805,0.294 c -0.122,0.122 -0.222,0.497 -0.222,0.833 0,0.698 1.191,0.861 1.423,0.195 0.32,-0.917 -0.56,-1.669 -1.201,-1.028 M 281,220.023 c 0,0.525 -0.189,0.648 -0.882,0.573 -1.073,-0.117 -1.487,0.703 -0.486,0.965 0.386,0.101 0.701,0.382 0.701,0.625 0,0.616 0.692,0.98 0.979,0.516 0.178,-0.289 0.659,-0.287 1.947,0.011 2.149,0.496 3.792,-0.884 2.542,-2.134 -0.289,-0.289 -1.162,0.106 -0.96,0.433 0.312,0.506 -0.391,0.633 -1.622,0.293 -0.841,-0.232 -1.219,-0.527 -1.219,-0.952 0,-0.338 -0.225,-0.701 -0.5,-0.807 -0.342,-0.131 -0.5,0.02 -0.5,0.477 m -152.917,1.405 c -2.961,0.996 -2.89,2.317 0.077,1.424 1.657,-0.499 2.507,-0.394 2.507,0.31 0,0.624 -0.66,1.06 -2.25,1.485 -1.307,0.349 -1.843,1.05 -1.137,1.487 1.602,0.99 5.068,-1.868 4.25,-3.506 -0.291,-0.585 -0.53,-1.266 -0.53,-1.513 0,-0.578 -0.389,-0.536 -2.917,0.313 m 151.721,3.069 c -0.299,0.457 -0.457,1.057 -0.351,1.334 0.106,0.276 0.036,0.502 -0.155,0.502 -0.191,0 -0.298,0.249 -0.239,0.553 0.155,0.795 4.568,2.272 4.821,1.614 0.279,-0.727 -0.076,-1.042 -1.683,-1.492 -1.517,-0.424 -2.161,-1.177 -1.539,-1.799 0.239,-0.239 0.802,-0.224 1.825,0.049 2.298,0.615 2.35,0.614 2.35,-0.055 0,-0.457 -0.409,-0.752 -1.5,-1.078 -2.173,-0.65 -2.91,-0.572 -3.529,0.372 m -12.7,0.098 c -1.255,0.799 -1.135,3.341 0.191,4.051 1.952,1.045 4.057,0.016 4.153,-2.029 0.074,-1.551 -1.023,-1.788 -1.175,-0.254 -0.099,0.999 -1.008,2.013 -1.428,1.593 -0.103,-0.103 0.049,-0.753 0.338,-1.444 0.78,-1.865 -0.42,-2.971 -2.079,-1.917 m -151.271,1.372 c -1.466,0.508 -2.651,1.098 -2.633,1.311 0.084,0.978 0.152,1.032 0.929,0.736 0.71,-0.27 0.818,-0.196 0.993,0.679 0.275,1.376 1.463,1.87 3.226,1.342 1.692,-0.507 2.303,-1.6 1.649,-2.952 -0.243,-0.504 -0.455,-1.139 -0.47,-1.411 -0.042,-0.765 -0.805,-0.704 -3.694,0.295 m 152.451,0.366 c -0.368,1.053 -0.951,1.059 -0.951,0.008 0,-0.552 0.383,-0.904 1.066,-0.981 0.128,-0.015 0.076,0.423 -0.115,0.973 m -138.201,0.497 c -1.89,0.863 -2.382,2.157 -1.25,3.289 0.275,0.275 0.5,0.8 0.5,1.168 0,0.637 0.115,0.621 2.492,-0.348 2.188,-0.891 2.452,-1.089 2.165,-1.624 -0.314,-0.587 -0.389,-0.584 -1.989,0.081 -1.351,0.561 -1.756,0.612 -2.165,0.273 -0.825,-0.684 -0.597,-0.997 1.356,-1.861 1.082,-0.478 1.802,-0.993 1.722,-1.232 -0.22,-0.663 -0.97,-0.596 -2.831,0.254 m -11.25,0.833 c 0,1.036 -1.498,1.697 -2.313,1.02 -0.778,-0.645 -0.63,-1.253 0.397,-1.633 1.354,-0.5 1.916,-0.32 1.916,0.613 m 144.191,1.215 c -1.976,2.512 0.723,5.113 3.021,2.912 0.953,-0.913 1.955,-0.895 1.955,0.036 0,0.283 -0.3,0.771 -0.667,1.085 -0.366,0.314 -0.666,0.753 -0.666,0.977 0,0.857 0.714,0.783 1.67,-0.174 2.447,-2.446 -0.197,-5.654 -2.786,-3.381 -1.679,1.474 -3.056,0.839 -1.518,-0.7 0.66,-0.66 0.661,-1.633 0.002,-1.633 -0.176,0 -0.631,0.395 -1.011,0.878 m 15.194,0.398 c -1.848,2.043 1.328,5.352 3.649,3.802 1.064,-0.711 1.566,-3.411 0.633,-3.411 -0.307,0 -0.5,0.312 -0.5,0.809 0,0.806 -0.768,1.857 -1.357,1.857 -0.445,0 -0.382,-0.745 0.177,-2.083 0.268,-0.641 0.393,-1.259 0.278,-1.374 -0.448,-0.448 -2.351,-0.184 -2.88,0.4 m 1.77,0.641 c -0.04,0.858 -0.949,1.892 -1.168,1.329 -0.125,-0.323 -0.043,-0.811 0.184,-1.084 0.435,-0.524 1.004,-0.666 0.984,-0.245 m -161.571,1.001 c -2.171,0.889 -2.252,0.966 -1.794,1.69 0.23,0.362 0.506,0.347 1.536,-0.083 1.575,-0.659 2.382,-0.666 2.628,-0.025 0.279,0.727 1.213,0.614 1.213,-0.147 0,-0.356 -0.15,-0.74 -0.333,-0.853 -0.184,-0.113 -0.334,-0.497 -0.334,-0.853 0,-0.815 -0.343,-0.783 -2.916,0.271 m 15.379,0.56 c -0.13,0.339 0.019,0.723 0.383,0.99 0.391,0.286 0.516,0.643 0.364,1.039 -0.206,0.539 -0.351,0.487 -1.354,-0.485 -1.871,-1.814 -3.754,-0.401 -2.224,1.669 0.386,0.522 0.702,1.18 0.702,1.462 0,0.692 0.23,0.648 2.138,-0.411 2.02,-1.12 2.444,-1.738 2.016,-2.936 -0.449,-1.255 -1.731,-2.095 -2.025,-1.328 m -1.123,2.363 c 0.232,0.28 0.332,0.598 0.222,0.708 -0.341,0.342 -1.228,-0.168 -1.228,-0.705 0,-0.653 0.466,-0.654 1.006,-0.003 m 143.545,0.435 c -0.303,0.336 -0.551,0.917 -0.551,1.293 0,0.375 -0.225,0.869 -0.5,1.098 -0.275,0.228 -0.5,0.707 -0.5,1.064 0,0.358 -0.229,0.879 -0.509,1.159 -0.456,0.456 -0.275,0.622 1.75,1.605 2.053,0.998 2.298,1.048 2.687,0.554 0.375,-0.474 0.217,-0.647 -1.25,-1.365 -1.086,-0.532 -1.678,-1.033 -1.678,-1.42 0,-0.78 0.716,-0.755 2.358,0.082 0.732,0.374 1.476,0.59 1.653,0.48 0.676,-0.418 0.272,-1.081 -1.013,-1.66 -1.691,-0.763 -2.248,-1.383 -1.718,-1.913 0.292,-0.292 0.752,-0.208 1.895,0.347 1.786,0.868 2.026,0.893 2.278,0.234 0.468,-1.218 -3.941,-2.619 -4.902,-1.558 m -157.066,0.542 c -1,1 -1.044,2.139 -0.128,3.304 1.437,1.826 4.643,0.601 4.643,-1.774 0,-2.23 -2.85,-3.195 -4.515,-1.53 m 16.625,1.118 c -3.231,1.856 -3.251,1.873 -2.889,2.519 0.371,0.662 6.525,-2.632 6.374,-3.411 -0.165,-0.848 -0.69,-0.714 -3.485,0.892 m -13.282,0.004 c 0.249,0.649 -0.908,1.727 -1.854,1.727 -0.953,0 -1.417,-1.136 -0.714,-1.748 1.137,-0.989 2.183,-0.981 2.568,0.021 m 136.967,-0.46 c -0.116,0.302 -0.155,0.588 -0.087,0.635 2.389,1.658 6.113,3.51 6.34,3.152 0.461,-0.727 0.37,-0.82 -2.298,-2.382 -3.349,-1.961 -3.695,-2.084 -3.955,-1.405 m -136.913,4.191 c -2.207,2.73 -2.015,3.125 1.368,2.817 2.911,-0.266 2.907,-0.264 2.63,-0.986 -0.165,-0.43 -0.521,-0.484 -1.944,-0.295 l -1.742,0.231 1.072,-1.353 c 0.655,-0.827 0.992,-1.56 0.867,-1.886 -0.312,-0.813 -0.508,-0.685 -2.251,1.472 m 137.003,-0.395 c -0.703,0.777 -0.738,2.391 -0.052,2.391 0.275,0 0.5,-0.27 0.5,-0.6 0,-0.782 0.627,-1.395 1.201,-1.174 0.341,0.13 0.367,0.335 0.106,0.822 -0.191,0.357 -0.3,1.13 -0.244,1.717 0.178,1.838 2.604,1.552 2.604,-0.306 0,-0.482 0.195,-0.793 0.5,-0.793 0.972,0 0.48,-0.849 -1.014,-1.752 -1.764,-1.066 -2.831,-1.156 -3.601,-0.305 m -120.072,0.199 c -0.512,0.376 -0.647,0.88 -0.647,2.417 0,2.331 -1.057,2.88 -1.652,0.858 -0.216,-0.735 -0.525,-1.083 -0.958,-1.083 -0.916,0 -0.501,1.922 0.629,2.916 1.717,1.512 4.122,0.39 3.645,-1.701 -0.416,-1.828 -0.358,-2.356 0.271,-2.483 0.422,-0.085 0.718,0.186 0.99,0.906 0.496,1.313 1.242,1.345 1.242,0.053 0,-1.752 -2.139,-2.896 -3.52,-1.883 m 123.364,2.491 c -0.122,0.386 -0.362,0.701 -0.533,0.701 -0.358,0 -0.425,-1.442 -0.083,-1.784 0.406,-0.406 0.844,0.364 0.616,1.083 m 9.874,-0.383 c -2.364,2 0.889,5.842 3.386,4 0.599,-0.441 1.301,-2.401 0.977,-2.725 -0.474,-0.473 -1.014,-0.108 -1.198,0.809 -0.157,0.785 -0.375,1 -1.018,1 h -0.818 l 0.827,-1.48 c 1.105,-1.977 -0.396,-3.093 -2.156,-1.604 m 0.902,1.815 c -0.372,0.675 -0.44,0.695 -0.55,0.169 -0.069,-0.329 0.069,-0.833 0.307,-1.12 0.592,-0.713 0.772,-0.009 0.243,0.951 m -16.403,-0.575 c -0.122,0.317 0.321,0.856 1.259,1.529 1.062,0.762 1.402,1.208 1.28,1.677 -0.239,0.911 -0.966,0.791 -2.482,-0.41 -1.184,-0.937 -1.375,-0.994 -1.83,-0.539 -0.455,0.454 -0.343,0.633 1.072,1.714 1.98,1.511 3.321,1.611 3.901,0.289 0.221,-0.504 0.593,-1.036 0.826,-1.183 0.7,-0.44 0.505,-0.756 -1.357,-2.193 -1.928,-1.488 -2.38,-1.637 -2.669,-0.884 m -132.114,0.506 c -2.129,0.879 -2.05,5.004 0.096,5.004 0.783,0 0.883,-0.713 0.17,-1.212 -0.735,-0.515 -0.94,-1.601 -0.369,-1.954 0.183,-0.113 0.648,0.328 1.033,0.98 0.785,1.332 1.276,1.467 2.082,0.577 1.569,-1.734 -0.738,-4.333 -3.012,-3.395 m 2.22,1.651 c 0.524,0.981 -0.167,1.141 -0.794,0.184 -0.468,-0.714 -0.475,-0.831 -0.048,-0.831 0.272,0 0.651,0.291 0.842,0.647 m 143.172,0.036 c -0.148,0.465 0.068,1.055 0.678,1.855 1.089,1.428 1.02,1.525 -0.767,1.071 -1.087,-0.275 -1.525,-0.258 -1.927,0.076 -0.692,0.573 -0.281,0.779 2.629,1.315 3.217,0.592 3.392,0.271 1.445,-2.656 -1.732,-2.606 -1.753,-2.622 -2.058,-1.661 m -130.283,0.529 c -1.466,1.466 -0.612,4.455 1.273,4.455 0.649,0 0.678,-0.866 0.037,-1.112 -0.682,-0.262 -1.19,-1.346 -0.872,-1.861 0.201,-0.325 0.577,-0.105 1.458,0.851 1.304,1.416 1.942,1.267 2.389,-0.559 0.552,-2.257 -2.527,-3.531 -4.285,-1.774 m 2.594,0.324 c 0.498,0.191 0.771,1.464 0.314,1.464 -0.259,0 -1.095,-1.067 -1.109,-1.416 -0.013,-0.303 0.111,-0.311 0.795,-0.048 m 110.29,2.048 c -0.323,0.504 -0.814,1.103 -1.091,1.332 -0.478,0.394 2.551,3.705 3.422,3.74 0.931,0.038 0.553,-1.204 -0.696,-2.29 -1.127,-0.979 -1.317,-1.306 -1.039,-1.782 0.499,-0.853 0.966,-0.727 2.362,0.636 1.101,1.075 1.316,1.165 1.808,0.757 0.507,-0.421 0.411,-0.593 -1.06,-1.887 -1.892,-1.665 -2.879,-1.8 -3.706,-0.506 m -125.591,0.751 c -2.603,2.036 -2.158,3.292 0.488,1.375 1.338,-0.969 2.34,-1.071 2.34,-0.238 0,0.22 -0.672,0.874 -1.494,1.453 -1.012,0.714 -1.43,1.218 -1.297,1.564 0.282,0.736 0.7,0.64 2.125,-0.489 2.376,-1.882 3.178,-0.856 0.893,1.143 -2.044,1.788 -1.744,2.871 0.387,1.394 2.635,-1.826 3.112,-3.484 1.21,-4.207 -0.453,-0.172 -0.824,-0.548 -0.824,-0.835 0,-0.663 -1.344,-2.5 -1.812,-2.477 -0.195,0.009 -1.102,0.602 -2.016,1.317 m 16.578,0.93 c -0.962,0.863 -1.75,1.747 -1.75,1.966 0,0.898 0.769,0.755 2.022,-0.377 1.184,-1.07 1.41,-1.156 2.07,-0.79 0.408,0.226 0.854,0.379 0.992,0.34 0.349,-0.098 0.347,-0.091 -0.593,2.222 -1.247,3.069 -0.884,3.297 2.677,1.683 2.016,-0.914 2.205,-1.079 1.755,-1.529 -0.45,-0.449 -0.65,-0.429 -1.867,0.192 -1.808,0.922 -1.799,0.929 -1.03,-0.866 l 0.67,-1.561 -0.834,-0.772 c -0.458,-0.425 -1.064,-0.773 -1.347,-0.773 -0.283,0 -0.497,-0.112 -0.475,-0.25 0.23,-1.455 -0.201,-1.358 -2.29,0.515 m 104.644,0.485 c 0.058,0.413 0.331,0.75 0.606,0.75 0.275,0 0.548,-0.337 0.607,-0.75 0.082,-0.577 -0.058,-0.75 -0.607,-0.75 -0.548,0 -0.688,0.173 -0.606,0.75 m 18.069,0.364 c -0.648,0.558 -0.907,1.096 -0.907,1.886 0,2.242 2.888,3.49 4.386,1.896 2.239,-2.383 -1.005,-5.909 -3.479,-3.782 m -17.381,1.291 c -0.841,0.842 -1.159,0.985 -1.477,0.667 -0.704,-0.705 -1.378,-0.496 -1.114,0.345 0.129,0.412 0.222,1.097 0.207,1.521 -0.02,0.571 0.132,0.743 0.589,0.666 0.371,-0.062 0.979,0.327 1.528,0.98 1.072,1.274 2.251,1.412 2.995,0.349 0.59,-0.842 0.038,-1.498 -0.727,-0.863 -0.334,0.277 -0.678,0.137 -1.428,-0.581 l -0.987,-0.946 0.73,-0.778 0.731,-0.778 1.42,1.394 c 1.225,1.202 1.493,1.333 1.953,0.951 0.474,-0.393 0.34,-0.638 -1.223,-2.22 -2.073,-2.099 -1.853,-2.051 -3.197,-0.707 m 19.939,-0.05 c 0.76,0.759 0.726,1.25 -0.124,1.786 -1.068,0.674 -2.712,-0.992 -1.92,-1.946 0.592,-0.713 1.221,-0.664 2.044,0.16 m -116.125,1.194 c -0.513,0.513 -0.216,1.451 0.461,1.451 0.518,0 0.663,-0.179 0.583,-0.724 -0.11,-0.751 -0.646,-1.125 -1.044,-0.727 m 110.869,1.035 c -0.118,0.32 -0.413,0.703 -0.656,0.85 -0.717,0.432 -0.539,0.736 1.4,2.393 1.588,1.356 1.916,1.512 2.375,1.132 0.473,-0.393 0.371,-0.581 -0.925,-1.697 -1.315,-1.133 -1.415,-1.321 -1.03,-1.939 0.235,-0.375 0.338,-0.827 0.23,-1.003 -0.323,-0.523 -1.163,-0.364 -1.394,0.264 m -131.91,1.452 c -1.286,1.528 -0.214,4.298 1.664,4.298 0.758,0 0.564,-0.743 -0.395,-1.507 -0.653,-0.521 -0.819,-0.879 -0.651,-1.408 0.214,-0.672 0.281,-0.647 1.325,0.492 1.247,1.361 2.048,1.32 2.41,-0.123 0.639,-2.545 -2.592,-3.845 -4.353,-1.752 m 18.306,0.822 c -1.4,1.638 -1.529,1.916 -1.096,2.35 0.598,0.598 3.815,-2.839 3.478,-3.716 -0.312,-0.813 -0.72,-0.579 -2.382,1.366 m -15.149,-0.344 c 0.287,0.346 0.317,0.625 0.09,0.851 -0.226,0.226 -0.518,0.058 -0.893,-0.514 -0.643,-0.981 0.033,-1.264 0.803,-0.337 m 109.572,-0.154 c -0.321,0.187 -0.584,0.558 -0.584,0.824 0,0.265 -0.216,0.483 -0.48,0.483 -1.042,0 -0.841,0.776 0.657,2.529 1.467,1.718 2.126,2.063 2.395,1.257 0.062,-0.186 -0.341,-0.91 -0.896,-1.608 -1.956,-2.461 -0.69,-3.535 1.355,-1.15 1.127,1.313 1.317,1.418 1.772,0.971 1.169,-1.15 -2.707,-4.187 -4.219,-3.306 m -92.276,1.615 c -1.67,1.67 -0.804,4.359 1.404,4.359 0.863,0 0.78,-0.773 -0.126,-1.171 -0.963,-0.424 -1.135,-1.372 -0.397,-2.187 0.753,-0.832 1.295,-0.811 2.128,0.083 0.79,0.848 1.18,0.637 0.898,-0.486 -0.418,-1.665 -2.519,-1.986 -3.907,-0.598 m 108.244,-0.032 c -0.303,0.336 -0.552,0.786 -0.552,1 0,0.215 -0.225,0.391 -0.5,0.391 -1.212,0 2.45,4.323 4.189,4.944 0.585,0.209 0.772,-1.027 0.216,-1.433 -0.487,-0.356 -0.476,-0.444 0.113,-0.949 1.042,-0.893 0.863,-2.656 -0.377,-3.699 -1.204,-1.014 -2.319,-1.105 -3.089,-0.254 m -124.83,2.169 c -1.563,1.582 -1.698,1.827 -1.223,2.22 0.46,0.382 0.73,0.249 1.97,-0.968 2.23,-2.188 3.356,-1.062 1.167,1.168 -2.144,2.185 -1.263,3.223 0.919,1.082 1.71,-1.679 1.994,-3.302 0.695,-3.984 -0.412,-0.216 -0.87,-0.597 -1.016,-0.845 -0.411,-0.696 -0.629,-0.581 -2.512,1.327 m 127.23,-0.663 c 0.75,0.798 0.703,1.69 -0.106,2 -0.762,0.293 -2.36,-1.662 -1.856,-2.27 0.591,-0.712 1.106,-0.641 1.962,0.27 m -22.847,0.213 c -1.521,0.628 -1.885,2.68 -0.734,4.144 1.469,1.867 5.074,0.347 4.51,-1.901 -0.462,-1.843 -2.218,-2.886 -3.776,-2.243 m -84.08,1.217 c -1.416,1.799 -0.656,3.878 1.581,4.326 1.333,0.266 1.539,-0.739 0.219,-1.07 -0.901,-0.226 -1.495,-1.039 -1.253,-1.715 0.103,-0.286 0.483,-0.157 1.236,0.417 1.253,0.955 2.034,1.057 2.323,0.303 0.973,-2.534 -2.422,-4.403 -4.106,-2.261 m 77.684,0.487 c -2.885,2.688 -0.188,7.434 3.529,6.209 1.469,-0.484 2.504,-1.967 1.838,-2.633 -0.331,-0.331 -0.519,-0.266 -0.929,0.319 -0.855,1.22 -1.676,1.494 -2.774,0.926 -2.066,-1.068 -1.894,-3.682 0.288,-4.392 1.628,-0.531 1.68,-1.128 0.097,-1.128 -0.858,0 -1.553,0.237 -2.049,0.699 m 8.487,0.132 c 0.958,1.463 -0.282,2.797 -1.541,1.658 -0.639,-0.578 -0.876,-1.823 -0.432,-2.267 0.481,-0.481 1.456,-0.18 1.973,0.609 m -83.253,0.284 c 0.1,0.52 0.017,0.553 -0.58,0.234 -0.843,-0.451 -0.923,-1.108 -0.116,-0.953 0.318,0.061 0.632,0.385 0.696,0.719 m -16.581,0.017 c -0.221,0.267 -0.689,0.387 -1.097,0.28 -0.555,-0.145 -0.665,-0.068 -0.503,0.355 0.131,0.342 -0.215,1.046 -0.944,1.918 -0.633,0.758 -1.151,1.514 -1.151,1.68 0,0.408 1.251,1.635 1.667,1.635 0.422,0 0.44,-1.24 0.02,-1.389 -0.172,-0.061 0.112,-0.63 0.632,-1.264 0.827,-1.01 1.013,-1.097 1.494,-0.698 0.759,0.631 1.491,-0.048 0.865,-0.802 -0.334,-0.403 -0.339,-0.618 -0.023,-0.999 0.4,-0.482 0.222,-1.181 -0.301,-1.181 -0.15,0 -0.446,0.209 -0.659,0.465 m 114.162,0.058 c -0.288,0.289 -0.524,0.739 -0.524,1 0,0.262 -0.263,0.477 -0.584,0.477 -0.322,0 -1.012,0.453 -1.535,1.006 l -0.95,1.007 1.56,1.827 c 1.67,1.954 1.825,2.044 2.445,1.424 0.313,-0.313 0.093,-0.716 -1.004,-1.834 -1.34,-1.365 -1.378,-1.46 -0.82,-2.015 0.557,-0.554 0.641,-0.515 1.764,0.835 0.649,0.779 1.383,1.416 1.632,1.416 0.952,0 0.836,-0.74 -0.314,-2.013 -0.656,-0.727 -1.194,-1.546 -1.194,-1.821 0,-0.947 1.225,-0.495 2.307,0.851 0.99,1.232 2.044,1.419 2.023,0.359 -0.033,-1.612 -3.759,-3.565 -4.806,-2.519 m -7.059,3.616 c -0.161,0.418 3.548,5.536 4.194,5.788 1.377,0.539 0.892,-1.103 -1.049,-3.558 -2.092,-2.643 -2.795,-3.142 -3.145,-2.23"
       id="path0" />
    <path
       fill-rule="evenodd"
       fill="#f49c14"
       stroke="none"
       d="m 217,9.53 c 0,0.108 5.701,10.964 12.67,24.125 l 12.669,23.928 -13.884,21.943 c -14.428,22.8 -14.491,22.913 -13.122,23.068 19.4,2.204 43.033,14.922 57.423,30.902 3.408,3.784 8.116,9.746 7.878,9.977 -0.073,0.071 -6.509,4.284 -14.301,9.361 -17.086,11.133 -15.383,9.638 -13.742,12.055 0.732,1.078 2.138,3.391 3.123,5.141 l 1.792,3.181 14.664,-9.587 c 8.065,-5.273 14.785,-9.596 14.933,-9.606 0.693,-0.047 5.446,11.386 7.352,17.685 7.665,25.326 4.313,54.744 -8.764,76.923 l -1.03,1.747 11.886,22.238 11.886,22.238 26.2,1.443 c 14.41,0.794 26.716,1.466 27.347,1.492 1.432,0.062 2.783,-2.084 8.469,-13.451 32.262,-64.5 25.089,-142.565 -18.375,-199.967 C 320.753,43.001 275.09,16.577 223.571,10.005 217.957,9.289 217,9.219 217,9.53 m 84.6,79.607 c 2.817,1.472 4.649,5.276 2.741,5.695 -1.182,0.259 -1.674,0.017 -1.674,-0.826 0,-1.659 -2.437,-3.297 -3.645,-2.45 -0.933,0.653 -0.868,1.442 0.311,3.777 2.277,4.51 -0.453,8.446 -4.85,6.995 -3.426,-1.131 -6.063,-6.661 -3.176,-6.661 0.862,0 1.04,0.163 1.332,1.218 0.751,2.724 3.4,4.05 4.558,2.283 0.522,-0.797 0.494,-0.939 -0.659,-3.368 -1.348,-2.838 -1.428,-3.401 -0.688,-4.831 1.034,-2.001 3.762,-2.87 5.75,-1.832 m 5.759,11.954 c 2.977,2.006 3.462,5.017 1.208,7.492 -0.995,1.093 -1.189,0.998 -3.567,-1.75 -2.49,-2.877 -2.535,-2.895 -3.195,-1.318 -0.658,1.575 -0.122,2.705 1.78,3.755 1.061,0.585 1.415,0.982 1.415,1.588 0,2.107 -4.186,-0.019 -5.388,-2.737 -2.021,-4.569 3.698,-9.759 7.747,-7.03 m -2.924,1.839 c -0.275,0.175 0.104,0.821 1.22,2.079 l 1.618,1.824 0.355,-0.916 c 0.781,-2.016 -1.446,-4.098 -3.193,-2.987 m 9.559,5.892 c 0.339,0.634 0.35,0.93 0.047,1.295 -0.319,0.385 -0.219,0.516 0.533,0.703 2.143,0.531 2.95,2.093 1.555,3.008 -0.857,0.561 -0.888,0.553 -1.85,-0.5 -1.306,-1.431 -2.285,-1.217 -5.331,1.167 -2.746,2.149 -2.616,2.117 -3.547,0.858 l -0.725,-0.98 4.079,-3.163 c 4.526,-3.511 4.616,-3.552 5.239,-2.388 m 4.801,6 c 0.794,1.211 0.741,1.349 -1.759,4.676 l -2.298,3.057 3.214,-0.768 c 4.286,-1.024 4.774,-1.007 5.481,0.189 0.692,1.173 1.154,0.974 -5.1,2.191 -2.475,0.481 -4.748,0.946 -5.051,1.033 -0.348,0.1 -0.819,-0.216 -1.274,-0.855 l -0.721,-1.013 3.273,-4.662 c 3.6,-5.128 3.473,-5.012 4.235,-3.848 m 10.681,8.368 c 0.655,0.655 0.678,1.934 0.044,2.46 -0.833,0.692 -2.303,0.292 -2.658,-0.723 -0.579,-1.655 1.389,-2.962 2.614,-1.737 m -3.716,2.857 c 0.327,0.574 0.552,1.078 0.5,1.12 -0.375,0.31 -9.034,5.166 -9.207,5.164 -0.547,-0.005 -1.425,-2.116 -0.988,-2.377 8.828,-5.273 8.901,-5.302 9.695,-3.907 m 2.573,5.918 c 2.288,1.64 3.259,6.035 1.334,6.035 -0.893,0 -1,-0.109 -1,-1.017 0,-2.709 -1.852,-3.857 -4.401,-2.727 -3.029,1.343 -3.346,4.551 -0.542,5.485 0.589,0.197 0.031,1.926 -0.621,1.926 -0.98,0 -3.345,-2.807 -3.591,-4.261 -0.716,-4.239 5.312,-7.957 8.821,-5.441 m 3.455,9.161 c 3.312,1.384 4.09,5.408 1.538,7.96 -1.966,1.966 -2.541,1.708 -3.919,-1.753 -1.409,-3.539 -1.488,-3.616 -2.588,-2.516 -1.169,1.169 -0.967,2.821 0.533,4.369 0.892,0.92 0.989,1.178 0.667,1.778 -1.142,2.134 -4.816,-2.761 -4.195,-5.589 0.737,-3.355 4.851,-5.55 7.964,-4.249 m -2.027,2.624 c 0.091,0.229 0.43,1.092 0.753,1.917 0.801,2.048 0.976,2.177 1.815,1.337 0.807,-0.807 0.712,-2.031 -0.24,-3.087 -0.611,-0.679 -2.588,-0.82 -2.328,-0.167 m 13.873,13.5 c 1.111,4.261 1.366,5.461 1.366,6.426 0,7.218 -9.836,10.287 -13.837,4.317 -0.905,-1.35 -2.895,-8.126 -2.472,-8.417 0.194,-0.134 13.706,-3.502 14.213,-3.543 0.222,-0.018 0.55,0.53 0.73,1.217 m -6.967,3.358 c -5.744,1.359 -5.198,0.983 -4.696,3.227 0.779,3.479 2.937,4.923 6.249,4.182 3.408,-0.762 4.85,-2.912 4.101,-6.113 -0.614,-2.625 -0.323,-2.558 -5.654,-1.296 m 3.909,13.047 c 4.126,1.872 3.608,8.384 -0.731,9.198 -1.636,0.307 -1.725,0.165 -2.194,-3.516 -0.464,-3.641 -0.662,-3.869 -2.2,-2.546 -1.131,0.973 -1.191,2.64 -0.154,4.317 0.862,1.395 -0.031,2.803 -1.177,1.855 -4.922,-4.074 0.564,-11.983 6.456,-9.308 m -1.415,4.262 c 0.276,2.611 0.242,2.545 1.166,2.252 1.595,-0.507 1.461,-3.37 -0.193,-4.123 -1.232,-0.561 -1.231,-0.562 -0.973,1.871 m -3.325,8.732 c -0.552,2.167 -0.554,2.919 -0.01,3.463 0.872,0.872 1.706,0.173 2.188,-1.835 0.78,-3.254 3.294,-4.354 5.32,-2.327 1.571,1.57 1.65,5.693 0.121,6.28 -0.878,0.337 -1.535,-0.643 -1.135,-1.694 0.482,-1.269 0.433,-2.068 -0.163,-2.665 -0.813,-0.812 -1.42,-0.284 -2.004,1.742 -0.705,2.447 -1.576,3.387 -3.137,3.387 -2.948,0 -4.502,-3.271 -3.154,-6.64 0.654,-1.636 2.399,-1.381 1.974,0.289 M 349,195.333 c 0.803,0.803 0.816,0.973 0.148,1.926 -0.869,1.241 -3.148,0.517 -3.148,-1 0,-0.452 1.313,-1.592 1.833,-1.592 0.275,0 0.8,0.3 1.167,0.666 m -4.333,0.965 c 0,1.682 -0.07,1.702 -5.861,1.702 H 334 v -1.324 -1.324 l 4.583,-0.103 c 2.521,-0.056 4.921,-0.136 5.334,-0.176 0.662,-0.064 0.75,0.079 0.75,1.225 m -10.181,4.218 c 0.477,0.515 0.873,0.712 1.004,0.5 0.355,-0.573 1.697,-0.397 2.335,0.308 0.591,0.654 0.598,0.654 1.43,0 2.532,-1.993 5.594,0.031 5.279,3.489 -0.532,5.837 -0.546,5.899 -1.316,5.789 -0.45,-0.064 -0.758,-0.382 -0.825,-0.852 -0.089,-0.629 -0.312,-0.75 -1.387,-0.75 -2.047,0 -3.866,-2.816 -3.191,-4.943 0.228,-0.717 -0.358,-1.32 -0.819,-0.845 -0.154,0.159 -0.433,1.413 -0.621,2.788 -0.615,4.512 -3.991,5.424 -5.818,1.572 -1.936,-4.079 1.301,-9.892 3.929,-7.056 m -1.967,2.225 c -0.966,1.378 -0.498,4.592 0.668,4.592 0.991,0 1.659,-3.814 0.841,-4.8 -0.593,-0.714 -0.892,-0.672 -1.509,0.208 m 7.685,0.69 c -0.729,0.534 -0.623,2.511 0.161,3.001 1.58,0.989 3.206,-1.011 2.143,-2.634 -0.582,-0.887 -1.412,-1.019 -2.304,-0.367 m -1.964,8.742 c 6.075,0.856 5.76,0.766 5.76,1.657 0,0.446 -0.325,1.026 -0.736,1.315 -0.576,0.403 -0.649,0.603 -0.334,0.919 0.747,0.746 0.493,3.445 -0.426,4.538 -1.13,1.342 -2.036,1.456 -6.592,0.829 l -3.922,-0.539 0.216,-1.196 c 0.283,-1.571 0.034,-1.492 3.263,-1.034 5.306,0.753 5.854,0.613 5.854,-1.495 0,-1.693 -0.331,-1.873 -4.448,-2.419 -3.655,-0.485 -3.875,-0.557 -3.875,-1.27 0,-2.018 0.065,-2.034 5.24,-1.305"
       id="path1" />
    <path
       fill-rule="evenodd"
       fill="#ebeaea"
       stroke="none"
       d="m 160.872,58.011 c -0.687,0.603 -1.238,0.872 -1.365,0.667 -0.312,-0.505 -1.832,-0.421 -2.037,0.112 -0.178,0.465 2.1,9.5 2.513,9.964 0.248,0.28 2.357,-0.354 2.339,-0.703 -0.007,-0.12 -0.443,-1.78 -0.968,-3.69 -1.033,-3.748 -0.97,-4.307 0.56,-5.004 1.88,-0.856 2.439,-0.182 3.609,4.344 l 0.913,3.535 1.248,-0.316 1.247,-0.317 -0.954,-3.635 c -1.611,-6.142 -3.921,-7.753 -7.105,-4.957 m -23.015,2.846 c -1.058,1.059 -0.45,2.81 0.976,2.81 0.958,0 1.5,-0.623 1.5,-1.722 0,-1.411 -1.495,-2.068 -2.476,-1.088 m 10.816,0.893 c -6.019,3.076 -1.778,12.288 4.555,9.895 4.362,-1.648 4.286,-8.006 -0.123,-10.271 -1.139,-0.585 -2.831,-0.442 -4.432,0.376 m 3.377,1.61 c 0.825,0.442 1.933,2.79 1.943,4.119 0.016,2.202 -2.758,3.359 -4.246,1.771 -2.778,-2.965 -0.953,-7.632 2.303,-5.89 m -19.885,1.767 c -0.562,0.411 -0.59,0.63 -0.264,2.056 0.329,1.437 0.3,1.65 -0.288,2.127 -0.908,0.735 -0.492,1.816 0.593,1.543 0.712,-0.179 0.932,0.101 2.437,3.099 1.689,3.366 2.035,3.715 3.692,3.715 0.954,0 2.998,-1.416 2.998,-2.077 0,-0.784 -1.134,-1.235 -1.737,-0.691 -0.314,0.283 -0.797,0.429 -1.072,0.323 -0.4,-0.153 -3.191,-5.125 -3.191,-5.683 0,-0.198 4.407,-2.243 4.542,-2.108 0.06,0.06 0.876,1.75 1.814,3.755 0.938,2.006 1.762,3.705 1.831,3.776 0.235,0.24 2.147,-0.708 2.147,-1.065 0,-0.279 -3.847,-8.64 -4.233,-9.199 -0.051,-0.074 -1.607,0.576 -3.456,1.446 -1.85,0.87 -3.408,1.531 -3.463,1.469 -0.055,-0.062 -0.421,-0.751 -0.814,-1.53 -0.818,-1.621 -0.715,-1.557 -1.536,-0.956 m -7.378,7.61 c -1.34,0.952 -2.584,2.775 -2.336,3.423 0.319,0.83 1.453,0.577 2.216,-0.494 1.3,-1.826 2.907,-2.085 3.703,-0.597 0.324,0.605 0.18,0.851 -1.176,2.01 -2.521,2.156 -3.081,3.794 -1.836,5.376 1.311,1.668 4.7,0.82 5.622,-1.407 0.36,-0.87 0.526,-0.979 1.057,-0.695 0.593,0.317 1.963,-0.072 1.963,-0.557 0,-0.539 -3.893,-6.593 -4.595,-7.145 -1.144,-0.9 -3.287,-0.86 -4.618,0.086 m -6.429,4.141 c -0.38,0.483 -0.691,1.257 -0.691,1.719 0,0.806 -0.026,0.817 -0.639,0.262 -0.6,-0.543 -0.69,-0.544 -1.495,-0.017 l -0.856,0.561 3.028,4.451 3.028,4.45 0.967,-0.715 c 1.192,-0.881 1.292,-0.454 -0.867,-3.678 -2.145,-3.204 -2.292,-4.17 -0.813,-5.328 0.937,-0.733 0.987,-0.87 0.613,-1.69 -0.516,-1.134 -1.391,-1.139 -2.275,-0.015 m 11.893,1.241 c 0.703,1.543 -1.511,3.91 -2.719,2.907 -0.836,-0.693 -0.631,-1.537 0.646,-2.658 1.414,-1.242 1.61,-1.265 2.073,-0.249 m -20.493,5.245 c -4.35,2.154 -3.452,8.365 1.443,9.981 2.735,0.902 6.799,-1.884 6.799,-4.662 0,-1.19 -1.535,-0.895 -2.156,0.415 -0.916,1.929 -2.988,2.731 -4.436,1.716 -1.075,-0.752 -0.991,-0.897 1.743,-3.037 2.677,-2.094 2.924,-2.611 1.766,-3.697 -1.612,-1.509 -3.13,-1.72 -5.159,-0.716 m 2.941,1.842 c 0.387,0.466 0.314,0.649 -0.542,1.35 -2.401,1.966 -2.738,2.147 -2.955,1.581 -0.84,-2.188 2.082,-4.637 3.497,-2.931 m 185.134,3.981 c -2.455,1.241 -2.825,3.364 -1.153,6.623 1.233,2.405 1.178,3.511 -0.208,4.142 -1.515,0.691 -2.961,-0.499 -4.095,-3.369 -0.775,-1.959 -2.692,-0.947 -2.079,1.098 1.308,4.365 6.249,6.117 8.952,3.175 1.374,-1.496 1.392,-2.597 0.083,-5.189 -1.24,-2.458 -1.309,-3.874 -0.213,-4.373 1.207,-0.55 2.642,0.356 3.519,2.222 0.52,1.107 0.87,1.488 1.237,1.347 0.282,-0.108 0.65,-0.196 0.818,-0.196 0.465,0 0.366,-1.585 -0.162,-2.6 -1.366,-2.624 -4.521,-3.981 -6.699,-2.88 m -197.834,2.43 c -0.523,0.522 -1.051,1.489 -1.175,2.148 -0.201,1.073 -0.29,1.158 -0.854,0.806 -0.521,-0.326 -0.754,-0.268 -1.355,0.333 l -0.726,0.725 4.024,4.269 c 2.213,2.348 4.459,4.682 4.992,5.187 l 0.968,0.918 0.895,-0.934 0.894,-0.934 -1.486,-1.459 -1.487,-1.46 1.253,-0.56 c 2.562,-1.147 3.247,-3.97 1.633,-6.725 -1.852,-3.159 -5.589,-4.301 -7.576,-2.314 m 4.206,2.461 c 1.316,1.156 2.293,3.03 1.923,3.687 -1.356,2.402 -2.597,2.429 -4.588,0.099 -2.875,-3.367 -0.577,-6.632 2.665,-3.786 m -15.276,3.974 c -4.647,1.283 -6.992,7.148 -4.512,11.284 3.291,5.488 10.737,5.226 13.659,-0.48 2.839,-5.543 -3.041,-12.489 -9.147,-10.804 m 3.332,2.799 c 4.2,1.755 5.315,5.947 2.324,8.74 -4.237,3.957 -11.404,-2.856 -7.672,-7.292 1.557,-1.85 3.273,-2.314 5.348,-1.448 m 210.741,0.013 c -5.019,2.177 -4.656,9.372 0.54,10.676 1.607,0.404 2.001,-1.234 0.451,-1.876 -2.297,-0.952 -3.256,-3.216 -1.996,-4.71 l 0.665,-0.787 2.419,2.581 c 2.716,2.897 3.05,2.943 4.255,0.581 1.974,-3.871 -2.286,-8.22 -6.334,-6.465 m 4.307,2.681 c 0.816,1.037 0.892,2.206 0.183,2.795 -0.279,0.232 -0.554,0.363 -0.61,0.291 -0.056,-0.072 -0.74,-0.837 -1.521,-1.7 -1.572,-1.738 -1.541,-2.264 0.134,-2.264 0.816,0 1.312,0.24 1.814,0.878 m 1.778,7.554 c -4.542,3.429 -4.334,3.163 -3.398,4.354 l 0.689,0.876 2.625,-1.998 c 3.1,-2.36 4.22,-2.571 5.374,-1.01 0.719,0.972 0.744,0.979 1.676,0.428 1.512,-0.893 0.326,-2.749 -1.756,-2.749 -1.013,0 -1.039,-0.031 -0.515,-0.61 0.703,-0.777 0.695,-1.157 -0.04,-1.822 -0.553,-0.5 -0.864,-0.331 -4.655,2.531 m 8.169,3.954 c -5.353,7.238 -5.937,8.344 -4.999,9.473 l 0.576,0.692 5.569,-1.162 5.568,-1.162 -0.674,-0.947 c -0.82,-1.151 -0.835,-1.151 -5.032,-0.112 -3.77,0.932 -4.079,0.887 -2.877,-0.422 3.409,-3.711 4.177,-5.223 3.318,-6.527 l -0.625,-0.947 -0.824,1.114 M 77.77,118.359 c -1.111,0.711 -2.437,3.011 -2.437,4.225 0,4.114 5.934,7.112 8.989,4.541 2.043,-1.719 3.298,-6.125 1.745,-6.125 -0.86,0 -1.4,0.659 -1.4,1.708 0,1.496 -1.488,2.959 -3.01,2.959 -1.885,0 -1.887,-0.41 -0.017,-3.356 2.013,-3.17 2.037,-3.357 0.515,-4.083 -1.565,-0.746 -3.087,-0.701 -4.385,0.131 m 2.857,1.609 c 0.367,0.233 0.203,0.706 -0.819,2.363 l -1.279,2.072 -0.598,-0.739 c -1.514,-1.869 0.727,-4.942 2.696,-3.696 m 247.152,3.05 c -1.073,0.405 -1.324,1.585 -0.511,2.398 1.211,1.211 3.062,0.149 2.55,-1.463 -0.269,-0.849 -1.172,-1.263 -2.039,-0.935 m -7.514,4.591 -4.569,2.597 0.661,1.086 0.66,1.085 1.075,-0.643 c 0.591,-0.353 2.612,-1.504 4.491,-2.557 3.583,-2.007 3.757,-2.218 2.826,-3.421 l -0.576,-0.744 -4.568,2.597 M 72.661,127.078 c -3.55,2.392 -3.225,6.976 0.639,8.994 4.043,2.112 7.696,0.05 7.699,-4.345 0.001,-2.389 -1.37,-2.53 -1.684,-0.173 -0.428,3.204 -3.332,3.921 -5.955,1.471 -1.381,-1.29 -1.39,-2.713 -0.027,-4.076 1.035,-1.035 1.181,-1.482 0.721,-2.206 -0.206,-0.325 -0.529,-0.248 -1.393,0.335 m 249.975,5.03 c -3.815,2.012 -4.034,6.857 -0.406,8.975 1.791,1.047 2.249,-0.343 0.619,-1.88 -1.492,-1.407 -1.579,-2.7 -0.266,-3.953 2.681,-2.557 5.641,-1.982 6.063,1.179 0.298,2.235 1.863,2.109 1.835,-0.148 -0.049,-4.035 -4.061,-6.169 -7.845,-4.173 m -259.992,3.267 c -0.6,1.122 0.092,2.292 1.356,2.292 1.264,0 1.956,-1.17 1.356,-2.292 -0.518,-0.968 -2.194,-0.968 -2.712,0 m 4.31,1.948 c -0.19,0.545 -0.34,1.086 -0.334,1.204 0.012,0.21 7.712,3.883 8.99,4.288 0.596,0.19 1.118,-0.642 1.205,-1.921 0.014,-0.215 -8.943,-4.561 -9.401,-4.561 -0.063,0 -0.271,0.446 -0.46,0.99 m 261.003,3.862 c -3.472,1.077 -4.948,4.565 -3.3,7.797 0.623,1.221 2.103,2.685 2.715,2.685 0.593,0 0.741,-1.744 0.175,-2.061 -1.543,-0.863 -1.999,-3.732 -0.776,-4.881 1.184,-1.112 1.359,-0.955 2.703,2.442 1.339,3.382 1.387,3.427 2.846,2.673 5.251,-2.715 1.362,-10.431 -4.363,-8.655 m -262.936,0.442 c -0.724,1.353 -0.386,1.957 2.478,4.429 l 2.832,2.444 -4.028,0.167 -4.028,0.166 -0.455,1.084 -0.454,1.083 h 5.784 5.785 l 0.368,-1.055 c 0.439,-1.26 0.605,-1.045 -4.365,-5.667 -3.279,-3.049 -3.591,-3.26 -3.917,-2.651 m 266.418,1.761 c 1.574,0.838 2.04,2.531 1.009,3.669 -0.837,0.926 -1.081,0.769 -1.983,-1.272 -1.113,-2.516 -0.782,-3.332 0.974,-2.397 m -134.665,1.675 c -2.158,1.043 -1.646,3.594 0.891,4.436 1.535,0.51 1.696,0.656 1.604,1.451 -0.118,1.02 -1.397,1.362 -2.628,0.703 -0.695,-0.372 -1.285,-0.038 -1.303,0.738 -0.01,0.441 2.35,0.991 3.329,0.776 2.665,-0.586 2.632,-4.834 -0.038,-4.834 -0.305,0 -0.904,-0.282 -1.331,-0.628 -1.137,-0.921 -0.352,-1.791 1.481,-1.644 1.578,0.126 2.046,-0.557 0.726,-1.059 -1.083,-0.412 -1.786,-0.396 -2.731,0.061 m 5.7,1.019 c -0.131,0.412 -0.478,0.946 -0.773,1.188 -0.398,0.326 -0.428,0.483 -0.118,0.612 0.276,0.115 0.417,0.947 0.417,2.467 0,2.479 0.567,3.272 2.013,2.814 0.855,-0.272 0.846,-1.163 -0.013,-1.163 -0.586,0 -0.667,-0.222 -0.667,-1.833 0,-1.734 0.046,-1.834 0.834,-1.834 0.518,0 0.833,-0.189 0.833,-0.5 0,-0.277 -0.296,-0.5 -0.667,-0.5 -0.518,0 -0.666,-0.222 -0.666,-1 0,-1.198 -0.837,-1.374 -1.193,-0.251 m 4.186,1.668 c -0.004,0.046 -0.207,1.313 -0.451,2.816 -0.392,2.412 -0.385,2.756 0.063,2.928 0.629,0.242 1.05,-0.378 1.056,-1.556 0.009,-1.606 0.564,-2.549 1.569,-2.664 1.206,-0.139 1.528,-1.274 0.361,-1.274 -0.435,0 -0.971,0.18 -1.191,0.4 -0.311,0.311 -0.4,0.274 -0.4,-0.167 0,-0.429 -0.974,-0.896 -1.007,-0.483 m -19.222,0.919 c -2.459,0.991 -1.407,5.664 1.275,5.664 1.082,0 2.954,-0.838 2.954,-1.322 0,-0.612 -0.724,-0.729 -1.298,-0.21 -0.697,0.631 -1.744,0.691 -2.302,0.132 -0.782,-0.781 -0.383,-1.223 1.447,-1.603 1.668,-0.346 1.827,-0.453 1.638,-1.107 -0.458,-1.578 -2.025,-2.234 -3.714,-1.554 M 218,149.333 c -0.196,0.367 -0.568,0.667 -0.825,0.667 -0.658,0 -1.011,0.689 -0.512,0.998 0.32,0.198 0.254,0.686 -0.291,2.141 -0.901,2.41 -0.618,3.194 1.152,3.194 0.939,0 1.063,-0.491 0.241,-0.951 -1.017,-0.569 0.154,-3.58 1.342,-3.453 1.068,0.115 1.257,-0.756 0.223,-1.026 -0.562,-0.147 -0.619,-0.309 -0.355,-1.005 0.49,-1.289 -0.333,-1.765 -0.975,-0.565 m -7,0.147 c 0,0.314 0.432,0.516 1.25,0.583 2.171,0.18 2.006,1.604 -0.186,1.604 -1.894,0 -2.582,0.554 -2.263,1.824 0.22,0.876 1.44,1.41 2.39,1.046 0.289,-0.111 0.759,0.032 1.046,0.319 0.657,0.657 0.912,0.365 1.384,-1.587 0.53,-2.187 0.474,-3.079 -0.231,-3.717 -0.785,-0.711 -3.39,-0.766 -3.39,-0.072 m -21.358,0.324 c 0.451,0.543 0.266,0.697 -1.225,1.017 -0.811,0.174 -1.084,0.116 -1.084,-0.228 0,-1.129 1.579,-1.669 2.309,-0.789 m -13.252,0.586 c 0.073,0.518 0.332,0.777 0.777,0.777 0.992,0 0.893,-1.302 -0.11,-1.444 -0.647,-0.091 -0.759,0.021 -0.667,0.667 m 5.743,-0.247 c -2.541,1.106 -1.675,5.515 1.099,5.594 1.072,0.03 2.768,-0.822 2.768,-1.392 0,-0.6 -0.76,-0.762 -1.06,-0.225 -0.771,1.376 -2.94,0.149 -2.94,-1.663 0,-1.181 0.527,-1.79 1.547,-1.79 0.919,0 1.306,-0.524 0.59,-0.799 -0.693,-0.266 -0.795,-0.252 -2.004,0.275 m -4.215,1.94 c -0.703,0.539 1.483,5.665 2.285,5.357 0.678,-0.26 0.585,-0.754 -0.638,-3.396 -0.966,-2.085 -1.169,-2.327 -1.647,-1.961 m -117.316,0.759 c -0.308,0.677 -0.275,1.07 0.168,2 0.55,1.152 0.548,1.158 -0.239,1.158 -0.885,0 -1.557,1.572 -0.858,2.004 0.716,0.442 9.696,3.071 9.877,2.891 0.099,-0.099 0.203,-0.668 0.232,-1.263 l 0.051,-1.082 -3.084,-0.955 c -3.628,-1.123 -4.412,-1.886 -3.841,-3.745 0.311,-1.015 0.27,-1.147 -0.465,-1.482 -1.165,-0.531 -1.412,-0.467 -1.841,0.474 m 152.731,-0.049 c 0,0.716 -0.897,1.284 -1.65,1.045 -0.671,-0.212 -0.898,-0.845 -0.461,-1.282 0.425,-0.425 2.111,-0.235 2.111,0.237 m 7.347,0.476 c -1.964,1.963 -0.967,5.051 1.672,5.179 0.603,0.029 1.141,-0.131 1.224,-0.365 0.092,-0.263 -0.17,-0.416 -0.715,-0.416 -1.414,0 -2.839,-1.896 -1.873,-2.493 0.176,-0.109 1.058,0.176 1.959,0.632 1.873,0.95 2.053,0.878 2.053,-0.81 0,-2.407 -2.6,-3.447 -4.32,-1.727 m -45.567,0.25 c -0.109,0.285 -0.056,1.407 0.119,2.492 0.352,2.188 0.455,2.175 -1.827,0.247 -0.602,-0.508 -1.306,-0.925 -1.564,-0.925 -1.119,0 -0.683,0.72 1.513,2.493 3.01,2.433 3.489,2.331 3.181,-0.676 -0.401,-3.918 -0.861,-5.092 -1.422,-3.631 m 48.487,0.214 c 1.193,1.194 0.289,1.905 -1.347,1.059 -0.993,-0.514 -1.014,-0.565 -0.419,-1 0.771,-0.564 1.245,-0.58 1.766,-0.059 m 3.15,2.108 c -0.412,0.291 -0.75,0.861 -0.75,1.264 0,0.404 -0.306,0.926 -0.68,1.159 -0.373,0.233 -0.6,0.553 -0.503,0.709 0.096,0.156 -0.122,0.362 -0.486,0.457 -2.166,0.567 -0.099,3.903 2.419,3.903 0.819,0 1.917,-0.907 1.917,-1.583 0,-0.201 -0.61,-0.887 -1.355,-1.524 -1.488,-1.274 -1.294,-1.9 0.305,-0.983 0.972,0.558 1.043,0.554 1.946,-0.104 0.515,-0.376 1.203,-0.783 1.529,-0.904 0.509,-0.19 0.413,-0.383 -0.681,-1.371 -1.577,-1.425 -2.664,-1.729 -3.661,-1.023 m -56.833,0.532 c -0.321,0.18 -0.584,0.628 -0.584,0.997 0,0.382 -0.15,0.577 -0.349,0.453 -0.192,-0.118 -0.576,-0.128 -0.854,-0.022 -0.575,0.221 2.372,4.836 3.1,4.855 0.866,0.023 0.794,-0.78 -0.193,-2.155 -1.18,-1.642 -1.251,-2.045 -0.507,-2.867 0.701,-0.775 0.234,-1.735 -0.613,-1.261 m 166.159,1.451 c -3.899,0.96 -7.158,1.813 -7.241,1.896 -0.21,0.211 1.044,5.344 1.676,6.86 2.625,6.294 12.118,5.739 14.025,-0.821 0.458,-1.576 -0.55,-9.008 -1.306,-9.629 -0.035,-0.028 -3.254,0.734 -7.154,1.694 m -106.951,-0.747 c 0.28,0.444 0.236,0.704 -0.188,1.129 -0.999,0.999 -2.489,-0.306 -1.588,-1.391 0.518,-0.625 1.29,-0.511 1.776,0.262 m 4.958,-0.167 c -0.229,0.08 -0.416,0.443 -0.416,0.808 0,0.824 1.437,0.741 1.596,-0.093 0.111,-0.581 -0.501,-0.952 -1.18,-0.715 M 231,160.833 c -1.538,1.933 -1.701,2.276 -1.279,2.697 0.421,0.422 0.707,0.202 2.251,-1.724 1.556,-1.942 1.71,-2.267 1.28,-2.697 -0.431,-0.431 -0.703,-0.223 -2.252,1.724 m -36.167,-1.118 c -27.747,3.537 -43.755,33.882 -31.134,59.019 14.871,29.619 57.51,29.838 72.728,0.372 15.114,-29.263 -8.904,-63.558 -41.594,-59.391 m 147.443,1.31 c 1.208,5.232 -3.117,8.997 -7.789,6.78 -1.411,-0.67 -3.845,-5.441 -3.057,-5.992 0.188,-0.132 9.474,-2.421 9.929,-2.448 0.368,-0.022 0.644,0.478 0.917,1.66 m -178.007,-0.012 c -1.669,1.669 -0.581,4.342 1.974,4.853 1.638,0.327 4.392,-2.607 2.903,-3.093 -0.172,-0.056 -0.568,0.347 -0.88,0.896 -0.392,0.688 -0.825,0.998 -1.397,0.998 -1.429,0 -1.387,-0.698 0.127,-2.111 l 1.435,-1.338 -0.753,-0.609 c -1.101,-0.892 -2.25,-0.755 -3.409,0.404 m 62.201,-0.233 c 0.947,0.757 0.975,1.553 0.055,1.553 -0.904,0 -2.245,-1.368 -1.83,-1.867 0.513,-0.618 0.639,-0.595 1.775,0.314 m -59.977,0.43 c 0.47,0.18 0.417,0.347 -0.368,1.167 -1.108,1.157 -1.458,1.202 -1.458,0.19 0,-1.232 0.733,-1.776 1.826,-1.357 m 67.592,0.466 c -0.848,0.341 -2.082,2.181 -2.084,3.107 -0.001,0.756 2.064,2.884 2.799,2.884 0.869,0 0.605,-0.791 -0.469,-1.401 -0.688,-0.392 -0.998,-0.825 -0.998,-1.397 0,-1.338 0.642,-1.362 1.961,-0.074 1.465,1.43 1.806,1.483 2.319,0.356 1.049,-2.303 -1.122,-4.442 -3.528,-3.475 m -174.963,0.63 c -5.254,3.204 -0.152,11.118 5.721,8.875 2.601,-0.994 4.268,-5.6 2.757,-7.616 -0.894,-1.192 -1.587,-0.377 -1.506,1.772 0.09,2.413 -0.828,3.663 -2.691,3.663 -1.027,0 -1.126,-0.079 -0.949,-0.75 0.731,-2.759 1.252,-5.666 1.091,-6.087 -0.284,-0.741 -3.125,-0.649 -4.423,0.143 m 177.354,0.551 c 0.288,0.288 0.524,0.729 0.524,0.98 0,0.888 -0.747,0.901 -1.618,0.027 -0.746,-0.748 -0.805,-0.933 -0.382,-1.203 0.684,-0.434 0.871,-0.409 1.476,0.196 m -77.347,0.154 c -0.387,0.147 -1.024,0.675 -1.416,1.173 -1.968,2.502 0.724,4.957 3.454,3.149 1.262,-0.836 1.719,-0.836 2.166,0 0.474,0.885 -0.083,1.925 -1.176,2.199 -0.81,0.203 -1.218,1.468 -0.474,1.468 2.373,0 3.924,-3.431 2.254,-4.987 -0.931,-0.867 -1.663,-0.857 -3.23,0.045 -0.711,0.409 -1.501,0.631 -1.816,0.51 -0.906,-0.348 -0.664,-1.538 0.44,-2.167 1.461,-0.831 1.297,-1.957 -0.202,-1.39 m -97.388,0.841 c 0.159,0.16 -0.439,3.016 -0.931,4.448 -0.29,0.841 -1.811,-0.936 -1.805,-2.108 0.008,-1.635 1.858,-3.217 2.736,-2.34 m 176.745,2.617 c -0.574,0.42 -0.601,0.617 -0.256,1.908 0.57,2.136 -0.576,2.959 -1.332,0.956 -0.417,-1.105 -1.231,-1.355 -1.231,-0.378 0,1.577 2.084,3.047 3.355,2.367 0.643,-0.345 0.692,-0.562 0.489,-2.186 -0.253,-2.018 0.474,-2.597 1.216,-0.969 0.408,0.895 1.273,1.139 1.273,0.359 0,-1.592 -2.304,-2.941 -3.514,-2.057 m -186.242,6.464 c -3.06,3.492 -1.519,9.067 2.505,9.067 1.89,0 2.986,-0.826 4.133,-3.116 1.124,-2.243 1.718,-2.884 2.67,-2.884 2.207,0 2.718,2.816 0.935,5.154 l -0.916,1.201 0.772,0.822 c 1.92,2.043 4.47,-3.744 3.057,-6.937 -1.822,-4.119 -5.982,-3.902 -8.258,0.43 -1.231,2.343 -2.098,3.007 -3.313,2.541 -1.226,-0.47 -1.219,-3.529 0.01,-4.549 0.711,-0.59 0.611,-1.176 -0.302,-1.774 -0.729,-0.477 -0.839,-0.474 -1.293,0.045 m 283.423,0.756 c -3.139,1.315 -4.099,4.746 -2.253,8.046 1.361,2.431 2.883,1.625 1.638,-0.869 -1.162,-2.327 -0.317,-4.866 1.62,-4.866 0.537,0 1.312,3.254 1.333,5.597 0.017,1.85 2.508,1.592 4.298,-0.447 3.409,-3.882 -1.637,-9.555 -6.636,-7.461 m 5.181,2.796 c 1.29,1.289 0.837,3.504 -0.804,3.934 -0.563,0.147 -0.672,-0.068 -0.864,-1.709 -0.121,-1.032 -0.296,-2.139 -0.389,-2.46 -0.259,-0.894 1.082,-0.74 2.057,0.235 m -1.293,9.231 c -0.497,0.435 -1.154,1.587 -1.475,2.585 -1.349,4.192 -3.216,2.804 -2.363,-1.755 0.375,-2.002 -1.604,-1.363 -2.06,0.665 -1.229,5.471 4.506,8.068 6.202,2.809 1.182,-3.662 3.079,-3.655 2.664,0.01 -0.177,1.566 -0.121,1.925 0.328,2.097 0.792,0.304 1.026,0.049 1.431,-1.561 0.952,-3.783 -2.225,-7.042 -4.727,-4.85 M 179.333,200 v 12.333 H 177 174.667 V 200 187.667 H 177 179.333 V 200 M 202,189.5 v 1.833 h -3.667 -3.666 v 10.5 10.5 h -2.5 -2.5 v -10.5 -10.5 H 186 182.333 v -1.833 -1.833 h 9.834 9.833 v 1.833 m 7.667,10.5 v 12.333 H 207.333 205 V 200 187.667 h 2.333 2.334 V 200 m 10,-1.833 v 10.5 h 4.833 4.833 v 1.833 1.833 H 222.167 215 V 200 187.667 h 2.333 2.334 v 10.5 m 127.401,-2.977 c -1.306,0.915 -0.772,2.81 0.791,2.81 1.535,0 1.968,-1.988 0.626,-2.874 -0.581,-0.383 -0.792,-0.374 -1.417,0.064 M 334,196.717 v 1.384 l 3.552,-0.217 c 1.953,-0.12 4.353,-0.217 5.333,-0.217 h 1.782 V 196.5 195.333 H 339.333 334 v 1.384 m -2.629,3.986 c -2.603,2.794 -1.004,8.964 2.323,8.964 1.657,0 2.181,-0.764 2.612,-3.81 0.517,-3.652 1.513,-3.922 1.762,-0.479 0.176,2.434 1.186,3.622 3.078,3.622 0.829,0 1.154,0.168 1.284,0.667 0.403,1.542 1.474,0.771 1.736,-1.25 0.835,-6.451 -1.278,-9.689 -4.612,-7.067 l -0.869,0.684 -0.969,-0.717 c -0.813,-0.601 -1.088,-0.653 -1.707,-0.322 -0.622,0.333 -0.855,0.286 -1.479,-0.3 -0.949,-0.892 -2.324,-0.888 -3.159,0.008 m 2.945,1.776 c 0.369,0.445 0.269,2.573 -0.2,4.271 -0.203,0.734 -1.637,0.776 -1.914,0.056 -1.007,-2.625 0.673,-6.064 2.114,-4.327 m 8.16,1.045 c 1.151,1.151 0.309,3.226 -1.309,3.226 -0.532,0 -1.143,-0.266 -1.391,-0.605 -1.346,-1.842 1.103,-4.219 2.7,-2.621 m -9.229,9.204 c -0.23,1.512 -0.388,1.431 3.75,1.923 3.529,0.42 3.722,0.484 4.185,1.378 1.634,3.16 -0.592,3.842 -7.932,2.428 -0.873,-0.168 -0.917,-0.115 -0.917,1.123 v 1.3 l 2.955,0.393 c 6.905,0.92 9.633,-0.856 7.594,-4.942 -0.501,-1.004 -0.495,-1.074 0.094,-1.228 0.481,-0.126 1.202,-1.699 0.911,-1.99 -0.029,-0.03 -1.854,-0.294 -4.054,-0.588 -2.2,-0.293 -4.544,-0.616 -5.209,-0.718 -1.16,-0.178 -1.215,-0.141 -1.377,0.921 M 103.1,297.987 c -2.315,1.411 -2.587,3.237 -0.933,6.247 1.355,2.466 1.461,3.522 0.425,4.247 -1.629,1.142 -3.538,0.054 -4.286,-2.442 -0.412,-1.374 -0.89,-1.639 -2.112,-1.17 -0.767,0.294 -0.647,1.078 0.462,3.012 3.713,6.473 11.776,2.783 8.379,-3.834 -1.324,-2.579 -1.389,-2.869 -0.824,-3.675 1.081,-1.545 3.728,-0.227 4.325,2.154 0.218,0.867 0.79,1.013 1.819,0.462 0.608,-0.325 0.615,-0.414 0.127,-1.583 -1.43,-3.423 -4.809,-4.988 -7.382,-3.418 m 5.642,11.057 c -4.58,2.932 -2.982,9.598 2.448,10.21 2.127,0.239 2.112,-1.158 -0.021,-1.855 -1.945,-0.635 -2.836,-1.604 -2.836,-3.083 0,-2.217 0.616,-2.215 3.523,0.014 3.053,2.341 2.961,2.319 3.814,0.92 2.518,-4.13 -2.771,-8.868 -6.928,-6.206 m 4.925,1.956 c 0.632,0.633 0.909,2.313 0.455,2.767 -0.212,0.211 -2.849,-1.537 -3.499,-2.32 -0.977,-1.176 1.893,-1.598 3.044,-0.447 m 3.416,6.84 c -1.512,2.286 -2.75,4.29 -2.75,4.453 0,0.265 1.437,1.374 1.78,1.374 0.075,0 0.929,-1.208 1.898,-2.684 2.236,-3.405 3.546,-4.122 5.05,-2.762 0.575,0.521 0.663,0.508 1.418,-0.202 1.393,-1.308 -0.37,-2.804 -2.451,-2.079 -0.97,0.338 -0.984,0.328 -0.621,-0.469 0.311,-0.682 0.267,-0.895 -0.268,-1.299 -1.046,-0.792 -1.192,-0.661 -4.056,3.668 m 7.966,4.617 c -0.902,6.347 -0.903,6.288 0.201,6.941 l 0.917,0.541 4.403,-3.553 c 4.39,-3.542 4.401,-3.554 3.666,-4.129 -1.107,-0.866 -1.286,-0.789 -4.434,1.908 -3.495,2.995 -3.264,3.137 -2.463,-1.518 0.361,-2.098 0.658,-3.836 0.659,-3.864 10e-4,-0.028 -0.501,-0.347 -1.115,-0.71 l -1.118,-0.659 -0.716,5.043 m 13.201,-2.764 c -0.845,0.492 -0.765,2.186 0.125,2.663 1.113,0.596 2.292,-0.092 2.292,-1.337 0,-1.389 -1.189,-2.041 -2.417,-1.326 m -3.935,8.344 c -1.299,2.594 -2.239,4.818 -2.089,4.943 1.662,1.379 1.853,1.22 4.214,-3.518 2.574,-5.166 2.528,-4.956 1.232,-5.626 l -0.995,-0.514 -2.362,4.715 m 8.019,-1.007 c -2.952,1.215 -4.64,5.72 -3.114,8.304 1.437,2.432 7.292,3.426 6.418,1.088 -0.228,-0.608 -0.456,-0.708 -1.246,-0.55 -2.086,0.417 -3.659,-1.186 -3.256,-3.318 0.66,-3.49 3.732,-4.87 5.562,-2.498 0.571,0.741 1.969,0.611 1.969,-0.182 0,-1.699 -4.36,-3.656 -6.333,-2.844 m 109.771,0.62 c -0.585,0.356 -1.232,0.965 -1.44,1.354 -0.289,0.54 -0.483,0.619 -0.823,0.337 -0.444,-0.369 -2.175,-0.138 -2.175,0.29 0,0.267 3.673,9.476 3.854,9.664 0.174,0.18 2.145,-0.663 2.147,-0.919 0.001,-0.115 -0.62,-1.758 -1.38,-3.651 l -1.381,-3.441 0.663,-0.892 c 1.676,-2.256 3.196,-1.26 4.952,3.247 1.342,3.443 1.649,3.665 3.245,2.347 0.479,-0.395 -2.381,-7.079 -3.452,-8.069 -1.195,-1.104 -2.683,-1.199 -4.21,-0.267 m -22.038,2.417 c -0.22,0.22 -0.4,0.715 -0.4,1.1 0,0.385 0.18,0.88 0.4,1.1 0.22,0.22 0.715,0.4 1.1,0.4 0.385,0 0.88,-0.18 1.1,-0.4 0.22,-0.22 0.4,-0.715 0.4,-1.1 0,-0.385 -0.18,-0.88 -0.4,-1.1 -0.22,-0.22 -0.715,-0.4 -1.1,-0.4 -0.385,0 -0.88,0.18 -1.1,0.4 m -63.857,0.683 c -0.359,1.339 -0.238,1.46 1.833,1.846 1.124,0.209 2.098,0.434 2.164,0.5 0.066,0.066 -0.426,2.849 -1.093,6.184 -1.328,6.634 -1.34,6.338 0.264,6.598 l 1.127,0.183 1.252,-6.091 c 1.474,-7.167 1.041,-6.442 3.554,-5.948 2.283,0.449 2.181,0.481 2.48,-0.765 0.182,-0.759 0.094,-0.938 -0.537,-1.087 -0.777,-0.184 -10.632,-2.17 -10.767,-2.17 -0.042,0 -0.166,0.337 -0.277,0.75 m -15.226,0.668 c -5.364,3.615 -0.652,12.949 5.008,9.92 1.317,-0.705 0.443,-1.671 -1.512,-1.671 -1.993,0 -3.312,-0.846 -3.637,-2.334 -0.382,-1.74 0.146,-1.836 3.657,-0.666 3.722,1.24 3.82,1.201 3.828,-1.539 0.011,-3.695 -4.205,-5.825 -7.344,-3.71 m 88.516,0.719 c -5.841,2.596 -2.357,11.863 3.833,10.196 3.547,-0.955 4.796,-4.549 2.87,-8.264 -1.118,-2.159 -4.196,-3.046 -6.703,-1.932 m -23.016,0.674 c -0.721,1.1 -0.16,2.189 1.128,2.189 1.099,0 1.721,-0.542 1.721,-1.5 0,-1.591 -1.949,-2.062 -2.849,-0.689 m -61.379,-0.094 c 1.187,0.624 1.944,3.295 0.812,2.862 -0.229,-0.088 -1.28,-0.432 -2.334,-0.764 -2.133,-0.672 -2.234,-0.826 -1.187,-1.802 0.824,-0.768 1.644,-0.857 2.709,-0.296 m 68.812,-0.154 c -0.457,0.119 -0.584,0.511 -0.584,1.802 0,1.443 -0.106,1.698 -0.846,2.035 -1.061,0.484 -0.939,1.399 0.206,1.533 0.794,0.093 0.895,0.311 1.462,3.167 0.927,4.662 1.766,5.662 4.154,4.947 2.458,-0.737 2.612,-2.646 0.177,-2.189 -1.234,0.231 -1.114,0.452 -1.986,-3.635 -0.307,-1.435 -0.498,-2.669 -0.426,-2.742 0.144,-0.143 4.724,-1.137 4.796,-1.04 0.025,0.032 0.441,1.924 0.926,4.203 1.023,4.815 0.767,4.318 2.121,4.112 1.311,-0.2 1.306,0.066 0.112,-5.563 -1.178,-5.557 -0.688,-5.118 -4.749,-4.263 -3.927,0.828 -3.802,0.861 -4.095,-1.093 -0.124,-0.827 -0.329,-1.486 -0.455,-1.465 -0.127,0.021 -0.493,0.107 -0.813,0.191 m 19.065,1.427 c 0.767,0.411 1.685,2.677 1.685,4.159 0,2.167 -2.793,3.327 -4.253,1.768 -2.903,-3.099 -0.878,-7.771 2.568,-5.927 m -66.906,7.421 c -0.768,5.681 -0.78,5.589 0.71,5.589 h 1.079 l 0.402,-3.25 c 0.475,-3.85 1.27,-4.974 3.255,-4.601 1.01,0.189 1.104,0.129 1.318,-0.848 0.372,-1.693 -0.86,-2.128 -2.757,-0.971 -1.047,0.638 -1.083,0.64 -1.083,0.034 0,-0.646 -0.614,-1.031 -1.646,-1.031 -0.51,0 -0.685,0.696 -1.278,5.078 m 41.08,-4.338 c -0.094,0.247 0.132,2.515 0.503,5.04 0.371,2.524 0.674,4.732 0.674,4.905 0,0.174 0.363,0.315 0.806,0.315 1.789,0 1.78,0.051 1.027,-5.426 l -0.697,-5.074 -1.07,-0.104 c -0.67,-0.066 -1.135,0.063 -1.243,0.344 m -7.283,0.605 c -3.795,1.136 -3.428,4.991 0.586,6.158 3.416,0.993 3.06,3.503 -0.382,2.691 -1.633,-0.385 -1.813,-0.368 -2.19,0.214 -0.576,0.889 0.165,1.363 2.388,1.524 5.625,0.406 6.923,-5.406 1.436,-6.432 -3.4,-0.635 -2.497,-2.924 0.936,-2.375 1.195,0.191 1.686,-0.101 1.686,-1.002 0,-0.732 -2.915,-1.241 -4.46,-0.778 m -24.29,0.513 c -1.91,1.036 -0.851,2.333 1.265,1.549 1.744,-0.646 2.977,-0.247 3.224,1.045 0.235,1.226 -0.027,1.423 -2.227,1.676 -3.453,0.397 -5.083,2.022 -4.189,4.179 0.678,1.638 3.674,2.292 5.296,1.156 0.72,-0.504 0.797,-0.494 1.26,0.167 1.374,1.962 1.927,0.909 2.288,-4.365 0.351,-5.117 -2.845,-7.616 -6.917,-5.407 m 14.584,-0.291 c -0.367,0.099 -0.963,0.387 -1.325,0.64 -0.847,0.593 -1.175,0.582 -1.175,-0.04 0,-0.333 -0.334,-0.5 -1,-0.5 h -1 v 5.333 5.334 h 1.166 1.167 l 0.005,-3.75 c 0.006,-3.976 0.078,-4.264 1.223,-4.867 2.337,-1.23 2.911,-0.425 3.105,4.354 l 0.167,4.096 1.25,0.103 1.25,0.104 -0.002,-3.604 c -0.003,-6.05 -1.397,-8.129 -4.831,-7.203 M 190,344.814 c 0,1.652 -3.234,2.618 -3.996,1.194 -0.562,-1.05 0.629,-2.008 2.496,-2.008 1.368,0 1.5,0.071 1.5,0.814"
       id="path2" />
    <path
       fill-rule="evenodd"
       fill="#fb6c3c"
       stroke="none"
       d="m 62.04,244.139 c -0.155,0.198 -6.553,10.861 -14.216,23.694 -7.664,12.834 -14.082,23.575 -14.263,23.871 -0.521,0.847 6.646,12.517 12.679,20.645 74.695,100.644 222.29,104.06 301.792,6.984 3.683,-4.497 7.442,-9.637 7.215,-9.864 -0.088,-0.088 -12.067,-0.843 -26.62,-1.679 -14.553,-0.835 -26.562,-1.618 -26.686,-1.738 -0.199,-0.193 -10.108,-18.62 -20.419,-37.973 -1.979,-3.714 -3.716,-6.826 -3.859,-6.915 -0.143,-0.088 -1.312,1.076 -2.597,2.588 -17.091,20.105 -46.297,34.581 -69.768,34.581 -0.611,0 -0.631,-0.545 -0.631,-17.343 0,-13.579 -0.091,-17.374 -0.417,-17.483 -0.229,-0.077 -3.004,-0.185 -6.167,-0.24 l -5.75,-0.1 V 280.583 298 h -1.04 c -3.128,0 -12.819,-1.826 -18.585,-3.502 -23.525,-6.836 -44.66,-23.112 -56.875,-43.797 -0.887,-1.503 -1.755,-2.82 -1.929,-2.927 -0.174,-0.108 -11.061,-0.991 -24.194,-1.963 -13.132,-0.973 -24.667,-1.828 -25.632,-1.901 -1.024,-0.077 -1.873,0.018 -2.038,0.229 m 45.627,53.709 c 2.608,1.32 4.127,4.81 2.361,5.426 -1.133,0.395 -1.204,0.344 -1.99,-1.429 -0.749,-1.692 -2.017,-2.447 -3.202,-1.907 -1.134,0.517 -1.065,1.299 0.369,4.241 3.308,6.784 -5.277,10.377 -8.776,3.674 -0.684,-1.31 -1.1,-2.814 -0.821,-2.969 1.474,-0.818 2.028,-0.562 2.962,1.363 1.089,2.247 2.207,2.992 3.563,2.374 1.374,-0.626 1.388,-1.457 0.067,-3.979 -2.642,-5.043 0.705,-9.202 5.467,-6.794 m 5.892,10.847 c 2.693,1.304 3.616,3.561 2.493,6.098 -0.882,1.994 -1.209,1.958 -4.407,-0.476 l -2.649,-2.017 -0.331,0.872 c -0.717,1.885 0.216,3.567 2.223,4.009 1.667,0.367 1.779,0.45 1.779,1.319 0,1.68 -2.805,1.277 -5.016,-0.721 -4.553,-4.113 0.41,-11.745 5.908,-9.084 m -2.89,1.963 c -0.549,0.347 -0.557,0.336 1.575,1.973 1.469,1.127 2.089,1.127 2.089,0.001 0,-1.535 -2.353,-2.803 -3.664,-1.974 m 10.913,4.526 c -0.129,0.673 -0.036,0.724 1.06,0.577 0.871,-0.117 1.423,0.018 2.005,0.489 l 0.803,0.65 -0.745,1.046 -0.744,1.045 -0.982,-0.726 c -1.545,-1.142 -2.466,-0.601 -4.78,2.809 l -1.968,2.899 -1.032,-0.712 c -0.568,-0.391 -1.081,-0.747 -1.141,-0.79 -0.06,-0.043 1.255,-2.118 2.924,-4.611 l 3.033,-4.532 0.854,0.559 c 0.6,0.394 0.812,0.779 0.713,1.297 m 6.306,3.671 c 0.103,0.268 -0.097,2.111 -0.444,4.095 l -0.632,3.608 2.876,-2.446 c 1.581,-1.345 3.042,-2.445 3.245,-2.445 0.584,0 2.067,0.746 2.067,1.04 0,0.237 -7.535,6.454 -8.583,7.082 -0.864,0.518 -2.476,-0.86 -2.286,-1.956 0.095,-0.55 0.413,-2.8 0.706,-5 0.797,-5.985 0.656,-5.607 1.854,-4.987 0.556,0.287 1.094,0.741 1.197,1.009 m 12.643,1.312 c 0.709,1.082 -0.064,2.5 -1.364,2.5 -0.505,0 -1.027,-0.32 -1.364,-0.834 -0.71,-1.082 0.064,-2.5 1.364,-2.5 0.504,0 1.027,0.32 1.364,0.834 m -2.514,3.675 c 1.23,0.636 1.375,0.05 -1.367,5.525 -1.933,3.858 -2.451,4.65 -2.917,4.458 -0.311,-0.129 -0.829,-0.309 -1.15,-0.402 -0.321,-0.092 -0.583,-0.374 -0.583,-0.625 0,-0.653 4.433,-9.465 4.761,-9.465 0.15,0 0.715,0.229 1.256,0.509 m 8.176,3.457 c 1.221,0.554 2.807,2.077 2.807,2.695 0,0.887 -1.56,0.863 -2.595,-0.039 -1.766,-1.54 -3.395,-1.267 -4.419,0.739 -1.465,2.871 -0.608,4.973 2.027,4.973 1.35,0 1.604,0.106 1.771,0.744 0.412,1.578 -2.111,2.068 -4.431,0.86 -6.219,-3.238 -1.544,-12.872 4.84,-9.972 m 110.367,0.661 c 0.467,0.48 1.5,2.497 2.294,4.481 l 1.444,3.608 -1.185,0.495 c -1.443,0.603 -1.154,0.925 -2.885,-3.215 -1.555,-3.719 -1.981,-4.214 -3.335,-3.874 -1.896,0.476 -1.966,1.606 -0.341,5.483 0.804,1.921 1.414,3.54 1.355,3.6 -0.059,0.059 -0.639,0.329 -1.289,0.601 l -1.181,0.493 -1.61,-4.066 c -0.885,-2.236 -1.798,-4.524 -2.029,-5.085 -0.485,-1.178 1.084,-2.269 1.943,-1.35 0.303,0.325 0.596,0.176 1.357,-0.691 1.638,-1.866 3.918,-2.066 5.462,-0.48 M 232.333,330 c 0.367,0.367 0.667,0.892 0.667,1.167 0,0.275 -0.3,0.8 -0.667,1.166 -0.366,0.367 -0.891,0.667 -1.166,0.667 -0.275,0 -0.8,-0.3 -1.167,-0.667 -0.367,-0.366 -0.667,-0.891 -0.667,-1.166 0,-0.275 0.3,-0.8 0.667,-1.167 0.367,-0.367 0.892,-0.667 1.167,-0.667 0.275,0 0.8,0.3 1.166,0.667 m -59.735,1.079 5.464,1.079 -0.184,1.129 c -0.237,1.461 -0.057,1.399 -2.545,0.88 -1.188,-0.248 -2.175,-0.425 -2.194,-0.392 -0.018,0.032 -0.58,2.819 -1.249,6.193 -0.668,3.374 -1.258,6.178 -1.312,6.231 -0.111,0.111 -2.573,-0.416 -2.742,-0.587 -0.06,-0.061 0.452,-2.911 1.14,-6.332 l 1.251,-6.22 -1.5,-0.225 c -2.579,-0.387 -2.973,-0.641 -2.802,-1.806 0.187,-1.274 -0.043,-1.276 6.673,0.05 m -16.585,0.004 c 2.337,1.179 3.511,4.86 2.023,6.348 -0.324,0.324 -3.33,-0.438 -6.619,-1.679 -0.507,-0.19 -0.576,1.661 -0.096,2.558 0.472,0.882 2.151,1.467 3.489,1.216 0.94,-0.176 1.219,-0.095 1.505,0.44 1.087,2.032 -2.691,2.578 -5.682,0.822 -5.642,-3.313 -0.466,-12.652 5.38,-9.705 m 87.549,0.606 c 3.137,1.189 4.785,5.723 3.021,8.314 -3.623,5.324 -11.316,1.95 -10.117,-4.438 0.531,-2.833 4.347,-4.917 7.096,-3.876 m -24.714,0.796 c 1.495,1.494 -0.253,3.533 -2.031,2.368 -1.035,-0.678 -1.072,-1.97 -0.076,-2.667 0.979,-0.686 1.146,-0.663 2.107,0.299 m 6.271,0.432 c 0.091,0.32 0.257,1.042 0.369,1.604 l 0.204,1.021 3.564,-0.75 c 4.278,-0.9 3.692,-1.448 4.971,4.646 1.192,5.675 1.223,5.304 -0.449,5.356 l -1.245,0.039 -0.824,-4 c -0.453,-2.2 -0.869,-4.058 -0.925,-4.13 -0.096,-0.125 -4.066,0.615 -4.483,0.835 -0.276,0.146 0.995,5.888 1.393,6.287 0.209,0.211 0.569,0.171 1.025,-0.114 0.608,-0.379 0.791,-0.349 1.365,0.225 0.8,0.799 0.552,1.305 -0.947,1.931 -2.845,1.189 -4.075,0.223 -4.93,-3.869 -0.825,-3.95 -0.798,-3.886 -1.628,-3.857 -1.035,0.036 -1.271,-1.443 -0.272,-1.704 0.592,-0.155 0.693,-0.439 0.693,-1.948 0,-1.102 0.157,-1.83 0.417,-1.935 0.86,-0.347 1.543,-0.202 1.702,0.363 m -72.946,0.409 c -0.481,0.532 -0.507,0.693 -0.135,0.828 3.803,1.383 4.295,1.442 4.295,0.513 0,-1.761 -2.926,-2.704 -4.16,-1.341 m 87.781,0.978 c -1.494,1.21 -0.646,5.323 1.245,6.041 2.156,0.82 3.824,-1.115 3.143,-3.647 -0.752,-2.79 -2.632,-3.816 -4.388,-2.394 m -61.204,2.262 c 0.137,0.077 0.25,0.442 0.25,0.811 0,0.668 0.005,0.668 0.878,-0.019 1.656,-1.303 3.603,-0.798 3.173,0.822 -0.206,0.775 -0.471,1.006 -1.24,1.078 -2.687,0.251 -2.871,0.524 -3.494,5.189 l -0.394,2.946 -1.212,-0.226 c -1.636,-0.306 -1.576,0.016 -0.91,-4.925 0.887,-6.565 0.797,-6.27 1.823,-6.025 0.482,0.115 0.988,0.272 1.126,0.349 m 41.538,5.145 c 0.404,2.958 0.691,5.412 0.64,5.453 -0.703,0.558 -2.612,0.372 -2.752,-0.268 -0.132,-0.603 -0.993,-6.979 -1.268,-9.389 -0.07,-0.615 0.607,-0.951 2.286,-1.134 0.219,-0.024 0.649,2.072 1.094,5.338 m -29.799,-3.904 c 2.059,0.86 2.451,2.523 1.962,8.309 -0.232,2.749 -1.664,3.835 -2.407,1.827 -0.172,-0.466 -0.351,-0.588 -0.503,-0.342 -0.828,1.339 -4.685,1.091 -5.707,-0.367 -1.69,-2.414 0.604,-4.901 4.521,-4.901 1.579,0 1.645,-0.037 1.645,-0.933 0,-1.702 -1.258,-2.165 -3.59,-1.322 -1.014,0.367 -1.189,0.342 -1.607,-0.23 -1.276,-1.745 2.85,-3.226 5.686,-2.041 m 23.22,0.048 c 1.167,0.603 0.673,2.132 -0.591,1.831 -1.479,-0.351 -2.88,-0.171 -3.244,0.417 -0.488,0.786 0.328,1.427 2.223,1.747 5.444,0.92 3.234,7.492 -2.244,6.67 -2.019,-0.302 -2.715,-0.866 -2.217,-1.796 0.445,-0.832 0.735,-0.874 2.241,-0.33 1.46,0.528 2.885,-0.061 2.729,-1.129 -0.083,-0.57 -0.527,-0.853 -2.051,-1.304 -2.258,-0.669 -3.102,-1.326 -3.391,-2.638 -0.629,-2.866 3.489,-5.048 6.545,-3.468 m -15.989,0.439 c 0.383,0.615 0.414,0.615 1.419,0.002 1.559,-0.951 3.303,-0.821 4.606,0.342 l 1.088,0.972 0.109,4.528 0.11,4.529 h -1.36 -1.359 v -3.689 c 0,-4.233 -0.254,-4.978 -1.7,-4.978 -2.169,0 -2.3,0.266 -2.3,4.678 v 3.989 h -1.5 -1.5 v -5.278 c 0,-2.903 0.1,-5.378 0.223,-5.5 0.452,-0.452 1.784,-0.203 2.164,0.405 m -10.803,6.093 c -1.239,0.453 -1.289,1.84 -0.077,2.144 1.396,0.351 2.827,-0.445 2.827,-1.571 0,-1.065 -0.894,-1.251 -2.75,-0.573"
       id="path3" />
    <path
       fill-rule="evenodd"
       fill="#d3a588"
       stroke="none"
       d="m 334.744,146 c 0,0.642 0.069,0.904 0.152,0.583 0.084,-0.321 0.084,-0.846 0,-1.166 -0.083,-0.321 -0.152,-0.059 -0.152,0.583 m -130.514,1.216 c 0.401,0.087 0.805,0.412 0.897,0.721 0.121,0.405 0.149,0.376 0.1,-0.104 -0.045,-0.452 -0.334,-0.684 -0.897,-0.721 -0.696,-0.046 -0.712,-0.029 -0.1,0.104 m -2.479,3.951 c 0.003,0.733 0.072,0.994 0.151,0.579 0.08,-0.415 0.077,-1.015 -0.006,-1.333 -0.084,-0.319 -0.149,0.02 -0.145,0.754 m -18.251,-0.5 -1,0.254 0.897,0.04 c 0.493,0.021 0.99,-0.111 1.103,-0.294 0.113,-0.184 0.16,-0.316 0.103,-0.294 -0.057,0.021 -0.553,0.154 -1.103,0.294 m 27.754,0.902 c 0.415,0.08 1.015,0.077 1.333,-0.007 0.319,-0.083 -0.02,-0.148 -0.754,-0.145 -0.733,0.004 -0.994,0.072 -0.579,0.152 m 16.996,5.108 c 0.412,0.166 0.762,0.569 0.776,0.896 0.017,0.367 0.092,0.431 0.198,0.166 0.227,-0.564 -0.496,-1.411 -1.181,-1.385 -0.368,0.015 -0.301,0.119 0.207,0.323 m -1.582,4.388 c 0.48,0.58 0.411,0.866 -0.251,1.039 -0.526,0.137 -0.528,0.156 -0.02,0.191 0.823,0.056 1.1,-0.618 0.477,-1.162 -0.296,-0.258 -0.389,-0.288 -0.206,-0.068 m -60.923,1.278 c -0.599,0.545 -0.965,0.99 -0.813,0.99 0.152,0 0.708,-0.45 1.235,-1 1.225,-1.278 0.988,-1.273 -0.422,0.01 m 68.922,0.543 c 0,0.182 0.412,0.695 0.916,1.139 l 0.917,0.808 -0.833,-1 c -0.459,-0.55 -0.871,-1.062 -0.917,-1.139 -0.046,-0.076 -0.083,0.01 -0.083,0.192 m 0.572,2.116 c 0.772,0.806 1.457,1.398 1.521,1.315 0.063,-0.083 -0.569,-0.742 -1.406,-1.465 l -1.521,-1.315 1.406,1.465 m 102.511,8.228 c 0.321,0.084 0.846,0.084 1.167,0 0.32,-0.084 0.058,-0.153 -0.584,-0.153 -0.641,0 -0.904,0.069 -0.583,0.153 M 201.77,189.5 c 0.002,1.1 0.064,1.51 0.138,0.911 0.074,-0.599 0.073,-1.499 -0.003,-2 -0.076,-0.501 -0.137,-0.011 -0.135,1.089 m -7.288,12.333 c 0,5.867 0.046,8.22 0.101,5.229 0.055,-2.99 0.055,-7.79 0,-10.666 -0.056,-2.876 -0.101,-0.429 -0.101,5.437 m -35.368,-1.666 c 0.001,1.466 0.06,2.025 0.13,1.241 0.071,-0.784 0.07,-1.984 -0.002,-2.667 -0.071,-0.682 -0.129,-0.041 -0.128,1.426 m 180.803,-2.256 c 0.779,0.07 2.054,0.07 2.833,0 0.779,-0.07 0.142,-0.128 -1.417,-0.128 -1.558,0 -2.196,0.058 -1.416,0.128 m -98.805,2.422 c 0,1.375 0.059,1.938 0.131,1.25 0.072,-0.687 0.072,-1.812 0,-2.5 -0.072,-0.687 -0.131,-0.125 -0.131,1.25 M 337.744,205 c 0,0.642 0.069,0.904 0.152,0.583 0.084,-0.321 0.084,-0.846 0,-1.166 -0.083,-0.321 -0.152,-0.059 -0.152,0.583 m -108.92,24.417 -2.324,2.416 2.417,-2.324 c 2.244,-2.159 2.569,-2.509 2.324,-2.509 -0.051,0 -1.138,1.088 -2.417,2.417 m -32.407,11.813 c 0.32,0.084 0.845,0.084 1.166,0 0.321,-0.084 0.059,-0.153 -0.583,-0.153 -0.642,0 -0.904,0.069 -0.583,0.153 m 6.333,0 c 0.321,0.084 0.846,0.084 1.167,0 0.32,-0.084 0.058,-0.153 -0.584,-0.153 -0.641,0 -0.904,0.069 -0.583,0.153 M 108,298.104 c 0,0.058 0.487,0.545 1.083,1.084 l 1.084,0.979 -0.979,-1.084 C 108.275,298.074 108,297.847 108,298.104 m 2.75,10.126 c 0.321,0.084 0.846,0.084 1.167,0 0.32,-0.084 0.058,-0.153 -0.584,-0.153 -0.641,0 -0.904,0.069 -0.583,0.153 m 42.333,22.333 c 0.321,0.084 0.846,0.084 1.167,0 0.321,-0.084 0.058,-0.152 -0.583,-0.152 -0.642,0 -0.905,0.068 -0.584,0.152 m 88.334,1 c 0.32,0.084 0.845,0.084 1.166,0 0.321,-0.084 0.059,-0.152 -0.583,-0.152 -0.642,0 -0.904,0.068 -0.583,0.152 m -103,1.27 c 0.004,0.734 0.072,0.994 0.152,0.58 0.08,-0.415 0.077,-1.015 -0.007,-1.334 -0.083,-0.318 -0.148,0.021 -0.145,0.754 m 2.66,0.5 c 0,0.642 0.069,0.904 0.153,0.584 0.084,-0.321 0.084,-0.846 0,-1.167 -0.084,-0.321 -0.153,-0.058 -0.153,0.583 m 82.023,1 c 0,1.009 0.062,1.421 0.139,0.917 0.076,-0.504 0.076,-1.329 0,-1.833 -0.077,-0.505 -0.139,-0.092 -0.139,0.916 m -64.683,0.834 c 0.004,0.733 0.072,0.994 0.152,0.579 0.08,-0.415 0.077,-1.015 -0.007,-1.333 -0.083,-0.319 -0.148,0.02 -0.145,0.754 m 29.166,2.402 c 0.413,0.079 1.088,0.079 1.5,0 0.413,-0.08 0.075,-0.145 -0.75,-0.145 -0.825,0 -1.162,0.065 -0.75,0.145 m -44.5,0.327 c 0.321,0.084 0.846,0.084 1.167,0 0.321,-0.083 0.058,-0.152 -0.583,-0.152 -0.642,0 -0.905,0.069 -0.584,0.152 m 52.397,0.201 c -0.09,0.237 -0.119,2.75 -0.063,5.584 l 0.102,5.152 0.074,-5.394 0.074,-5.395 0.916,-0.139 0.917,-0.138 -0.927,-0.05 c -0.51,-0.028 -1.002,0.143 -1.093,0.38 m 2.647,6.736 c 10e-4,2.2 0.055,3.057 0.12,1.904 0.065,-1.153 0.065,-2.953 -0.001,-4 -0.066,-1.047 -0.119,-0.104 -0.119,2.096 m -5.71,-0.666 c 0.004,0.733 0.072,0.994 0.152,0.579 0.08,-0.415 0.077,-1.015 -0.007,-1.333 -0.083,-0.319 -0.148,0.02 -0.145,0.754 m 37.285,-0.205 c 0.69,0.559 0.724,0.697 0.305,1.25 -0.449,0.593 -0.442,0.595 0.156,0.048 0.645,-0.591 0.009,-1.927 -0.918,-1.927 -0.175,0 0.03,0.283 0.457,0.629 m -19.448,4.607 c 0.415,0.08 1.015,0.077 1.333,-0.007 0.319,-0.083 -0.02,-0.148 -0.754,-0.145 -0.733,0.004 -0.994,0.072 -0.579,0.152"
       id="path4" />
  </g>
</svg>
