<?xml version="1.0" encoding="UTF-8" standalone="no"?>
<svg
   xmlns:dc="http://purl.org/dc/elements/1.1/"
   xmlns:cc="http://creativecommons.org/ns#"
   xmlns:rdf="http://www.w3.org/1999/02/22-rdf-syntax-ns#"
   xmlns:svg="http://www.w3.org/2000/svg"
   xmlns="http://www.w3.org/2000/svg"
   xmlns:sodipodi="http://sodipodi.sourceforge.net/DTD/sodipodi-0.dtd"
   xmlns:inkscape="http://www.inkscape.org/namespaces/inkscape"
   width="512.00104"
   height="511.99997"
   viewBox="7.025 7.025 101.98057 101.98015"
   version="1.1"
   id="svg9"
   sodipodi:docname="linkedin.svg"
   inkscape:version="0.92.4 (unknown)">
  <metadata
     id="metadata15">
    <rdf:RDF>
      <cc:Work
         rdf:about="">
        <dc:format>image/svg+xml</dc:format>
        <dc:type
           rdf:resource="http://purl.org/dc/dcmitype/StillImage" />
        <dc:title></dc:title>
      </cc:Work>
    </rdf:RDF>
  </metadata>
  <defs
     id="defs13" />
  <sodipodi:namedview
     pagecolor="#ffffff"
     bordercolor="#666666"
     borderopacity="1"
     objecttolerance="10"
     gridtolerance="10"
     guidetolerance="10"
     inkscape:pageopacity="0"
     inkscape:pageshadow="2"
     inkscape:window-width="1600"
     inkscape:window-height="851"
     id="namedview11"
     showgrid="false"
     inkscape:showpageshadow="false"
     fit-margin-top="0"
     fit-margin-left="0"
     fit-margin-right="0"
     fit-margin-bottom="0"
     inkscape:zoom="1.2597657"
     inkscape:cx="256.00052"
     inkscape:cy="255.99998"
     inkscape:window-x="0"
     inkscape:window-y="24"
     inkscape:window-maximized="1"
     inkscape:current-layer="svg9" />
  <linearGradient
     id="a"
     gradientUnits="userSpaceOnUse"
     x1="-974.48199"
     y1="1306.7729"
     x2="-622.37799"
     y2="1658.877"
     gradientTransform="matrix(0.20480041,0,0,0.20480041,221.53397,-245.66849)">
    <stop
       offset="0"
       stop-color="#2489be"
       id="stop2" />
    <stop
       offset="1"
       stop-color="#0575b3"
       id="stop4" />
  </linearGradient>
  <path
     d="M 58.015182,7.0245 C 29.853897,7.0245 7.025,29.85339 7.025,58.01468 c 0,28.16128 22.828897,50.99018 50.990182,50.99018 28.161286,0 50.990388,-22.8289 50.990388,-50.99018 C 109.00536,29.85339 86.176058,7.0245 58.015182,7.0245 Z M 44.410905,82.66609 H 33.215491 V 46.49691 H 44.410905 Z M 38.759848,41.76028 c -3.656302,0 -6.620378,-2.98824 -6.620378,-6.67383 0,-3.686 2.964486,-6.67403 6.620378,-6.67403 3.655892,0 6.619968,2.98803 6.619968,6.67403 2.05e-4,3.6858 -2.963871,6.67383 -6.619968,6.67383 z M 86.365703,82.66609 H 75.224561 V 63.68028 c 0,-5.20726 -1.977962,-8.11399 -6.095475,-8.11399 -4.481237,0 -6.822311,3.02736 -6.822311,8.11399 V 82.66609 H 51.569089 V 46.49691 h 10.737686 v 4.87138 c 0,0 3.229907,-5.97464 10.899273,-5.97464 7.669571,0 13.15986,4.68296 13.15986,14.37064 z"
     id="path7"
     style="fill:url(#a);stroke-width:0.20480041"
     inkscape:connector-curvature="0" />
</svg>
