<?xml version="1.0" encoding="UTF-8" standalone="no"?>
<svg
   xmlns:dc="http://purl.org/dc/elements/1.1/"
   xmlns:cc="http://creativecommons.org/ns#"
   xmlns:rdf="http://www.w3.org/1999/02/22-rdf-syntax-ns#"
   xmlns:svg="http://www.w3.org/2000/svg"
   xmlns="http://www.w3.org/2000/svg"
   xmlns:sodipodi="http://sodipodi.sourceforge.net/DTD/sodipodi-0.dtd"
   xmlns:inkscape="http://www.inkscape.org/namespaces/inkscape"
   inkscape:version="1.0 (1.0+r73+1)"
   sodipodi:docname="os-macos-4.svg"
   id="svg20"
   version="1.1"
   viewBox="0 0 39.476429 37.417878"
   height="485.30109"
   width="512">
  <metadata
     id="metadata26">
    <rdf:RDF>
      <cc:Work
         rdf:about="">
        <dc:format>image/svg+xml</dc:format>
        <dc:type
           rdf:resource="http://purl.org/dc/dcmitype/StillImage" />
        <dc:title></dc:title>
      </cc:Work>
    </rdf:RDF>
  </metadata>
  <defs
     id="defs24" />
  <sodipodi:namedview
     inkscape:current-layer="svg20"
     inkscape:window-maximized="1"
     inkscape:window-y="24"
     inkscape:window-x="0"
     inkscape:cy="242.65054"
     inkscape:cx="256"
     inkscape:zoom="1.6917333"
     fit-margin-bottom="0"
     fit-margin-right="0"
     fit-margin-left="0"
     fit-margin-top="0"
     inkscape:showpageshadow="false"
     showgrid="false"
     id="namedview22"
     inkscape:window-height="1033"
     inkscape:window-width="1920"
     inkscape:pageshadow="2"
     inkscape:pageopacity="0"
     guidetolerance="10"
     gridtolerance="10"
     objecttolerance="10"
     borderopacity="1"
     bordercolor="#666666"
     pagecolor="#ffffff" />
  <g
     transform="matrix(0.21100347,0,0,0.21100347,-0.59798383,-1.6272588)"
     id="g51">
    <g
       id="g41">
      <path
         d="M 102.135,91.37 C 88.601,91.897 74.014,89.349 61.712,83.197 l 2.548,-4.042 c 11.951,5.624 25.66,7.558 37.875,7.03 0,0.439 0.525,-8.261 1.316,-13.006 H 85.086 C 86.755,54.022 92.643,36.974 101.431,22.475 H 46.509 v 83.658 h 57.733 c -1.318,-5.01 -2.107,-14.939 -2.107,-14.763 z"
         fill="#d0e9fb"
         id="path4"
         style="clip-rule:evenodd;fill-rule:evenodd" />
      <path
         d="m 107.67,85.833 c 10.018,-0.967 18.805,-3.603 24.166,-7.03 L 135,82.845 c -7.383,4.307 -16.961,7.118 -27.33,8.173 0.264,5.185 1.055,10.105 2.373,15.115 h 39.543 V 22.475 H 107.494 C 98.531,36.184 93.434,51.474 91.501,67.643 h 18.894 c -1.583,6.151 -2.549,12.215 -2.725,18.19 z M 71.465,35.129 h 5.361 V 47.52 h -5.361 z"
         fill="#00acec"
         id="path6"
         style="clip-rule:evenodd;fill-rule:evenodd" />
      <path
         d="m 116.105,35.129 h 5.362 V 47.52 h -5.362 z"
         id="path8"
         style="clip-rule:evenodd;fill-rule:evenodd" />
      <path
         d="m 107.67,85.833 c 10.018,-0.967 18.805,-3.603 24.166,-7.03 L 135,82.845 c -7.383,4.307 -16.961,7.118 -27.33,8.173 0.439,9.314 2.725,18.541 7.293,27.417 l -4.568,2.459 c -8.348,-13.18 -9.842,-30.931 -6.943,-47.715 H 85.086 C 87.371,47.08 97.388,24.935 111.976,7.712 l 3.953,3.427 C 101.695,27.66 93.874,46.905 91.501,67.643 h 18.894 c -1.583,6.151 -2.549,12.215 -2.725,18.19 z"
         id="path10"
         style="clip-rule:evenodd;fill-rule:evenodd" />
      <path
         d="M 102.135,86.185 V 91.37 C 88.601,91.897 74.014,89.349 61.712,83.197 l 2.548,-4.042 c 11.95,5.624 25.659,7.557 37.875,7.03 z"
         fill="#00acec"
         id="path12"
         style="clip-rule:evenodd;fill-rule:evenodd" />
    </g>
    <path
       style="clip-rule:evenodd;fill-rule:evenodd"
       sodipodi:nodetypes="cscssccscccccssccscccsccscccscccsccscccscsssccccccccscccscccccccccsscccsscccsssccscscccccccsccsccccscccccssccc"
       id="path14"
       d="m 15.752,134.252 c -2.46,0.176 -3.69,0.264 -5.272,0.264 -0.967,0 -1.934,0 -3.076,-0.088 H 5.647 c -0.879,0 -1.318,0.352 -1.318,1.23 0,0.791 0.439,1.23 1.494,1.318 l 1.845,0.176 c 2.988,0.264 3.251,0.527 3.251,3.076 0,0.352 -0.087,1.23 -0.087,2.197 l -1.67,29.613 c -0.352,5.975 -0.439,6.502 -0.967,7.205 -0.264,0.439 -1.054,0.879 -2.285,1.055 l -1.142,0.176 c -1.67,0.352 -1.934,0.615 -1.934,1.582 0,0.703 0.439,1.143 1.143,1.143 h 0.439 l 1.055,-0.088 c 1.318,-0.088 3.339,-0.176 4.833,-0.176 1.494,0 4.569,0.088 5.448,0.176 l 1.23,0.088 0.439,0.088 c 0.703,0.088 1.318,-0.527 1.318,-1.318 0,-0.879 -0.439,-1.23 -1.494,-1.406 l -1.406,-0.176 c -3.251,-0.352 -3.603,-0.879 -3.603,-4.395 0,-1.141 0,-2.723 0.088,-3.777 l 0.966,-28.822 12.566,37.961 c 0.352,1.055 0.527,1.23 0.967,1.23 0.527,0 0.615,-0.176 1.055,-1.318 l 12.917,-37.787 0.176,29.176 v 2.812 c 0,3.777 -0.352,4.48 -2.724,4.832 l -1.143,0.176 c -1.23,0.176 -1.669,0.527 -1.669,1.494 0,0.791 0.439,1.143 1.318,1.23 h 0.352 l 0.967,-0.176 c 1.143,-0.088 4.481,-0.264 6.063,-0.264 1.406,0 2.285,0 3.427,0.176 1.142,0.088 2.021,0.088 2.285,0.088 h 1.055 c 0.878,0 1.318,-0.352 1.318,-1.23 0,-0.791 -0.439,-1.143 -1.845,-1.318 l -1.23,-0.176 c -1.845,-0.176 -2.46,-0.791 -2.724,-2.021 -0.176,-1.229 -0.176,-2.723 -0.264,-7.996 l -0.176,-25.484 -0.088,-3.602 c 0,-3.516 0.176,-3.779 2.987,-4.131 l 1.67,-0.176 c 1.23,-0.176 1.582,-0.527 1.582,-1.406 0,-0.791 -0.264,-1.055 -1.318,-1.143 H 50.55 l -1.055,0.088 c -1.318,0 -2.373,0.088 -3.603,0.088 -1.318,0 -2.461,-0.088 -4.746,-0.176 l -12.917,37.523 z m 48.684,44.641 c 1.406,-0.615 2.9,-1.756 3.955,-2.986 0.703,-1.055 0.966,-1.758 0.966,-3.076 l 0.176,-7.908 c -2.46,1.229 -3.867,2.02 -5.097,2.898 -0.439,0.264 -0.791,0.615 -1.142,0.879 -2.637,2.197 -3.955,4.658 -3.955,6.943 0,2.283 1.23,3.777 2.988,3.777 0.615,0 1.318,-0.176 2.109,-0.527 z m 0,-14.059 c 1.494,-0.879 3.251,-1.758 5.097,-2.549 v -6.328 c 0,-4.305 -0.967,-6.15 -3.339,-6.15 -0.615,0 -1.23,0.088 -1.757,0.264 -2.373,0.879 -4.13,3.34 -4.746,6.941 l -0.264,1.318 c -0.352,1.582 -0.703,1.934 -1.933,1.934 h -1.23 c -0.967,0 -1.494,-0.527 -1.494,-1.406 0,-1.494 1.494,-5.096 3.164,-7.117 1.757,-2.109 4.042,-3.604 6.503,-4.307 0.966,-0.264 2.021,-0.439 3.076,-0.439 2.636,0 3.954,0.352 5.097,1.318 1.669,1.406 2.109,2.725 2.109,7.029 v 0.527 l -0.176,15.994 c 0,5.186 0,5.186 0.176,5.887 0.088,0.703 0.615,1.406 1.318,1.494 1.318,0.176 1.846,-0.352 2.373,-1.318 0.439,-1.141 1.846,-1.141 1.67,0.088 -0.088,1.318 -0.439,2.373 -1.582,3.691 -1.406,1.582 -3.339,2.021 -5.272,2.021 -2.637,0 -3.867,-1.67 -3.867,-5.186 -1.318,1.67 -3.076,3.076 -4.921,4.043 -1.669,0.791 -3.515,1.318 -5.185,1.318 -3.427,0 -5.712,-2.461 -5.712,-6.24 -0.002,-4.391 3.864,-8.962 10.895,-12.827 z m 39.63,12.652 c -1.582,2.197 -3.865,4.043 -7.557,3.955 -7.205,-0.264 -10.105,-8.084 -10.105,-16.783 0,-8.525 3.779,-14.764 8.875,-15.027 1.757,-0.088 3.076,0.527 4.218,1.67 1.143,1.055 2.021,2.461 2.461,3.602 0.877,2.549 3.338,4.395 2.986,-3.25 -0.176,-2.812 -3.602,-4.834 -7.469,-4.746 -9.754,0.264 -16.521,7.908 -16.521,19.859 0,10.459 5.185,17.4 12.917,17.4 2.987,0 6.591,-0.176 9.05,-2.109 1.934,-1.406 2.461,-2.109 2.812,-3.604 0.443,-1.932 -1.139,-1.668 -1.667,-0.967 z" />
    <path
       style="clip-rule:evenodd;fill-rule:evenodd"
       id="path16"
       fill="#00acec"
       d="m 139.656,132.406 c -12.479,0.264 -21.441,11.072 -21.441,26.188 0,15.643 8.699,26.451 21.09,26.451 h 0.352 c 6.328,-0.088 11.248,-2.637 15.467,-8.084 4.041,-5.098 5.799,-10.723 5.799,-18.455 0,-7.117 -1.494,-12.654 -4.48,-17.223 -3.779,-5.713 -9.58,-8.877 -16.434,-8.877 z m 0,50.002 c -4.568,0 -7.645,-1.758 -10.633,-6.152 -3.164,-4.656 -4.568,-10.105 -4.568,-17.574 0,-13.797 6.15,-23.375 15.201,-23.639 h 0.352 c 4.131,0 7.469,1.846 10.193,5.625 3.164,4.217 4.658,10.105 4.658,17.838 0,7.119 -1.23,12.566 -4.043,16.961 -2.988,4.832 -6.326,6.941 -11.16,6.941 z m 47.629,-47.013 c -2.725,-1.758 -5.271,-2.461 -8.787,-2.461 -7.91,0 -13.797,5.889 -13.797,14.061 0,5.625 2.549,9.051 8.963,12.303 l 4.131,1.934 c 5.008,2.549 7.117,5.359 7.117,9.93 0,6.24 -3.779,10.633 -8.963,10.633 -2.725,0 -5.098,-1.055 -6.59,-3.076 -1.318,-1.668 -2.373,-4.305 -2.812,-6.502 l -0.176,-1.67 c -0.264,-1.494 -0.527,-1.934 -1.406,-1.934 -0.791,0 -1.23,0.703 -1.23,2.109 l 0.264,10.896 c 3.428,2.021 6.854,2.988 10.984,2.988 5.186,0 9.051,-1.758 11.688,-5.361 2.109,-2.812 3.252,-6.326 3.252,-10.105 0,-6.502 -2.549,-10.457 -8.525,-13.533 l -2.723,-1.406 c -4.922,-2.459 -5.977,-3.162 -7.207,-4.568 -1.229,-1.406 -1.844,-3.252 -1.844,-5.537 0,-4.92 3.162,-8.436 7.381,-8.436 4.129,0 7.293,3.076 7.996,7.646 l 0.176,1.229 c 0.088,0.967 0.439,1.406 1.143,1.406 0.879,0 1.055,-0.088 1.23,-1.582 v -0.176 z" />
  </g>
</svg>
