<?xml version="1.0" encoding="UTF-8" standalone="no"?>
<svg
   xmlns:dc="http://purl.org/dc/elements/1.1/"
   xmlns:cc="http://creativecommons.org/ns#"
   xmlns:rdf="http://www.w3.org/1999/02/22-rdf-syntax-ns#"
   xmlns:svg="http://www.w3.org/2000/svg"
   xmlns="http://www.w3.org/2000/svg"
   xmlns:sodipodi="http://sodipodi.sourceforge.net/DTD/sodipodi-0.dtd"
   xmlns:inkscape="http://www.inkscape.org/namespaces/inkscape"
   inkscape:version="1.0 (1.0+r73+1)"
   sodipodi:docname="os-redhat-3.svg"
   xml:space="preserve"
   enable-background="new 31.434 337.107 533.437 171.263"
   viewBox="31.434 337.107 511.99999 172.50569"
   height="172.50569"
   width="512"
   y="0px"
   x="0px"
   id="Layer_1"
   version="1.1"><metadata
   id="metadata24"><rdf:RDF><cc:Work
       rdf:about=""><dc:format>image/svg+xml</dc:format><dc:type
         rdf:resource="http://purl.org/dc/dcmitype/StillImage" /><dc:title></dc:title></cc:Work></rdf:RDF></metadata><defs
   id="defs22" /><sodipodi:namedview
   fit-margin-bottom="0"
   fit-margin-right="0"
   fit-margin-left="0"
   fit-margin-top="0"
   inkscape:showpageshadow="false"
   inkscape:current-layer="Layer_1"
   inkscape:window-maximized="1"
   inkscape:window-y="24"
   inkscape:window-x="0"
   inkscape:cy="85.335062"
   inkscape:cx="266.71886"
   inkscape:zoom="3.3727878"
   showgrid="false"
   id="namedview20"
   inkscape:window-height="1033"
   inkscape:window-width="1920"
   inkscape:pageshadow="2"
   inkscape:pageopacity="0"
   guidetolerance="10"
   gridtolerance="10"
   objecttolerance="10"
   borderopacity="1"
   bordercolor="#666666"
   pagecolor="#ffffff" />
<g
   transform="matrix(0.14528017,0,0,0.14528017,-4.5821164,-8.1099192)"
   id="g3065">
	
	<g
   id="g3067">
		
		
		<circle
   r="592.10315"
   cy="2971.512"
   cx="843.20502"
   id="path54"
   style="opacity:1;fill:#ffffff;fill-rule:evenodd;stroke:none;stroke-width:6.38771;stroke-linecap:round;stroke-linejoin:round;stroke-dashoffset:200;paint-order:stroke fill markers" />
		<path
   style="fill:#000000"
   d="m 973.058,3240.031 c -0.529,0 -1.025,0.231 -1.389,0.595 -7.706,8.962 -11.046,11.906 -16.602,16.37 -13.427,10.814 -28.772,-1.389 -38.594,-7.176 -21.86,-12.832 -39.454,-4.729 -43.72,5.192 -4.266,10.021 0.463,22.025 12.369,20.438 16.668,-2.15 17.395,0.43 29.466,8.069 22.455,14.22 38.826,6.482 47.192,-0.231 6.978,-5.556 10.847,-10.285 14.485,-17.065 6.449,-12.732 1.19,-22.819 -1.885,-25.795 -0.396,-0.199 -0.859,-0.397 -1.322,-0.397 z"
   id="path3075" />
		<path
   style="fill:#000000"
   d="m 843.221,2376.215 c -328.793,0 -595.313,266.52 -595.313,595.28 0,66.539 10.914,130.565 31.054,190.291 h 41.405 c 36.709,0 70.805,-8.83 99.445,-23.745 7.243,-3.704 15.411,-6.019 24.109,-6.019 18.288,0 33.964,7.11 43.918,23.48 8.598,14.849 16.635,23.58 26.49,29.83 8.466,5.424 20.107,9.921 36.709,9.161 7.805,-0.364 19.677,-2.249 22.654,-10.417 3.406,-9.359 -0.86,-16.437 -12.269,-21.166 -16.106,-6.713 -20.471,-16.569 -29.036,-31.781 -8.565,-15.18 -27.052,-23.216 -29.929,-51.789 -2.877,-28.144 19.181,-63.563 62.736,-52.252 31.484,8.135 51.822,47.027 59.429,60.355 4.002,7.011 18.057,15.213 29.466,4.795 11.377,-10.484 21.86,-10.484 30.425,2.844 7.309,11.344 60.851,82.711 118.824,84.596 58.933,1.885 90.317,-13.328 115.98,-12.369 18.024,0.694 26.721,9.756 37.04,11.409 18.09,2.844 30.922,-13.493 50.896,-12.534 16.139,0.794 33.733,11.575 51.789,11.575 18.057,0 56.122,-21.794 55.592,-12.799 -0.926,15.874 -13.162,44.051 -16.139,57.014 -2.083,8.995 -0.265,30.855 -5.655,48.284 -4.828,17.825 -21.43,40.38 -25.696,46.828 -14.584,21.86 -25.167,28.408 -37.073,51.326 -13.295,25.663 -35.155,49.408 -40.876,57.015 -7.309,9.723 41.273,-0.298 58.47,-16.635 14.651,-13.923 40.248,-55.725 80.793,-64.654 27.35,-6.019 32.84,-16.502 29.499,-26.192 -0.496,-1.124 -0.86,-2.513 -0.86,-3.869 0,-3.704 2.216,-6.945 5.324,-8.532 28.243,-11.74 66.572,-19.049 108.672,-19.049 24.605,0 48.945,3.274 71.897,8.598 60.421,-93.194 95.509,-204.28 95.509,-323.601 10e-4,-328.758 -266.519,-595.278 -595.279,-595.278 z"
   id="path3077" />
		<path
   d="m 1179.124,2813.117 c -5.887,19.777 -14.254,45.076 -51.459,64.158 -5.424,2.778 -7.507,-1.786 -4.994,-6.052 14.055,-23.91 16.569,-29.896 20.669,-39.354 5.721,-13.791 8.731,-33.435 -2.646,-74.377 -22.389,-80.561 -69.085,-188.241 -103.049,-223.197 -32.74,-33.699 -92.103,-43.191 -145.777,-29.433 -19.776,5.06 -58.437,25.167 -130.102,9.028 -124.083,-27.945 -142.47,34.196 -149.581,61.248 -7.143,27.085 -24.241,104.009 -24.241,104.009 -5.688,31.352 -13.162,85.82 179.51,122.528 89.755,17.098 94.319,40.281 98.287,56.981 7.143,29.896 18.52,47.027 31.351,55.56 12.832,8.565 0,15.643 -14.221,17.098 -38.23,3.969 -179.51,-36.543 -263.081,-84.034 -68.391,-41.802 -69.515,-79.404 -53.873,-111.35 -103.281,-11.178 -180.833,9.69 -194.855,58.569 -24.109,83.901 184.504,227.265 422.053,299.194 249.29,75.469 505.723,22.786 534.23,-133.938 12.868,-71.17 -47.09,-123.819 -148.221,-146.638 z m -382.235,-153.45 c -68.755,4.961 -75.898,12.402 -88.763,26.126 -18.156,19.347 -42.099,-25.101 -42.099,-25.101 -14.353,-3.01 -31.748,-26.159 -22.389,-47.788 9.26,-21.364 26.325,-14.981 31.682,-8.301 6.515,8.103 20.405,21.364 38.462,20.901 18.057,-0.463 38.858,-4.266 67.895,-4.266 29.433,0 49.21,10.98 50.334,20.438 0.992,8.037 -2.382,15.61 -35.122,17.991 z M 945.61,2591.21 c -12.336,-0.298 -23.943,-2.083 -33.931,-4.961 -1.191,-0.298 -2.017,-1.323 -2.017,-2.513 0,-1.19 0.86,-2.216 2.05,-2.513 23.811,-5.523 39.884,-14.518 38.726,-23.017 -1.488,-11.277 -32.641,-17.428 -69.549,-13.725 -4.035,0.43 -7.97,0.926 -11.806,1.521 -0.099,0 -0.198,0.033 -0.298,0.033 -1.058,0 -1.918,-0.827 -1.918,-1.819 0,-0.728 0.43,-1.356 1.091,-1.653 13.328,-7.044 33.203,-12.633 55.989,-14.948 6.846,-0.695 13.493,-1.058 19.942,-1.091 h 3.406 c 38.164,0.86 68.689,16.04 68.259,33.865 -0.462,17.923 -31.747,31.681 -69.944,30.821 z"
   fill="#cc0000"
   id="path3079" />
	</g><g
   transform="translate(-97.323002)"
   id="g3081">
		<path
   style="fill:#000000"
   d="m 1741.928,3009.063 c 0,-54.6 -1.124,-94.749 -3.34,-131.061 h 89.292 l 3.836,77.453 h 2.91 c 20.074,-57.412 67.63,-86.679 111.648,-86.679 10.087,0 15.94,0.364 24.175,2.216 v 97.13 c -9.657,-1.885 -18.652,-2.943 -31.054,-2.943 -49.144,0 -83.24,31.252 -92.434,78.015 -1.753,9.095 -2.679,20.008 -2.679,31.12 v 211.49 H 1741.1 Z"
   id="path3083" />
		<path
   style="fill:#000000"
   d="m 2094.961,3109.666 c 2.712,73.914 59.925,106.224 125.968,106.224 47.424,0 81.355,-7.441 112.541,-18.884 l 15.246,70.938 c -34.89,14.816 -83.339,25.862 -142.503,25.862 -132.449,0 -210.001,-81.785 -210.001,-206.727 0,-112.574 68.292,-219.063 199.452,-219.063 132.615,0 175.773,109.068 175.773,198.36 0,19.148 -1.72,34.559 -3.671,44.051 z m 179.344,-71.831 c 0.463,-37.801 -15.973,-99.379 -85.026,-99.379 -63.496,0 -89.887,57.577 -94.517,99.379 z"
   id="path3085" />
		<path
   style="fill:#000000"
   d="m 3592.386,3188.871 c 0,32.277 1.29,65.679 5.953,96.964 h -37.172 l -5.92,-58.503 h -1.918 c -19.777,31.45 -65.25,67.762 -130.135,67.762 -82.115,0 -120.346,-57.742 -120.346,-112.177 0,-94.219 83.174,-150.969 249.191,-149.217 v -10.914 c 0,-40.38 -7.838,-120.908 -104.406,-120.28 -35.717,0 -72.922,9.558 -102.454,30.425 l -12.865,-29.367 c 37.271,-25.266 82.843,-35.254 119.75,-35.254 117.799,0 140.321,88.432 140.321,161.354 z m -40.347,-121.206 c -88.895,-2.547 -206.231,10.914 -206.231,108.903 0,58.668 38.727,85.026 81.222,85.026 68.028,0 106.687,-42.099 120.775,-81.851 2.944,-8.698 4.233,-17.462 4.233,-24.439 v -87.639 0 z"
   id="path3087" />
		<path
   style="fill:#000000"
   d="m 3753.112,2787.686 v 89.954 h 116.344 v 32.74 h -116.344 v 265.296 c 0,51.888 16.105,84.43 59.958,84.43 21.033,0 35.915,-2.778 46.365,-6.383 l 4.895,31.252 c -13.196,5.523 -31.682,9.822 -56.32,9.822 -29.797,0 -54.501,-9.392 -70.441,-28.937 -18.487,-21.43 -24.803,-55.692 -24.803,-97.328 v -258.12 h -68.887 v -32.74 h 68.887 v -75.038 z"
   id="path3089" />
		
		
		<path
   style="fill:#000000"
   d="m 2712.696,2921.888 h -1.687 c -18.255,-30.128 -58.469,-53.112 -114.294,-53.112 -98.089,0 -183.478,81.156 -182.85,217.806 0,125.373 77.122,208.414 174.516,208.414 58.866,0 108.043,-28.044 132.417,-73.749 h 1.819 l 4.63,64.588 h 91.872 c -1.885,-27.713 -3.406,-72.624 -3.406,-114.393 v -449.965 l -103.083,-29.599 v 230.01 z m 0,187.116 c 0,10.814 -0.761,20.868 -3.109,30.095 -10.385,44.646 -46.862,73.385 -89.061,73.385 -64.918,0 -102.09,-54.733 -102.09,-129.672 0,-75.667 36.841,-134.236 103.248,-134.236 46.366,0 79.569,32.674 88.697,72.393 1.753,8.367 2.315,18.652 2.315,26.92 z"
   id="path3095" />
		<path
   style="fill:#000000"
   d="m 3088.383,2868.313 c -31.054,0 -58.866,8.962 -82.248,23.381 -24.274,14.22 -44.018,36.146 -55.758,58.866 h -1.621 v -190.853 l -40.38,-11.608 v 537.736 h 40.38 v -249.62 c 0,-16.569 1.257,-28.077 5.49,-40.215 17.428,-50.764 65.282,-92.434 123.124,-92.434 83.571,0 112.475,67.002 112.475,140.519 v 241.75 h 40.347 v -246.214 c -0.034,-152.028 -103.149,-171.308 -141.809,-171.308 z"
   id="path3097" />
	</g>
</g>
</svg>
