<?xml version="1.0" encoding="UTF-8" standalone="no"?>
<svg
   xmlns:dc="http://purl.org/dc/elements/1.1/"
   xmlns:cc="http://creativecommons.org/ns#"
   xmlns:rdf="http://www.w3.org/1999/02/22-rdf-syntax-ns#"
   xmlns:svg="http://www.w3.org/2000/svg"
   xmlns="http://www.w3.org/2000/svg"
   xmlns:sodipodi="http://sodipodi.sourceforge.net/DTD/sodipodi-0.dtd"
   xmlns:inkscape="http://www.inkscape.org/namespaces/inkscape"
   width="512.013"
   height="512"
   viewBox="0 0 39.477434 39.476429"
   version="1.1"
   id="svg14"
   sodipodi:docname="lg.svg"
   inkscape:version="0.92.4 (unknown)">
  <metadata
     id="metadata20">
    <rdf:RDF>
      <cc:Work
         rdf:about="">
        <dc:format>image/svg+xml</dc:format>
        <dc:type
           rdf:resource="http://purl.org/dc/dcmitype/StillImage" />
        <dc:title></dc:title>
      </cc:Work>
    </rdf:RDF>
  </metadata>
  <defs
     id="defs18" />
  <sodipodi:namedview
     pagecolor="#ffffff"
     bordercolor="#666666"
     borderopacity="1"
     objecttolerance="10"
     gridtolerance="10"
     guidetolerance="10"
     inkscape:pageopacity="0"
     inkscape:pageshadow="2"
     inkscape:window-width="1600"
     inkscape:window-height="851"
     id="namedview16"
     showgrid="false"
     inkscape:showpageshadow="false"
     fit-margin-top="0"
     fit-margin-left="0"
     fit-margin-right="0"
     fit-margin-bottom="0"
     inkscape:zoom="1.2597656"
     inkscape:cx="256.0065"
     inkscape:cy="256"
     inkscape:window-x="0"
     inkscape:window-y="24"
     inkscape:window-maximized="1"
     inkscape:current-layer="svg14" />
  <g
     id="g26"
     transform="matrix(0.50013214,0,0,0.50013214,-6.7577855,-28.46352)">
    <path
       id="path4"
       d="m 52.979,135.844 c 21.796,0 39.467,-17.67 39.467,-39.466 0,-21.796 -17.67,-39.466 -39.467,-39.466 -21.797,0 -39.467,17.67 -39.467,39.466 0,21.796 17.67,39.466 39.467,39.466 z"
       inkscape:connector-curvature="0"
       style="fill:#a70b52" />
    <path
       id="path6"
       d="m 62.589,110.267 h -8.173 v -30.89 h -3.031 v 33.938 h 3.031 v -0.02 h 8.173 z"
       inkscape:connector-curvature="0"
       style="fill:#ffffff" />
    <path
       id="path8"
       d="M 82.989,97.642 H 62.637 V 94.611 H 85.97 c 0.031,0.586 0.046,1.173 0.046,1.767 0,18.247 -14.792,33.038 -33.038,33.038 -18.246,0 -33.038,-14.791 -33.038,-33.038 0,-18.247 14.792,-33.038 33.039,-33.038 0.481,0 0.961,0.01 1.438,0.031 l -0.004,3.008 a 31.023,31.023 0 0 0 -1.434,-0.033 c -16.586,0 -30.033,13.446 -30.033,30.032 0,16.587 13.446,30.032 30.033,30.032 16.134,0 29.296,-12.722 30.002,-28.683 z"
       inkscape:connector-curvature="0"
       style="fill:#ffffff" />
    <path
       id="path10"
       d="m 40.655,88.521 a 4.6425,4.6425 0 1 0 0,-9.285 4.6425,4.6425 0 0 0 0,9.285 z"
       inkscape:connector-curvature="0"
       style="fill:#ffffff" />
  </g>
</svg>
