<?xml version="1.0" encoding="UTF-8" standalone="no"?>
<svg
   xmlns:dc="http://purl.org/dc/elements/1.1/"
   xmlns:cc="http://creativecommons.org/ns#"
   xmlns:rdf="http://www.w3.org/1999/02/22-rdf-syntax-ns#"
   xmlns:svg="http://www.w3.org/2000/svg"
   xmlns="http://www.w3.org/2000/svg"
   xmlns:sodipodi="http://sodipodi.sourceforge.net/DTD/sodipodi-0.dtd"
   xmlns:inkscape="http://www.inkscape.org/namespaces/inkscape"
   width="512.01605"
   height="511.99994"
   viewBox="0 0 52.430444 52.433729"
   preserveAspectRatio="xMinYMin meet"
   version="1.1"
   id="svg4"
   sodipodi:docname="wordpress.svg"
   inkscape:version="0.92.4 (unknown)">
  <metadata
     id="metadata10">
    <rdf:RDF>
      <cc:Work
         rdf:about="">
        <dc:format>image/svg+xml</dc:format>
        <dc:type
           rdf:resource="http://purl.org/dc/dcmitype/StillImage" />
        <dc:title></dc:title>
      </cc:Work>
    </rdf:RDF>
  </metadata>
  <defs
     id="defs8" />
  <sodipodi:namedview
     pagecolor="#ffffff"
     bordercolor="#666666"
     borderopacity="1"
     objecttolerance="10"
     gridtolerance="10"
     guidetolerance="10"
     inkscape:pageopacity="0"
     inkscape:pageshadow="2"
     inkscape:window-width="1600"
     inkscape:window-height="851"
     id="namedview6"
     showgrid="false"
     inkscape:showpageshadow="false"
     fit-margin-top="0"
     fit-margin-left="0"
     fit-margin-right="0"
     fit-margin-bottom="0"
     inkscape:zoom="1.2597658"
     inkscape:cx="256.00803"
     inkscape:cy="255.99997"
     inkscape:window-x="0"
     inkscape:window-y="24"
     inkscape:window-maximized="1"
     inkscape:current-layer="svg4" />
  <path
     d="m 3.7265997,26.21614 c 0,8.90239 5.1733198,16.59554 12.6754563,20.24134 L 5.6737912,17.06331 a 22.40504,22.40504 0 0 0 -1.9471915,9.15283 z m 37.6733243,-1.135 c 0,-2.77933 -0.998476,-4.70431 -1.854664,-6.20243 -1.140146,-1.85261 -2.208736,-3.42147 -2.208736,-5.27408 0,-2.06747 1.568034,-3.99205 3.77677,-3.99205 0.09972,0 0.194102,0.0123 0.291359,0.0181 -4.001304,-3.66595 -9.332332,-5.90409 -15.187477,-5.90409 -7.857237,0 -14.769869,4.03133 -18.7913236,10.13733 0.5276128,0.0158 1.0247943,0.0267 1.447337,0.0267 2.3522566,0 5.9937306,-0.28519 5.9937306,-0.28519 1.212523,-0.0716 1.355427,1.70908 0.144343,1.8526 0,0 -1.218485,0.14332 -2.574322,0.21426 l 8.190541,24.36127 4.92185,-14.76123 -3.504122,-9.60066 c -1.211083,-0.0709 -2.358425,-0.21425 -2.358425,-0.21425 -1.211906,-0.0711 -1.069825,-1.92417 0.142081,-1.85261 0,0 3.714263,0.2854 5.924027,0.2854 2.352257,0 5.993937,-0.2854 5.993937,-0.2854 1.213139,-0.0716 1.355837,1.70909 0.144343,1.85261 0,0 -1.220953,0.14331 -2.574323,0.21425 l 8.127828,24.17663 2.24328,-7.49637 c 0.972156,-3.11078 1.712171,-5.34501 1.712171,-7.27062 z m -14.788169,3.10234 -6.747934,19.60824 a 22.489548,22.489548 0 0 0 6.353355,0.91623 c 2.618942,0 5.130551,-0.45277 7.468621,-1.27482 A 1.9749498,1.9749498 0 0 1 33.525621,47.12326 Z M 45.951664,15.42599 c 0.09664,0.71637 0.151539,1.48537 0.151539,2.31257 0,2.28235 -0.426243,4.84783 -1.710115,8.05566 L 37.523224,45.6568 c 6.686248,-3.89911 11.1835,-11.14299 11.1835,-19.44004 4.11e-4,-3.91022 -0.998475,-7.58726 -2.755266,-10.79077 z M 26.217176,0 C 11.761284,0 0,11.76046 0,26.21614 0,40.67368 11.761284,52.43373 26.217176,52.43373 40.672451,52.43373 52.43538,40.67368 52.43538,26.21614 52.435174,11.76046 40.672657,0 26.217382,0 Z m 0,51.23211 c -13.792778,0 -25.0151399,-11.22216 -25.0151399,-25.01597 0,-13.79278 11.2217449,-25.01411 25.0151399,-25.01411 13.792367,0 25.0137,11.22133 25.0137,25.01411 0,13.79381 -11.221333,25.01597 -25.0137,25.01597 z"
     id="path2"
     inkscape:connector-curvature="0"
     style="fill:#464342;stroke-width:0.20561685" />
</svg>
