<?xml version="1.0" encoding="UTF-8" standalone="no"?>
<!-- Created with Inkscape (http://www.inkscape.org/) -->

<svg
   xmlns:dc="http://purl.org/dc/elements/1.1/"
   xmlns:cc="http://creativecommons.org/ns#"
   xmlns:rdf="http://www.w3.org/1999/02/22-rdf-syntax-ns#"
   xmlns:svg="http://www.w3.org/2000/svg"
   xmlns="http://www.w3.org/2000/svg"
   xmlns:sodipodi="http://sodipodi.sourceforge.net/DTD/sodipodi-0.dtd"
   xmlns:inkscape="http://www.inkscape.org/namespaces/inkscape"
   id="svg2619"
   sodipodi:version="0.32"
   inkscape:version="0.92.4 (unknown)"
   width="731.42859"
   height="512"
   version="1.0"
   sodipodi:docname="bandeira-pr.svg">
  <metadata
     id="metadata2624">
    <rdf:RDF>
      <cc:Work
         rdf:about="">
        <dc:format>image/svg+xml</dc:format>
        <dc:type
           rdf:resource="http://purl.org/dc/dcmitype/StillImage" />
        <dc:title></dc:title>
      </cc:Work>
    </rdf:RDF>
  </metadata>
  <defs
     id="defs2622" />
  <sodipodi:namedview
     inkscape:window-height="851"
     inkscape:window-width="1600"
     inkscape:pageshadow="2"
     inkscape:pageopacity="0.0"
     guidetolerance="10.0"
     gridtolerance="10.0"
     objecttolerance="10.0"
     borderopacity="1.0"
     bordercolor="#666666"
     pagecolor="#ffffff"
     id="base"
     width="2000px"
     height="1400px"
     inkscape:zoom="1.2597656"
     inkscape:cx="365.71429"
     inkscape:cy="256"
     inkscape:window-x="0"
     inkscape:window-y="24"
     inkscape:current-layer="svg2619"
     showgrid="false"
     inkscape:showpageshadow="false"
     fit-margin-top="0"
     fit-margin-left="0"
     fit-margin-right="0"
     fit-margin-bottom="0"
     inkscape:window-maximized="1" />
  <g
     id="g18"
     transform="scale(0.36571429)">
    <rect
       y="0"
       x="0"
       height="1400"
       width="2000"
       id="rect2635"
       style="fill:#ffffff;fill-opacity:1;stroke:none;stroke-width:0.99000001;stroke-linejoin:round;stroke-miterlimit:4;stroke-dasharray:none;stroke-opacity:1" />
    <g
       id="g2597"
       transform="matrix(6.060606,0,0,6.060606,21.2122,0)">
      <path
         d="m 192.62562,97.514037 1.07197,-1.1293 1.41119,0.4796 -1.68686,0.9203 z m -14.97777,2.899203 1.87746,-6.673603 1.3118,0.3689 1.47778,5.2256 1.25438,-4.4559 1.25233,0.3525 -1.8785,6.673603 -1.35276,-0.3812 -1.46549,-5.108703 -1.22468,4.351403 z m 16.7292,5.4367 -1.44396,-0.4899 -0.0666,-1.6868 -2.62457,-0.8906 -1.04735,1.3087 -1.40606,-0.4775 4.78592,-5.697003 1.40195,0.4755 z m -1.55978,-3.426 -0.0779,-2.743403 -1.71351,2.135703 z m -19.63048,-3.404403 -1.50751,-0.2265 -0.36381,-1.6479 -2.74141,-0.413 -0.79935,1.4737 -1.46857,-0.2214 3.70166,-6.4543 1.46447,0.2203 z m -2.14187,-3.096 -0.56263,-2.6861 -1.30766,2.4053 z m -14.80561,0.7061 0.69175,-6.8981 2.93202,0.2941 c 0.73787,0.0738 1.26668,0.1906 1.58848,0.3474 0.32076,0.1568 0.56672,0.4038 0.73684,0.74 0.16807,0.3382 0.23161,0.7091 0.19062,1.117 -0.0512,0.5176 -0.24698,0.9316 -0.58415,1.239 -0.33717,0.3044 -0.81473,0.4725 -1.4286,0.4991 0.28387,0.206 0.51343,0.4233 0.68868,0.6539 0.17422,0.2305 0.4007,0.6292 0.67945,1.199 l 0.70816,1.4307 -1.66534,-0.1671 -0.85675,-1.6018 c -0.30437,-0.5739 -0.51446,-0.9346 -0.63232,-1.0883 -0.11785,-0.1527 -0.248,-0.2614 -0.39045,-0.329 -0.14348,-0.0666 -0.37304,-0.1158 -0.69483,-0.1466 l -0.2808,-0.0297 -0.28798,2.8808 z m 1.79344,-3.841 1.02892,0.1024 c 0.66818,0.0666 1.08938,0.081 1.26155,0.0421 0.17115,-0.04 0.31155,-0.1251 0.42018,-0.2532 0.10658,-0.1291 0.17217,-0.2962 0.19267,-0.5032 0.0236,-0.2326 -0.0205,-0.4253 -0.13015,-0.581 -0.10966,-0.1548 -0.27568,-0.2624 -0.49807,-0.3239 -0.11068,-0.0256 -0.44887,-0.0676 -1.01457,-0.124 l -1.08631,-0.1086 z m -6.97085,3.304 -1.52083,-0.0994 -0.50114,-1.611 -2.766,-0.1804 -0.67228,1.5352 -1.48189,-0.0964 3.14415,-6.7423 1.4778,0.0953 z m -2.39398,-2.9044 -0.78706,-2.6297 -1.10169,2.5068 z m -14.18764,2.2352 0.0881,-6.933 2.24436,0.0287 c 0.85061,0.0103 1.40606,0.0533 1.66329,0.1261 0.39558,0.1086 0.7266,0.3382 0.98998,0.6897 0.26338,0.3525 0.39251,0.8045 0.38533,1.3548 -0.005,0.4263 -0.0871,0.783 -0.24596,1.0699 -0.15884,0.289 -0.35663,0.5145 -0.59747,0.6774 -0.23981,0.162 -0.48269,0.2685 -0.72967,0.3188 -0.33409,0.0614 -0.81883,0.0901 -1.45422,0.0819 l -0.91107,-0.0112 -0.0328,2.6143 z m 1.47267,-5.7411 -0.0256,1.9656 0.76554,0.0092 c 0.55238,0.0072 0.92234,-0.0235 1.10886,-0.0942 0.18651,-0.0697 0.33306,-0.1814 0.4417,-0.3352 0.10658,-0.1537 0.16294,-0.332 0.16499,-0.537 0.003,-0.251 -0.0687,-0.4611 -0.21521,-0.6271 -0.1445,-0.165 -0.33204,-0.2706 -0.5575,-0.3136 -0.16705,-0.0349 -0.50319,-0.0533 -1.00741,-0.0595 z"
         id="path35"
         style="fill:#008d43;fill-rule:evenodd;stroke:none"
         inkscape:connector-curvature="0" />
      <path
         d="m 114.82316,150.82634 c -0.11683,0.2091 -0.11683,0.2091 -0.0789,0.7635 0.13322,0.042 0.26645,0.084 0.44682,0.1732 0.51651,1.1816 1.06889,2.2587 1.37531,3.5541 0.5739,0.1158 0.87212,0.6528 1.42655,0.4663 -0.0615,-0.907 -0.44989,-1.4891 -0.59439,-2.3397 -0.0871,0.006 -0.17422,0.0113 -0.26031,0.0164 -0.43862,-0.6795 -0.8301,-1.3128 -1.22261,-1.9451 -0.1568,-0.3946 -0.27158,-0.7922 -0.38226,-1.1386 -0.0307,-0.453 -0.0174,-0.909 -0.005,-1.3651 -0.13322,-0.042 -0.22341,-0.0871 -0.31052,-0.0819 -0.40275,-1.4409 -0.15065,-2.8726 -0.81473,-4.2971 0.77477,-2.7302 -2.52414,-4.4426 -2.96891,-0.0646 0.18037,0.0892 0.40378,0.1763 0.62822,0.2634 0.70712,2.0783 0.47039,2.4483 -1.19802,2.9074 -0.0799,0.1066 -0.1609,0.2132 -0.19677,0.3167 -1.44397,-0.7184 -1.68685,-2.3715 -0.52881,-3.3051 0.56468,-1.9574 0.48065,-2.559 1.78422,-3.9056 -0.0205,-0.3023 -0.0369,-0.5544 -0.0543,-0.8055 -2.50671,-0.9541 -3.00887,2.5672 -2.73525,4.6742 -0.13015,0.008 -0.21726,0.0134 -0.30437,0.0195 -0.45912,1.5967 -1.79241,0.5688 -2.64814,0.1671 -0.24186,-0.9962 -0.24186,-0.9962 -0.18959,-1.5045 1.8662,-0.7758 2.10293,-1.1447 3.04885,-3.2784 0.45706,-0.332 0.92029,-0.5647 1.18674,-1.1376 -0.68253,-1.0688 -3.30813,-1.2062 -4.41596,-0.8321 -0.0512,-0.0984 -0.0574,-0.1988 -0.0646,-0.2993 -1.04225,0.0656 -2.04043,0.1292 -3.0386,0.1917 0.006,0.1014 0.0133,0.2019 0.0236,0.3536 -1.35994,-0.1169 -2.50262,-0.9039 -3.726257,-1.5844 -0.524709,-0.0174 -1.002277,0.0123 -1.479844,0.043 -0.309497,-1.3456 -1.823157,-2.4637 -2.712705,-3.3686 -0.212139,-1.2 -1.766794,-4.1864 -1.006376,-5.1958 -0.381235,-0.4817 -0.381235,-0.4817 -0.879296,-0.7533 -0.239809,-1.6028 0.410951,-2.3017 1.354814,-3.1708 -0.164996,-0.495 -0.285924,-0.993 -0.402755,-1.4409 0.07276,-0.207 0.189592,-0.4171 0.309497,-0.5759 0.780914,-0.0502 1.323046,0.2193 2.111135,0.2705 -0.01025,-0.1516 -0.01742,-0.2521 -0.02357,-0.3525 1.315872,0.1189 2.166476,1.734 3.237414,0.8065 -0.158847,-1.0525 -0.269528,-2.0568 -0.381234,-3.0611 0.329994,-0.2736 0.659986,-0.5473 0.989977,-0.8219 -0.172167,-1.9103 -0.318717,-3.4188 -1.46242,-4.8628 -2.70963,-0.082 -1.41118,3.6289 -1.685833,5.366 -1.738099,1.3753 -1.998403,1.3917 -3.63812,-0.2747 0.226486,-0.5206 0.456047,-0.99 0.686632,-1.4593 1.736049,-0.1107 1.841607,-1.1284 2.19927,-2.9218 0.08711,-0.005 0.174219,-0.0102 0.261329,-0.0164 -0.01025,-0.1506 -0.01742,-0.2511 -0.02357,-0.3525 0.08609,-0.005 0.173194,-0.0113 0.303348,-0.0195 0.126053,-0.7153 0.726599,-0.8547 1.223639,-1.24 -0.0164,-0.2521 -0.03382,-0.5043 -0.04714,-0.7051 -2.336597,-1.0156 -3.815414,1.6069 -5.731833,2.2853 -0.487816,-0.1209 -0.97563,-0.2418 -1.416303,-0.3146 -0.373036,-1.6459 -0.733773,-1.8252 0.560577,-2.6656 1.085287,-0.0686 1.980981,0.2788 2.97916,0.2153 1.035068,-0.824 2.343768,-0.8066 3.566381,-0.782 1.501365,-1.0064 -2.735252,-2.4063 -2.959687,-2.4934 -0.734797,-0.5605 -0.734797,-0.5605 -2.904348,-1.6868 -1.620244,-0.0994 -2.716804,-0.8394 -3.187198,-2.6297 -0.133225,-0.042 -0.22341,-0.0871 -0.31052,-0.082 -0.01025,-0.1507 -0.01742,-0.2511 -0.02357,-0.3525 -0.960259,-0.6467 -0.853678,-1.0074 -0.848553,-2.2219 -0.534957,-0.826 -0.852652,-1.0084 -1.051467,-2.006603 0.08403,-0.0563 0.167046,-0.1117 0.294123,-0.1711 -0.06047,-0.248 -0.12093,-0.497 -0.181394,-0.7461 -1.618195,-0.7071 -1.089386,-4.4826 -1.248234,-6.192 0.219312,-0.621 1.168298,-0.7829 1.671486,-1.0678 0.480642,-0.6364 0.480642,-0.6364 0.819858,-1.4174 1.085288,-0.0686 2.211566,0.4674 3.391139,0.494 0.08403,0.6016 0.546228,3.5551 1.559779,2.4288 -0.0123,-1.4655 -0.150651,-2.2156 1.078113,-2.7485 -0.08916,-1.3087 -0.817808,-1.7689 -1.370187,-2.846 -0.621042,-0.1629 -0.621042,-0.1629 -1.482918,-0.0071 -0.647689,-1.8304 -0.313596,-2.0538 1.221588,-2.5559 0.407878,0.2275 0.819857,0.5042 1.273853,0.7788 0.368937,0.9377 0.170123,1.8611 0.796287,2.7312 0.21009,-0.1138 0.463221,-0.2316 0.717377,-0.3485 0.0328,-0.1537 0.06969,-0.2572 0.10658,-0.3607 0.08609,-0.0062 0.173196,-0.0113 0.260306,-0.0164 -0.161923,-1.1027 -0.195741,-3.5285 -0.817808,-4.3483 0.190616,-1.6807 0.190616,-1.6807 0.490891,-2.4084 0.777839,-0.0994 1.355839,0.0656 1.954335,0.534 0.04099,0.6036 0.08506,1.2585 0.129127,1.9133 -1.367113,1.0474 -1.148825,1.691 -0.932588,3.5992 -0.08711,0.0051 -0.17422,0.0113 -0.26133,0.0164 0.0082,0.7584 0.0082,0.7584 0.169097,1.2031 0.307445,0.0308 1.217488,0.163 1.528009,0.2439 1.227738,-1.1898 1.586425,-2.9832 3.262017,-3.3419 -0.0574,-0.1988 -0.71636,-0.4981 -0.77067,-0.6467 -0.433504,0.0277 -0.165,-0.1281 -0.596449,-0.0502 -0.001,-0.6569 -0.703028,-0.4735 -0.557504,-0.8875 1.336373,-0.2367 3.067293,0.2101 2.545663,2.1655 -0.91107,0.7143 -1.936918,0.3751 -2.727057,1.5884 -0.169095,0.7184 -0.335117,1.4881 -0.457071,2.2536 0.491915,0.8291 1.175472,2.5559 2.217718,2.4903 0.0502,0.0974 0.14757,0.2429 0.24391,0.3885 0.0871,-0.0052 0.17422,-0.0113 0.30437,-0.0195 0.24801,1.0976 0.54111,2.1911 0.83625,3.3358 0.94182,0.3956 0.94182,0.3956 1.18368,0.7338 1.43475,-0.698 -0.32692,-1.5977 -0.84548,-2.1716 -0.0676,-1.0074 -0.0933,-2.0169 -0.11786,-3.0263 0.65076,-0.699 1.06684,-1.6357 2.12241,-1.5004 3.10214,2.0281 2.90435,1.6869 3.04065,5.6232 0.25928,1.2482 0.59747,2.3899 -0.48679,3.1155 -0.17525,1.275903 0.45194,0.8813 0.30744,1.953303 -0.0871,0.005 -0.17422,0.0113 -0.26133,0.0164 -0.6979,2.5733 -2.52413,5.2174 -4.47642,6.6562 -0.43657,0.6344 -0.43657,0.6344 -0.68971,0.7512 0.007,0.1015 0.0133,0.2019 0.0205,0.3023 -0.38021,0.1763 -0.71738,0.3495 -1.05454,0.5227 -0.7307,2.726 1.0115,2.0599 2.53643,1.406 0.72865,-2.1193 1.5936,-2.2249 3.47825,-1.4337 0.165,0.495 0.37201,0.9879 0.58313,1.5311 -1.0484,2.5446 -4.42416,0.331 -6.11922,1.7022 -0.65999,1.2052 -0.37713,2.806 0.31257,3.9753 1.81496,1.0484 3.48337,2.5108 5.04418,0.4397 0.18344,-0.5176 0.36586,-1.0351 0.55238,-1.5014 1.21543,-0.0779 4.72238,2.1275 5.54223,3.2897 0.29413,2.4083 1.35687,5.2235 2.82237,6.9011 0.21111,0.5432 0.32794,0.991 0.28285,1.6008 -1.28513,2.9125 -2.88488,5.6949 -2.96379,9.0379 0.30437,-0.0195 0.65179,-0.041 0.9992,-0.0635 -0.0143,-0.2009 -0.0246,-0.3526 -0.0348,-0.5032 0.0871,-0.006 0.17422,-0.0113 0.30437,-0.0195 0.0851,-1.32 0.53086,-2.4616 1.54236,-2.9802 0.006,0.1005 0.0133,0.2009 0.0236,0.3526 0.56775,0.0143 0.56775,0.0143 1.64689,0.5021 0.63437,1.6285 -0.37816,1.4901 -0.56365,2.6154 -2.56103,0.1619 -2.39091,0.1004 -3.54999,2.9556 0.18447,2.7188 3.19642,0.2019 4.05523,2.5753 0.16704,-0.1117 0.37713,-0.2264 0.58722,-0.3412 0.42632,-1.443 2.45137,-0.5094 3.16568,-2.8306 0.30129,-0.0697 2.62969,0.8455 4.08289,1.0566 1.18674,0.784 0.97973,2.8705 2.71065,3.3174 0.0564,0.1988 0.11376,0.3976 0.17422,0.6466 0.0871,-0.006 0.17422,-0.0112 0.30437,-0.0194 0.14348,0.1936 0.29106,0.4365 0.43863,0.6804 1.4532,0.8691 1.14883,2.8101 2.76292,3.466 0.19164,0.8977 0.0195,1.5669 0.124,2.4698 0.79629,0.8096 0.4294,1.1868 0.37099,2.2526 0.99408,1.8088 -0.27363,3.0519 -1.07607,4.7213 0.0287,1.0597 0.0133,2.1235 -0.17934,3.1462 0.35459,0.0789 0.82293,0.5555 1.81906,1.0986 0.64462,-0.1414 1.33227,-0.2859 2.01993,-0.4314 0.58415,0.2664 0.58415,0.2664 1.90104,0.3853 1.22672,-1.1908 3.23332,0.0984 4.09724,-0.6641 -0.0143,-0.2019 -0.0236,-0.3525 -0.0348,-0.5031 -0.37099,-0.3311 -0.74197,-0.6611 -1.10988,-0.9419 -0.0779,-1.158 0.15782,-2.1849 0.16602,-3.3481 1.29435,-0.8403 1.59975,-0.2029 2.91869,-0.0338 1.22877,-2.4544 3.43623,-0.1158 4.9048,0.9541 2.86643,0.4756 2.601,1.7064 4.52049,3.6576 1.7873,0.6457 1.6223,1.4143 1.97894,3.465 0.2808,0.2859 0.2808,0.2859 1.2964,0.4744 1.27795,1.4871 2.5682,-0.0614 3.61352,1.8447 0.18139,0.7471 0.18139,0.7471 0.0482,1.362 -1.91847,1.2851 -2.09884,3.7744 -0.14348,4.9653 2.36222,0.1035 4.6568,0.5144 6.98827,0.1639 0.006,0.1015 0.0133,0.2019 0.0195,0.3024 0.75529,0.2049 0.75529,0.2049 2.7127,0.1322 1.06992,0.3361 2.14189,0.7235 3.2579,1.1078 2.47495,-0.1568 4.82796,-1.4696 7.23526,-1.9759 0.91721,-0.6148 1.50752,-1.5618 0.35767,-2.4503 -0.32283,-0.8895 -0.64051,-1.7299 -0.95925,-2.5692 0.39866,-1.1878 0.4909,-2.4084 1.16112,-3.4619 0.17321,-0.58 0.65897,-1.3753 0.83833,-2.0814 0.29923,-1.1755 0.37405,-2.2249 1.33636,-2.5067 0.20189,1.0494 0.62615,1.528 1.16215,2.354 0.124,0.5483 0.25108,1.1468 0.42325,1.7432 0.0861,-0.006 0.17319,-0.0112 0.30334,-0.0194 0.0205,0.3023 0.0451,0.6548 0.1117,1.0043 0.98384,1.6571 -0.24082,2.2402 -0.44886,3.6699 0.007,0.1004 0.0133,0.2008 0.0205,0.3023 -0.49703,0.3853 -0.94797,0.8188 -1.39786,1.2513 0.11784,0.4479 0.11784,0.4479 0.44169,0.7307 0.50729,-0.2347 0.6436,-0.7994 1.24106,-0.989 0.0635,-0.3576 0.17012,-0.7184 0.27569,-1.0791 0.12707,-0.0594 0.25415,-0.1178 0.42426,-0.1793 0.0195,-0.3546 0.082,-0.7133 0.1486,-1.0208 2.89,-1.7514 4.40163,-0.6835 1.68072,-4.1525 0.0943,-1.0105 1.04532,-2.0763 1.50238,-3.0991 0.64769,-1.4491 0.89057,-2.85 1.35994,-4.213 0.21725,-0.0134 0.43454,-0.0277 0.69483,-0.0441 0.86701,1.2093 0.86701,1.2093 1.22569,1.9963 0.0861,-0.006 0.17321,-0.0112 0.30335,-0.0194 0.0748,1.1078 0.50319,1.6366 0.99919,2.5159 -0.009,0.5063 -0.0153,1.0627 0.0215,1.6172 -1.01047,0.5185 -2.7455,1.9441 -3.09498,3.2302 2.17262,0.5196 2.44627,-1.7842 4.13926,-2.5487 -0.0113,-0.1517 -0.0174,-0.2521 -0.0246,-0.3526 0.50729,-0.2346 2.87976,-1.0883 3.00581,-1.8047 0.0871,-0.006 0.17421,-0.0112 0.30435,-0.0194 -0.0984,-0.8025 -0.57594,-1.6766 -0.62717,-2.4319 -0.90492,-1.7638 -0.0164,-2.4811 0.73888,-4.1977 1.15088,-1.0341 1.25747,-3.0089 2.63073,-3.3491 0.27569,1.5003 1.35892,2.6952 1.85187,4.1812 -1.33126,0.287 -1.58747,1.0115 -1.9195,2.5498 -0.50114,0.3351 -0.87418,0.6118 -1.14063,1.1847 0.0973,0.1455 0.23672,0.288 0.37817,0.4314 0.66304,-0.497 0.91719,-0.6148 1.11602,-1.5382 0.92438,-0.5134 1.16522,-0.8322 1.66124,-1.8744 0.4745,-0.081 1.38248,-0.1896 1.51161,-0.8547 2.04657,-0.6866 2.71475,-0.4755 2.76804,-2.9064 -0.50215,-0.9797 -0.50215,-0.9797 -0.78809,-1.9738 -0.0861,0.006 -0.1732,0.0113 -0.2603,0.0164 -0.0133,-0.2009 -0.0236,-0.3515 -0.0338,-0.5032 0.0871,-0.005 0.17424,-0.0103 0.26031,-0.0164 0.10455,-1.6756 1.11193,-2.9023 1.16934,-4.6261 0.0871,-0.005 0.17319,-0.0102 0.26031,-0.0164 0.1824,-1.1744 0.54416,-2.2597 1.74218,-1.324 1.38044,3.6555 1.38044,3.6555 1.77602,4.338 1.62023,0.0995 2.34787,-0.0983 3.62172,-1.241 -0.0779,-1.1581 -1.45628,-2.8408 -2.27921,-3.3952 0.0318,-1.4696 0.52778,-2.5119 0.96334,-3.8042 0.0953,-1.1693 0.30027,-2.6492 1.26156,-3.2661 1.2472,1.034 2.05476,2.6512 2.47085,4.294 1.1396,0.7369 3.62479,-1.8488 3.82361,-2.7711 -1.24106,-1.5905 -2.16546,-2.7455 -2.31508,-4.9612 0.56672,-5.4756 1.01663,-4.2151 1.95741,-2.9064 0.7389,1.0679 3.06833,2.3274 2.87362,3.0233 -1.33947,0.1158 -1.49215,2.4011 -1.24209,3.7016 0.25108,-0.1681 0.54418,-0.3382 0.83829,-0.5083 0.22444,-1.0402 0.95924,-2.065 0.93464,-3.0857 l 0.84651,-1.3969 c 0.91925,-0.2316 0.94079,-1.0689 0.43554,-2.6881 -0.68458,-0.4622 -1.32612,-0.9274 -1.96867,-1.3917 -0.56057,-1.8365 -0.59235,-5.5258 -0.15375,-7.4248 0.17015,-0.0615 0.38331,-0.1261 0.60057,-0.1394 0.85982,1.1089 1.72068,2.2177 2.6266,3.3737 0.11582,1.7125 -0.24082,2.2403 0.56982,3.9087 0.82499,-0.0523 0.45809,-2.2546 0.41402,-2.9095 2.06399,-2.3561 2.06399,-2.3561 2.25053,-2.8224 -1.02997,-1.0473 -2.46984,-1.0576 -3.38705,-2.3652 -0.36278,-1.4942 -1.67968,-4.1916 -0.89979,-5.5566 1.91027,-0.121 2.75677,0.786 4.2817,2.0558 0.84137,2.1203 2.64506,-2.1409 2.91152,-2.7138 -0.11888,-1.7627 -3.23947,-2.1213 -4.26941,-3.1677 -0.49602,-1.5372 -0.99304,-3.0734 -1.48908,-4.6096 1.19393,-1.0361 1.29743,-0.7902 2.62152,0.0871 2.00556,0.6313 2.88385,0.7276 2.9771,3.4014 0.26851,0.7419 0.29924,0.6558 0.61387,1.445 -0.0625,0.3576 -0.082,0.7132 -0.0984,1.118 0.14041,0.1435 0.28081,0.286 0.42428,0.4797 0.18141,0.0891 0.042,-0.4694 0.22545,-0.329 0.41711,-0.2798 0.6395,-0.1363 0.55855,-0.6866 -0.0902,-0.0451 -0.0543,-0.4469 -0.14144,-0.4417 -0.28798,-1.0433 -0.0891,-1.073 -0.0769,-2.186 -0.13014,0.008 -0.21725,0.0133 -0.30335,0.0185 -0.10657,-1.5609 0.13834,-1.526 0.8711,-2.9372 -0.21213,-1.2011 -0.41914,-1.0361 -1.29433,-1.0812 -0.0103,-0.1516 -0.0174,-0.2521 -0.0236,-0.3525 -1.36712,-0.8742 -1.36712,-0.8742 -3.75086,-1.9369 -0.32486,-0.940803 -0.33,-1.676603 -0.4417,-2.681003 0.0871,-0.0051 -0.0133,-0.1732 0.11787,-0.1814 -0.15578,-1.0012 -0.38329,-1.7965 -0.41507,-2.9074 0.56365,-0.0358 0.70099,0.0574 1.2431,0.3259 0.006,0.1004 0.0133,0.2019 0.0236,0.3526 1.5239,0.6118 2.88385,0.7276 4.10748,2.066 0.0523,1.4132 -0.22547,3.100103 0.63437,4.207903 0.21315,-0.0635 0.43042,-0.0779 0.69071,-0.0943 0.0369,-0.1035 0.11684,-0.2101 0.19679,-0.3156 -0.23162,-2.767003 -1.00228,-5.145603 1.13548,-7.051803 -0.3515,-0.6846 -2.79263,-0.6825 -3.75289,-1.3292 -1.47576,0.0932 -1.41939,-0.3659 -1.87646,-1.9543 -0.0861,0.0051 -0.17317,0.0102 -0.26029,0.0164 -0.37406,-1.0218 -1.72991,-2.3684 -1.81189,-3.5777 2.13163,-0.7871 3.71805,0.1691 5.34445,0.37 0.56057,-0.7441 0.73993,-1.3118 1.02277,-2.2905 1.58439,-1.0617 -0.19574,-3.5275 2.34172,-4.0429 0.71122,2.1295 1.42553,4.3093 2.13982,6.4902 0.12811,0.1691 0.14451,0.5657 0.35972,0.6312 1.31997,0.3987 4.15053,-0.9735 5.36699,-1.2687 0.10147,0.1968 0.3013,0.1537 0.4458,0.3464 -1.28716,1.5998 -2.0107,2.5047 -2.61226,4.5656 -0.6313,0.3443 -1.26156,0.6876 -1.84879,1.0279 -2.11729,0.2859 -3.53562,1.2359 -2.90025,4.1792 -0.908,0.1086 -0.58414,0.3915 -0.60875,1.3026 -0.58721,0.9981 -1.53721,1.766803 -0.75732,2.981203 1.68686,0.3812 1.58642,-3.109303 2.38475,-4.045003 -0.006,-0.1004 -0.0133,-0.2019 -0.0195,-0.3023 0.16602,-0.1117 0.33615,-0.1732 0.55033,-0.2368 -0.007,-0.1014 -0.0133,-0.2019 -0.0205,-0.3023 0.75733,-0.4017 2.95968,-2.0086 3.71496,-1.8037 0.46017,1.6397 -1.45421,4.2899 -1.98917,6.043403 -1.5813,1.1119 -3.73548,1.5014 -4.79821,3.1872 0.12093,0.4981 0.24185,0.9961 0.36279,1.4942 0.0871,-0.006 0.17422,-0.0113 0.26029,-0.0164 0.007,0.1004 0.0144,0.2009 0.0246,0.3525 1.39583,0.0123 3.45366,0.1353 4.6148,-0.7481 0.26029,-0.0164 0.5206,-0.0328 0.78499,10e-4 0.0195,0.3024 0.084,0.6016 0.14758,0.9009 -0.46322,0.8885 -1.04327,1.3302 -1.79037,1.8836 -1.46036,2.2669 -1.46036,2.2669 -1.83033,2.5938 -2.15008,0.4397 -4.77977,-0.4048 -4.56557,2.7681 0.35868,0.786 0.72044,1.6233 1.08222,2.4595 1.16932,-0.124 2.96581,-0.6425 4.21713,-0.8239 0.13732,2.0148 -2.4319,3.9978 -3.70986,5.0913 -3.49668,0.5247 -4.03165,-0.3013 -4.48053,3.3686 0.14348,0.1926 0.28695,0.3863 0.47451,0.577 0.73171,-0.1476 1.14881,-0.4274 1.77294,-0.8711 1.12524,-0.122 2.25051,-0.244 3.41983,-0.369 0.0574,0.8568 -0.63641,1.5578 -1.12628,2.0435 -0.69381,3.2815 -4.67421,3.7365 -7.15839,4.3996 0.007,0.1004 0.0133,0.2008 0.0205,0.3023 -1.33535,0.2357 -1.3251,0.3874 -1.39378,1.9584 -0.77886,1.3651 -3.96913,3.1852 -3.5428,4.9786 1.30255,-0.082 2.37554,-1.6171 2.98838,-2.8695 1.54237,-0.4007 3.48235,-0.7266 5.01036,-0.0645 0.0307,0.4529 0.007,0.7583 -0.18548,1.1242 -1.54545,1.0084 -2.81622,2.2013 -4.2315,3.2015 -1.47574,0.0933 -2.9515,0.1876 -4.3842,0.2778 -0.65075,0.6989 -1.00433,3.1779 -0.75631,4.2755 1.49009,0.1076 3.18616,-0.5852 4.53996,0.0871 0.0103,0.1507 0.0236,0.3526 0.081,0.5514 -0.44684,0.4827 -0.89057,1.0166 -1.29026,1.5485 -2.10293,1.1447 -2.5723,2.5907 -5.26861,2.0527 -1.91949,0.6282 -3.37066,-0.8475 -4.64348,1.61 0.0687,1.0074 -0.0338,2.0753 0.54214,2.848 1.13857,0.0799 2.27817,0.1588 3.41675,0.2388 0.007,0.1004 0.0144,0.2008 0.0246,0.3525 0.0861,-0.006 0.17317,-0.0113 0.26031,-0.0164 0.0102,0.1507 0.0205,0.3013 0.0338,0.5032 -0.46731,0.1814 -0.93053,0.413 -1.35173,0.6426 -1.83137,1.2789 -3.89638,2.9771 -6.06797,3.1154 -1.73093,-0.4468 -3.51823,-1.0914 -5.22045,-0.4786 -1.60795,1.3661 -2.66556,2.4955 -4.5953,2.972 -0.40686,0.4304 -0.73378,0.7543 -1.29128,0.8906 0.0133,0.2019 0.0277,0.4038 0.044,0.6549 0.55444,-0.1866 0.8547,-0.2563 1.47677,-0.0933 2.17877,-1.3015 3.54077,-1.7924 5.94398,-0.4274 0.56467,-0.0358 1.12524,-0.1219 1.51777,0.5104 -0.16911,1.3763 -5.39263,3.427 -6.76179,3.8175 -1.80163,-0.8465 -3.00887,-1.9339 -4.94885,-1.608 -0.62413,0.4438 -1.18369,1.1878 -2.1378,1.9052 -0.68458,0.1957 -2.63482,0.3689 -2.86438,1.4962 -0.51343,0.1343 -1.87543,0.6251 -1.42347,1.5065 0.43041,-0.0779 0.86188,-0.1558 1.33944,-0.1855 0.0656,-0.3085 0.42326,-0.6344 0.48987,-0.9418 0.55647,-0.1363 0.82702,-0.2039 1.43166,-0.2931 1.74529,-1.2739 4.35244,0.5329 6.21352,0.9715 0.007,0.1005 0.0143,0.2019 0.0246,0.3526 0.43658,0.0225 0.43658,0.0225 0.5411,0.2695 -1.22466,0.5831 -2.40013,1.2646 -3.74572,1.3497 -2.23308,1.1529 -2.99044,1.5546 -5.33011,0.4898 -2.23104,-0.1117 -3.02016,-0.8198 -3.75495,1.856 -1.9451,0.8824 -3.17695,-0.5565 -5.04726,1.4327 0.14041,0.1425 0.28083,0.2859 0.4243,0.4786 1.69299,-0.1066 3.79388,0.5995 4.81359,-1.0832 0.49805,0.2715 1.0535,0.1557 1.55567,0.4775 1.90924,-0.1209 3.92918,1.3692 5.84046,1.9052 0.0103,0.1516 0.0236,0.3535 0.0369,0.5544 -1.42143,0.2419 -3.02425,1.0515 -4.27863,1.8396 -1.1191,0.2223 -3.54589,1.0842 -4.09007,1.4214 -2.0271,-0.3259 -3.20257,-2.2239 -4.9673,-3.1739 -0.94798,-1.7606 -2.31713,-2.0281 -3.90254,-0.9664 -0.43351,0.0277 -0.86494,0.1056 -1.29538,0.1834 -0.0103,-0.1516 -0.0174,-0.2521 -0.0236,-0.3525 -1.21545,0.7338 -2.30073,0.8024 -2.19108,2.4145 1.37327,0.9746 3.56125,3.0109 5.06469,3.3204 0.006,0.1004 0.0133,0.2009 0.0236,0.3525 0.86804,-0.0553 2.36325,1.4174 3.096,1.9277 1.76473,0.95 3.57253,1.897 5.38133,2.8449 0.006,0.1005 0.0164,0.2511 0.0267,0.4028 -0.30233,0.4028 -0.80348,0.6005 -0.92543,0.5739 -0.0738,-0.0154 0.19778,-0.166 0.14554,-0.2521 -0.0841,-0.1384 -0.16297,-0.3279 -0.30541,-0.4386 -0.17216,-0.1343 -0.54725,-0.1763 -0.56468,-0.4366 -1.32304,-0.2193 -4.22432,-1.198 -5.26349,0.1824 0.65282,1.2739 2.6881,0.8506 3.84412,1.1827 0.82189,-0.1035 1.79445,-0.4428 1.93486,-0.3003 -0.71943,0.9562 -3.98758,0.4704 -4.90581,0.4284 -3.25587,-1.7156 -5.25735,-4.8761 -8.52346,-6.7423 -0.85983,-1.1089 -2.20952,-1.732 -3.39011,-2.4155 -1.57926,0.5052 -3.21181,0.8608 -4.38522,2.2002 -2.70656,1.2329 -5.49715,3.1801 -7.04566,6.0598 -1.07401,0.8773 -9.21418,3.012 -8.74071,-0.3054 0.82498,-0.0522 1.57208,-0.6036 2.14188,-1.1959 1.27898,-0.4346 2.16238,-1.5547 3.28353,-2.3848 -0.007,-0.1004 -0.0144,-0.2009 0.0225,-0.3044 1.21544,-0.0779 2.02915,-0.9387 3.23536,-1.1662 2.64302,-1.5332 2.64302,-1.5332 4.00706,-2.6318 1.45627,-0.3955 1.45627,-0.3955 3.56536,-1.4388 -0.0205,-0.3023 -0.041,-0.6047 -0.0584,-0.8568 -4.66601,-0.6651 -4.66601,-0.6651 -5.16407,-0.9367 -1.33227,0.287 -4.13106,0.8179 -5.36392,-0.0143 -1.4327,0.0912 -1.21442,1.3927 -0.6149,2.518 0.72251,0.3587 1.44706,0.7676 2.21567,1.1734 0.14655,2.1654 -1.16112,2.2485 -2.59485,1.6817 -0.2726,-1.4491 -0.6938,-3.2425 -1.42963,-4.46 -0.30437,0.0195 -0.60772,0.0379 -0.86905,0.0543 -0.54828,1.5526 0.24801,3.0192 -0.71122,4.294 -2.17468,0.0871 -2.17468,0.0871 -2.44523,-0.0471 -0.60464,-2.4914 2.14086,-2.5129 1.99021,-4.7285 -1.73605,0.1096 -2.71681,1.0822 -3.9343,2.4237 -2.21259,0.7973 -4.50409,1.0945 -6.86528,0.992 -1.39684,-0.6702 -2.19005,-1.4296 -3.7529,-1.3302 -0.83933,-0.8066 -1.08734,-1.2462 -2.15418,-2.1901 -1.38351,-0.4683 -1.92462,-0.7378 -2.50467,-2.2177 -0.73889,-0.6108 -1.9984,-1.1888 -2.2874,-2.2321 0.62002,-1.1519 -0.454,-2.1961 -0.0154,-3.4382 0.21009,-0.1138 0.46732,-0.1814 0.72455,-0.248 0.007,0.1004 0.0133,0.2019 0.0246,0.3525 0.86086,-0.1558 1.94614,-0.2244 2.50672,-0.9685 -0.31565,-0.7891 -0.22649,-1.4019 -0.53803,-2.1398 -0.5944,-0.4181 -0.5944,-0.4181 -2.93099,-1.4327 -1.68584,-1.7145 -2.81314,-0.9848 -4.2397,1.1283 0.34127,3.1135 0.66614,3.3963 -2.21361,3.3768 -0.77477,-2.4288 1.14575,-2.3991 1.35379,-4.4856 0.47962,-0.6375 1.1396,-1.1847 1.33022,-1.6018 -0.15065,-0.2941 -0.25826,-0.5903 -0.36176,-0.8363 -0.52164,0.0328 -1.04225,0.0656 -1.51982,0.0964 -0.45194,-0.8814 -2.46162,0.3576 -3.04474,0.7491 -0.83216,-0.0482 -1.61717,-0.0492 -2.40219,-0.0502 -0.62309,-1.4778 -1.41733,-0.9715 -2.67274,-0.8414 -0.007,-0.1014 -0.0143,-0.2019 -0.0205,-0.3023 -1.37019,-0.2675 -2.23616,-1.4768 -3.66374,-1.9431 -0.10351,-0.2459 -0.20804,-0.4919 -0.2644,-0.6907 -0.7553,-0.205 -2.65532,-2.5118 -3.10419,-3.343 0.0881,-1.2708 0.30335,-2.5989 0.1281,-3.9025 1.20827,-0.1783 3.26816,-1.32 4.32783,-0.4765 0.13117,0.6487 0.30539,1.2953 0.48064,1.942 z m 98.86667,-10.0433 0.33819,-0.0891 0.32895,0.6138 -0.26336,0.3495 -0.45708,0.0297 z m -59.75637,45.4427 c -0.37406,-0.3812 -0.72148,-0.3587 -1.20622,-0.4294 0.0297,-0.2039 0.0594,-0.4079 0.0933,-0.5616 0.98075,-0.3156 3.88613,-1.2082 4.79822,-0.6077 -0.0328,0.1537 0.11068,0.578 0.0779,0.7317 -0.43453,0.0267 -0.56058,0.0595 -0.71123,0.4233 -1.03097,0.2172 -2.06707,0.1793 -3.05192,0.4437 z m -2.11729,-7.4515 c -0.33204,-0.3843 -0.33204,-0.3843 -0.39865,-0.7337 0.49909,-0.9921 0.75734,-0.4018 0.81166,0.4037 -0.16705,0.1117 -0.29003,0.2214 -0.41301,0.33 z m -5.80971,-3.3747 c -1.92565,-0.7379 -3.7857,-0.5186 -5.51355,-1.5721 -0.20496,-1.0996 -0.20496,-1.0996 -0.13835,-1.4071 0.7471,0.1046 0.76144,0.3054 1.28308,0.9306 1.43987,0.009 2.69323,0.4868 4.08904,0.4991 1.10988,0.2838 2.11318,-0.3362 3.05909,0.1096 0.0143,0.2009 0.0277,0.4028 0.0851,0.6016 -0.87417,0.6108 -1.82623,0.7225 -2.86437,0.8383 z m -7.80608,-2.5897 c -0.77579,-0.5073 -0.96333,-0.6979 -1.33534,-1.6859 0.29002,-0.8782 1.28923,-0.2838 1.79036,0.039 0.0277,0.4027 0.0584,0.8557 0.0892,1.3087 -0.21111,0.1148 -0.37713,0.2265 -0.54418,0.3382 z m 17.41481,-2.3182 c -0.49191,-0.828 -0.71328,-1.5218 -0.48167,-2.5989 0.34025,-0.123 0.50422,-0.2849 0.86803,-0.0554 0.0584,0.8568 0.0933,2.0169 -0.38636,2.6543 z m -19.52902,0.0748 c -0.91926,-0.6999 -2.72193,-2.2033 -1.68173,-3.5848 0.21726,-0.0133 0.43453,-0.0277 0.69791,0.006 0.16499,0.4949 0.0584,0.8557 0.13527,1.3568 0.67023,0.868 1.03097,1.0474 1.33535,1.6859 -0.16295,0.1619 -0.32692,0.3238 -0.4868,0.5359 z m -10.77805,-4.626 c -0.13733,-0.0933 -0.27363,-0.1855 -0.36381,-0.2306 -0.0277,-0.4028 -0.0277,-0.4028 0.16192,-0.8188 0.17422,-0.0113 0.34741,-0.0226 0.52163,-0.0328 0.0564,0.1978 0.11683,0.4468 0.17729,0.6968 -0.16704,0.1107 -0.33306,0.2235 -0.49703,0.3854 z m 23.2112,-3.6463 c -0.79629,-0.8096 -2.2915,-0.3608 -3.31735,-0.7 -0.46527,-0.4263 -0.46527,-0.4263 -1.23081,-0.7819 -0.0133,-0.2019 -0.0236,-0.3526 -0.0338,-0.5042 0.71123,-0.4489 4.93349,0.0922 4.8761,1.8149 -0.12707,0.0595 -0.21111,0.1148 -0.29412,0.1712 z m -11.6594,0.3843 c -0.1773,-0.039 -0.31053,-0.081 -0.44478,-0.123 -0.0564,-0.1988 -0.11068,-0.3474 -0.12093,-0.4981 0.38431,-0.126 0.76862,-0.2511 1.19597,-0.3792 0.2808,0.286 0.2808,0.286 0.2972,0.5371 -0.28285,0.3217 -0.28285,0.3217 -0.92746,0.4632 z m 5.62217,-1.9749 c -0.23468,-0.2377 -0.29105,-0.4365 -0.23161,-0.8444 0.47347,-0.081 0.79731,-0.455 1.25541,-0.1302 -0.11376,0.2603 -0.17935,0.5678 -0.24596,0.8752 -0.2603,0.0164 -0.52061,0.0328 -0.77784,0.0994 z m -20.82132,-1.613 c -0.4171,-0.3782 -0.79218,-0.7584 -1.16317,-1.0894 -0.0102,-0.1507 0.0266,-0.2542 0.0625,-0.3577 0.84856,-0.3566 2.06092,0.1732 2.99044,0.3669 0.0133,0.2009 0.0266,0.4028 0.0441,0.6549 -0.64461,0.1414 -1.28922,0.2838 -1.93384,0.4253 z m 3.44956,-0.5729 c -0.17627,-0.039 -0.35357,-0.0779 -0.53086,-0.1179 -0.0133,-0.2008 -0.0277,-0.4027 -0.0369,-0.5534 0.21317,-0.0645 0.47347,-0.0809 0.73378,-0.0973 0.0133,0.2019 0.0277,0.4027 0.0451,0.6548 -0.0871,0.005 -0.17115,0.0615 -0.21111,0.1138 z m 87.89081,-7.8983 c 0.41404,-0.329 0.41404,-0.329 0.84446,-0.4069 0.0174,0.2511 0.0779,0.5001 0.13835,0.7492 -0.12707,0.0584 -0.25415,0.1178 -0.33716,0.1732 -0.0697,0.2572 -0.0933,0.5626 -0.11582,0.867 -0.17011,0.0615 -0.33715,0.1732 -0.5042,0.2849 -0.71431,0.3997 -0.96128,0.6169 -1.78625,0.6702 -0.56982,0.5913 -0.56982,0.5913 -0.91006,0.7143 -0.18446,-0.1394 -0.3679,-0.2798 -0.54829,-0.3689 -0.0184,-0.9101 2.51902,-2.0814 3.21897,-2.683 z m -5.42849,1.609 c -0.0604,-0.2491 -0.0738,-0.451 -0.0881,-0.6518 0.13015,-0.008 0.30437,-0.0195 0.47756,-0.0308 0.0102,0.1517 0.0246,0.3526 0.0379,0.5545 -0.1742,0.0102 -0.30026,0.0696 -0.42736,0.1281 z m -89.44341,5.5688 c 0.21931,-0.62 0.21931,-0.62 0.2849,-1.5854 0.17012,-0.0614 0.3843,-0.125 0.60054,-0.1393 0.41505,0.3279 0.41505,0.3279 0.62924,0.9213 -0.30539,0.6261 -0.91414,0.6651 -1.51468,0.8034 z m 10.6725,-1.4347 c -0.0174,-0.2521 -0.0338,-0.5032 -0.004,-0.7082 0.12707,-0.0584 0.25313,-0.1168 0.3802,-0.1752 0.0769,-0.1568 0.1527,-0.3136 0.23367,-0.4202 0.13322,0.0431 0.26748,0.0851 0.44374,0.124 -0.0246,0.9121 -0.29105,1.485 -0.87212,1.9267 -0.0605,-0.249 -0.12093,-0.4981 -0.18139,-0.7471 z m 79.29665,-5.3814 c -0.59644,-1.7319 0.18857,-1.7319 0.61387,-3.1749 0.26031,-0.0164 0.52061,-0.0327 0.78092,-0.0491 0.0318,1.1109 -0.64461,2.0639 -0.96743,3.0959 -0.17321,0.0103 -0.30027,0.0697 -0.42736,0.1281 z m -78.18165,2.5293 c -0.0779,-0.5011 -0.15475,-1.0023 -0.22956,-1.4522 -0.23058,-0.1875 -0.46117,-0.375 -0.64563,-0.5154 -0.0164,-0.2522 -0.0338,-0.5032 -0.0471,-0.7051 0.73788,-0.0472 1.54646,0.3064 1.86825,1.197 -0.15987,0.2121 -0.31974,0.4242 -0.47961,0.6364 0.0502,0.0984 0.1035,0.247 0.15782,0.3945 0.26748,0.742 0.17832,1.3549 -0.52983,1.197 -0.0605,-0.249 -0.0779,-0.5001 -0.0943,-0.7522 z m 88.4678,-8.3902 c -0.24493,-0.3894 -0.24493,-0.3894 -0.18548,-0.7973 1.0115,-0.5196 1.29025,-2.2065 2.70655,-1.8918 0.0677,0.1619 0.36688,0.3146 0.29513,0.458 -0.25515,0.5125 -1.51161,0.9644 -1.62535,1.8017 -0.42736,0.1281 -0.81063,0.2531 -1.19085,0.4294 z m -90.32683,2.1859 c -0.007,-0.1004 -0.0143,-0.2008 0.0267,-0.2541 0.13015,-0.008 0.2603,-0.0164 0.39046,-0.0246 0.33409,-0.2234 0.36996,-0.3269 0.8547,-0.2572 0.22444,0.745 0.22444,0.745 0.17832,1.3548 -0.37713,0.2254 -0.91004,0.7153 -1.35482,0.5913 -0.0102,-0.1507 -0.0205,-0.3023 -0.0277,-0.4028 -0.26645,-0.084 -0.53393,-0.168 -0.80141,-0.2521 -0.31872,-0.8403 -0.31872,-0.8403 -0.36996,-1.5956 0.36791,0.2808 0.73582,0.5606 1.10373,0.8403 z m 87.53625,-5.3977 c -0.0605,-0.249 -0.12093,-0.4981 -0.18141,-0.7471 0.17013,-0.0615 0.38433,-0.125 0.60158,-0.1394 0.0133,0.2019 0.0307,0.453 0.0471,0.7051 -0.17011,0.0615 -0.34023,0.123 -0.4673,0.1814 z m -91.14567,1.6817 c 0.36791,0.2808 1.20314,0.3792 2.0189,0.8332 0.0174,0.2521 0.081,0.5514 0.1445,0.8506 -0.30437,0.0195 -0.60464,0.0892 -0.90492,0.1589 -0.0533,-0.1486 -0.1035,-0.247 -0.15372,-0.3444 -0.35152,-0.0287 -0.6979,-0.006 -1.00228,0.0123 -0.11068,-0.3464 -0.22136,-0.6938 -0.33204,-1.0402 0.0769,-0.1568 0.1527,-0.3136 0.22956,-0.4704 z m -17.34615,1.403 c -0.13015,-0.6487 -0.13015,-0.6487 0.0154,-1.0627 0.21726,-0.0134 0.43452,-0.0277 0.65178,-0.041 0.0164,0.2521 0.0338,0.5032 0.0512,0.7553 -0.25416,0.1178 -0.50729,0.2347 -0.71841,0.3484 z m 17.03665,-2.7486 c -1.03814,0.1169 -1.15805,0.2757 -1.75962,0.4151 -0.54725,-0.37 -1.09246,-0.6897 -1.63766,-1.0084 0.0266,-0.2552 0.0564,-0.4592 0.12913,-0.6662 0.9992,-0.0635 2.19209,0.165 3.09393,0.6129 0.0574,0.1988 0.11376,0.3976 0.17422,0.6466 z m -15.95136,-5.0575 c -0.60874,-0.619 -1.33329,-0.3699 -2.01172,-0.7317 0.32076,-2.3468 3.71395,0.1179 2.01172,0.7317 z m -3.55203,-0.9377 c -1.38351,-0.4693 -2.17263,-1.1775 -3.44955,-2.0066 0.0225,-0.3054 0.0225,-0.3054 0.38635,-0.7327 0.74813,0.1045 0.79834,0.2019 1.36097,0.7737 0.84855,0.3003 1.70018,0.6508 2.55283,1.0013 -0.0297,0.2039 -0.0594,0.4078 -0.043,0.66 -0.30028,0.0696 -0.55341,0.1865 -0.80756,0.3043 z m 6.40309,-2.025 c -0.2808,-0.2849 -0.44887,-0.8312 -0.12196,-1.155 0.13426,0.042 0.26748,0.084 0.40071,0.1261 0.0144,0.2018 0.0277,0.4027 0.0851,0.6015 -0.124,0.1087 -0.24391,0.2685 -0.36381,0.4274 z m 118.04008,-8.2416 c -0.0174,-0.2522 0.009,-0.5063 0.0389,-0.7102 0.13015,-0.009 0.2603,-0.0175 0.39046,-0.0246 0.24494,0.3884 0.86085,0.8116 0.8086,1.321 -0.12709,0.0594 -0.53908,0.0768 -0.62311,0.1332 -0.37303,0.2767 -0.64974,0.6989 -1.04018,0.7235 0.0359,-0.7604 0.0246,-0.9121 0.4253,-1.4429 z m -129.124561,6.8201 c -0.273629,-0.1844 -0.504212,-0.372 -0.734799,-0.5595 -0.05534,-0.8055 0.160899,-1.4768 0.326921,-2.2464 0.167045,-0.1117 0.337164,-0.1722 0.551349,-0.2368 0.006,0.1005 0.0133,0.2009 0.0236,0.3526 0.0871,-0.006 0.17422,-0.0113 0.30438,-0.0195 0.0912,0.702 0.22546,1.402 0.36381,2.1511 -0.32385,0.3751 -0.32385,0.3751 -0.835231,0.5585 z m -3.69961,0.0831 c -0.01435,-0.2009 0.01537,-0.4048 0.04919,-0.5586 0.257229,-0.0676 0.513434,-0.1342 0.774766,-0.1506 0.01332,0.2008 0.02665,0.4027 0.04407,0.6548 -0.304372,0.0195 -0.607721,0.038 -0.868026,0.0544 z m 16.737401,-3.9436 c -0.38123,-0.4816 -0.24186,-0.9961 -0.10248,-1.5105 0.0871,-0.005 0.17422,-0.0113 0.30437,-0.0195 0.006,0.1014 0.0133,0.2019 0.0236,0.3525 0.0871,-0.005 0.1773,0.04 0.31052,0.082 -0.0256,0.2542 -0.009,0.5063 0.0113,0.8086 -0.21419,0.0635 -0.38021,0.1752 -0.54726,0.2869 z m -14.577075,-0.8454 c -0.267479,-0.0841 -0.49089,-0.1712 -0.715326,-0.2583 -0.07174,-1.0576 0.763493,-0.9592 1.512638,-0.8547 0.0164,0.2521 0.03382,0.5032 0.05124,0.7553 -0.2972,0.1199 -0.594398,0.2398 -0.848552,0.3577 z m 130.510115,-9.5391 c -0.72249,-0.3587 -0.48578,-1.8416 -0.49398,-2.6 0.30029,-0.0696 0.62208,-0.1977 0.9695,-0.2203 -0.0318,0.8106 0.17318,1.4255 0.14347,2.2864 -0.13016,0.009 -0.5329,0.5288 -0.61899,0.5339 z m 3.68936,-0.2336 c -0.081,-1.2093 0.43966,-2.8347 1.50444,-3.2057 0.0451,0.1742 0.41607,0.9838 0.42941,1.1406 0.04,0.4684 -0.67639,0.8353 -0.80551,1.3354 -0.1271,0.0594 -0.21011,0.1148 -0.29414,0.1711 0.007,0.1005 0.0144,0.2009 0.0246,0.3526 -0.30027,0.0697 -0.60157,0.1393 -0.8588,0.206 z m -121.81654,5.9019 c -0.0605,-0.249 -0.0779,-0.5001 -0.0953,-0.7522 0.13117,-0.008 0.30437,-0.0195 0.47756,-0.0297 0.0143,0.2008 0.0277,0.4027 0.041,0.6036 -0.17012,0.0615 -0.29618,0.1199 -0.42325,0.1783 z m 124.21462,-15.5619 c -0.0615,-0.906 -0.40583,-1.4911 0.51857,-2.0056 0.73787,-0.0461 0.84855,0.5616 0.97666,1.1611 -0.39969,0.5309 -0.89776,0.6549 -1.49523,0.8445 z m -130.23956,1.9348 c -0.13322,-0.042 -0.22341,-0.086 -0.31359,-0.1311 0.0256,-0.2552 0.0523,-0.5094 0.0789,-0.7635 0.30335,-0.0195 0.60772,-0.039 0.91107,-0.0584 -0.0256,0.2551 -0.0523,0.5093 -0.0349,0.7614 -0.21419,0.0635 -0.42735,0.1281 -0.64154,0.1916 z m -9.339204,-2.6942 c -0.02665,-0.4028 -0.05431,-0.8066 -0.08096,-1.2093 0.17627,0.04 0.353563,0.0789 0.573899,0.1158 0.06457,0.2992 0.171146,0.5954 0.281827,0.9428 -0.260305,0.0164 -0.517535,0.083 -0.774766,0.1507 z m 3.850259,-3.0263 c -0.06046,-0.249 -0.07686,-0.5012 -0.09121,-0.702 0.174218,-0.0113 0.347414,-0.0226 0.521634,-0.0328 0.01025,0.1506 0.02357,0.3525 0.03689,0.5534 -0.170121,0.0615 -0.34024,0.123 -0.467319,0.1814 z m 4.682415,-2.9771 c -0.52369,-1.2821 -0.18959,-1.5055 -0.0912,-2.623603 -0.27363,-0.1855 -0.54828,-0.3699 -0.77477,-0.5073 -0.0605,-0.249 -0.0748,-0.4509 -0.0881,-0.6517 0.2972,-0.1199 0.59747,-0.1896 0.89774,-0.2593 1.4614,0.9695 0.69893,2.585603 0.35357,3.922003 -0.13016,0.008 -0.21419,0.0645 -0.2972,0.1199 z m 133.15107,-9.149603 c -0.13628,-0.0923 -0.23057,-0.1876 -0.32076,-0.2327 -0.0881,-1.3087 0.75017,-1.9123 1.01971,-3.0929 0.16602,-0.1117 0.33613,-0.1732 0.55031,-0.2367 0.65591,0.6661 -0.48473,2.603 -0.69072,3.426 -0.13014,0.0082 -0.43146,0.0778 -0.55854,0.1363 z m -2.52822,0.0082 c -0.8547,-0.4007 -1.27283,-1.7925 -1.26156,-2.9054 1.14062,-1.1857 1.87031,0.1076 1.8457,1.6766 -0.0225,0.3044 -0.10044,0.6426 -0.0769,0.9951 -0.17013,0.0605 -0.34024,0.122 -0.50728,0.2337 z M 90.979639,101.35914 c -0.903894,-1.1057 -2.126507,-3.708803 0.04407,-3.846103 0.256207,1.197 -0.213161,2.643003 0.25928,3.826703 -0.130152,0.008 -0.217262,0.0143 -0.303346,0.0194 z m -0.105558,-6.061803 c -0.632315,-0.3146 -0.373036,-1.6458 0.456047,-0.99 -0.02665,0.2542 -0.0092,0.5063 0.0072,0.7584 -0.170121,0.0615 -0.34024,0.123 -0.46322,0.2316 z m 14.099509,-1.0463 c -0.0605,-0.2491 -0.0779,-0.5001 -0.0943,-0.7522 0.13016,-0.0082 0.30335,-0.0195 0.47757,-0.0298 0.0133,0.2009 0.0267,0.4028 0.041,0.6037 -0.17011,0.0614 -0.29719,0.1199 -0.42427,0.1783 z"
         id="path31"
         style="fill:#008d43;fill-rule:evenodd;stroke:none"
         inkscape:connector-curvature="0" />
      <path
         d="m 167.6876,54.640637 c 27.39044,0 49.8074,21.9947 50.49197,49.224203 -11.79262,-6.154003 -27.14855,-11.603003 -44.16165,-15.124303 -19.38143,-4.0122 -38.04858,-4.9827 -52.805,-3.3419 7.71384,-18.0523 25.65746,-30.758 46.47468,-30.758 z m 0.66101,6.5885 1.9246,5.9215 6.21352,-0.0093 -5.04007,3.6197 1.93178,5.9471 -5.02163,-3.6494 -0.009,0.0051 -0.006,-0.0041 -5.02162,3.6484 1.95945,-5.8846 -5.06774,-3.6822 6.21351,0.0093 z m 1.29539,49.164903 1.04941,4.3698 4.4713,0.3454 -3.83286,2.3192 1.05455,4.3893 -3.40752,-2.9105 -0.006,0.003 -0.005,-0.003 -3.82055,2.3396 1.74425,-4.1228 -3.43726,-2.9372 4.47027,0.3587 z m 23.55654,1.6684 1.61411,4.6588 4.9212,-0.1014 -3.93636,2.9433 1.62231,4.6803 -4.0337,-2.8121 -0.007,0.004 -0.005,-0.004 -3.91992,2.9669 1.46036,-4.6906 -4.06957,-2.8378 4.92119,-0.0881 z m -25.99358,24.1633 1.22159,4.461 4.6117,0.2111 -3.86665,2.5098 1.22671,4.4816 -3.60021,-2.8839 -0.007,0.003 -0.004,-0.003 -3.85436,2.5323 1.65919,-4.2991 -3.63197,-2.9084 4.61068,0.2234 z m -32.01443,-31.787 1.38146,4.7696 4.95399,0.1516 -4.11056,2.7568 1.38863,4.79 -3.91072,-3.0375 -0.007,0.004 -0.005,-0.003 -4.09519,2.7793 1.71146,-4.6414 -3.94557,-3.0642 4.95297,0.166 z m 81.66503,12.259 c -5.2471,22.2847 -25.32234,38.9596 -49.16996,38.9596 -27.81881,0 -50.50837,-22.6896 -50.50837,-50.5084 0,-2.6922 0.21623,-5.336203 0.62514,-7.916703 14.78511,-1.6684 33.52809,-0.7041 52.99049,3.324503 17.94259,3.715 34.02205,9.5596 46.0627,16.141 z"
         id="path39"
         style="fill:#2549a5;fill-rule:evenodd;stroke:none"
         inkscape:connector-curvature="0" />
    </g>
    <path
       style="fill:#008d43;fill-rule:evenodd;stroke:none"
       id="path43"
       d="M 700.32973,1e-5 H 2000 V 713.55055 Z M 1338.5443,1400 H 0 V 665.09867 Z"
       inkscape:connector-curvature="0" />
  </g>
</svg>
