<?xml version="1.0" encoding="UTF-8" standalone="no"?>
<svg
   xmlns:dc="http://purl.org/dc/elements/1.1/"
   xmlns:cc="http://creativecommons.org/ns#"
   xmlns:rdf="http://www.w3.org/1999/02/22-rdf-syntax-ns#"
   xmlns:svg="http://www.w3.org/2000/svg"
   xmlns="http://www.w3.org/2000/svg"
   xmlns:sodipodi="http://sodipodi.sourceforge.net/DTD/sodipodi-0.dtd"
   xmlns:inkscape="http://www.inkscape.org/namespaces/inkscape"
   viewBox="-1.1321106 4.7265766 6.974861 9.2439897"
   width="511.99997"
   height="511.99997"
   version="1.1"
   id="svg10"
   sodipodi:docname="ms-onedrive.svg"
   inkscape:version="0.92.4 (unknown)">
  <metadata
     id="metadata16">
    <rdf:RDF>
      <cc:Work
         rdf:about="">
        <dc:format>image/svg+xml</dc:format>
        <dc:type
           rdf:resource="http://purl.org/dc/dcmitype/StillImage" />
        <dc:title></dc:title>
      </cc:Work>
    </rdf:RDF>
  </metadata>
  <defs
     id="defs14" />
  <sodipodi:namedview
     pagecolor="#ffffff"
     bordercolor="#666666"
     borderopacity="1"
     objecttolerance="10"
     gridtolerance="10"
     guidetolerance="10"
     inkscape:pageopacity="0"
     inkscape:pageshadow="2"
     inkscape:window-width="1920"
     inkscape:window-height="1032"
     id="namedview12"
     showgrid="false"
     inkscape:showpageshadow="false"
     fit-margin-top="0"
     fit-margin-left="0"
     fit-margin-right="0"
     fit-margin-bottom="0"
     inkscape:zoom="1.6132813"
     inkscape:cx="255.99998"
     inkscape:cy="255.99998"
     inkscape:window-x="0"
     inkscape:window-y="23"
     inkscape:window-maximized="1"
     inkscape:current-layer="svg10" />
  <circle
     style="opacity:1;fill:none;fill-opacity:1;stroke:none;stroke-width:0.24240609;stroke-linecap:round;stroke-linejoin:round;stroke-miterlimit:4;stroke-dasharray:none;stroke-dashoffset:0;stroke-opacity:1;paint-order:stroke fill markers"
     id="path816"
     cx="2.35532"
     cy="9.3485718"
     r="4.621995" />
  <g
     id="g827"
     transform="matrix(0.28775048,0,0,0.28775048,-2.2308615,3.7947764)">
    <path
       id="path2"
       d="m 12.202,11.193 v -10e-4 l 6.718,4.024 4.003,-1.685 A 6.477,6.477 0 0 1 25.5,13 c 0.148,0 0.294,0.007 0.439,0.016 A 10,10 0 0 0 7.898,10.003 L 8,10 a 7.96,7.96 0 0 1 4.202,1.193 z"
       inkscape:connector-curvature="0"
       style="fill:#0364b8" />
    <path
       id="path4"
       d="M 12.203,11.192 A 7.96,7.96 0 0 0 8,10 l -0.102,0.003 a 7.997,7.997 0 0 0 -6.46,12.57 l 5.922,-2.493 2.634,-1.108 5.863,-2.468 3.062,-1.288 z"
       inkscape:connector-curvature="0"
       style="fill:#0078d4" />
    <path
       id="path6"
       d="M 25.939,13.016 A 6.577,6.577 0 0 0 25.5,13 6.477,6.477 0 0 0 22.924,13.532 l -4.004,1.684 1.161,0.695 3.805,2.279 1.66,0.994 5.677,3.4 a 6.5,6.5 0 0 0 -5.284,-9.568 z"
       inkscape:connector-curvature="0"
       style="fill:#1490df" />
    <path
       id="path8"
       d="M 25.546,19.184 23.886,18.19 20.081,15.91 18.921,15.216 15.858,16.504 9.995,18.972 7.36,20.08 1.436,22.573 A 7.989,7.989 0 0 0 8,26 h 17.5 a 6.498,6.498 0 0 0 5.723,-3.416 z"
       inkscape:connector-curvature="0"
       style="fill:#28a8ea" />
  </g>
</svg>
