<?xml version="1.0" encoding="UTF-8" standalone="no"?>
<svg
   xmlns:dc="http://purl.org/dc/elements/1.1/"
   xmlns:cc="http://creativecommons.org/ns#"
   xmlns:rdf="http://www.w3.org/1999/02/22-rdf-syntax-ns#"
   xmlns:svg="http://www.w3.org/2000/svg"
   xmlns="http://www.w3.org/2000/svg"
   xmlns:sodipodi="http://sodipodi.sourceforge.net/DTD/sodipodi-0.dtd"
   xmlns:inkscape="http://www.inkscape.org/namespaces/inkscape"
   inkscape:version="1.0 (1.0+r73+1)"
   sodipodi:docname="os-opensuse-3.svg"
   id="svg38"
   version="1.1"
   width="512"
   viewBox="0 0 512 335.4743"
   height="335.4743">
  <metadata
     id="metadata44">
    <rdf:RDF>
      <cc:Work
         rdf:about="">
        <dc:format>image/svg+xml</dc:format>
        <dc:type
           rdf:resource="http://purl.org/dc/dcmitype/StillImage" />
        <dc:title></dc:title>
      </cc:Work>
    </rdf:RDF>
  </metadata>
  <defs
     id="defs42" />
  <sodipodi:namedview
     inkscape:current-layer="svg38"
     inkscape:window-maximized="1"
     inkscape:window-y="24"
     inkscape:window-x="0"
     inkscape:cy="167.73715"
     inkscape:cx="256"
     inkscape:zoom="2.4472813"
     fit-margin-bottom="0"
     fit-margin-right="0"
     fit-margin-left="0"
     fit-margin-top="0"
     inkscape:showpageshadow="false"
     showgrid="false"
     id="namedview40"
     inkscape:window-height="1033"
     inkscape:window-width="1920"
     inkscape:pageshadow="2"
     inkscape:pageopacity="0"
     guidetolerance="10"
     gridtolerance="10"
     objecttolerance="10"
     borderopacity="1"
     bordercolor="#666666"
     pagecolor="#ffffff" />
  <g
     transform="matrix(1.0356514,0,0,1.0356514,-10.942412,0)"
     id="g137">
    <g
       id="g118">
      <path
         id="path8"
         fill="#ffffff"
         d="m 448.8433,32.888853 c 15.8505,0.556519 28.28149,13.912988 27.74353,29.742876 -0.28857,7.667603 -3.50195,14.758074 -9.11043,19.993479 -5.60642,5.256018 -12.90301,7.97678 -20.61184,7.708826 -15.82989,-0.577131 -28.23615,-13.912988 -27.72085,-29.742876 0.26795,-7.667602 3.48133,-14.778685 9.11043,-20.014091 5.60435,-5.235406 12.92155,-7.956168 20.58916,-7.688214 z m 20.22021,29.145133 c 0.37101,-11.274673 -8.45292,-20.756117 -19.72553,-21.147741 -5.46007,-0.206119 -10.65632,1.731394 -14.6344,5.462136 -3.98015,3.71013 -6.30928,8.760029 -6.47418,14.222165 -0.37101,11.274673 8.45292,20.756117 19.70698,21.168353 5.48274,0.164895 10.67693,-1.772617 14.67562,-5.482747 3.97809,-3.730742 6.28661,-8.780642 6.45151,-14.222166 z"
         style="fill-rule:nonzero;stroke-width:1.03059" />
      <path
         id="path10"
         fill="#73ba25"
         d="m 449.33798,40.886245 c 11.27467,0.391624 20.09654,9.873068 19.72553,21.147741 -0.1649,5.441524 -2.47342,10.491424 -6.45151,14.222166 -3.99869,3.71013 -9.19288,5.647642 -14.67562,5.482747 -11.25406,-0.412236 -20.07593,-9.89368 -19.70698,-21.168353 0.1649,-5.462136 2.49403,-10.512035 6.47418,-14.222165 3.97808,-3.730742 9.17227,-5.668255 14.6344,-5.462136 z m 12.40833,16.30396 c 0,-3.359729 -4.0626,-6.059879 -9.06921,-6.059879 -5.00662,0 -9.0486,2.70015 -9.0486,6.059879 0,3.318505 4.03992,6.039268 9.0486,6.039268 5.00867,0 9.06921,-2.720763 9.06921,-6.039268 z"
         style="fill-rule:nonzero;stroke-width:1.03059" />
      <path
         id="path12"
         fill="#ffffff"
         d="m 452.6771,51.130326 c 5.00867,0 9.06921,2.70015 9.06921,6.059879 0,3.318505 -4.0626,6.039268 -9.06921,6.039268 -5.00662,0 -9.0486,-2.720763 -9.0486,-6.039268 0,-3.359729 4.03992,-6.059879 9.0486,-6.059879 z"
         style="fill-rule:nonzero;stroke-width:1.03059" />
      <path
         style="fill:#73ba25;fill-rule:nonzero;stroke-width:1.03059"
         d="m 494.68402,101.44381 2.10446,-0.39162 c 0.57507,0.45346 0.49263,1.38099 0.30712,2.20546 -0.38956,1.9169 -1.31916,5.4003 -1.95812,7.04925 l -0.53591,1.36038 c -0.73997,2.01996 -1.48405,3.93686 -2.90627,5.09113 -3.91419,3.56584 -10.18018,6.41028 -19.99142,10.69754 -15.17031,6.63701 -39.76023,10.82121 -62.59814,10.67693 -8.18496,-0.18551 -16.0999,-1.09243 -23.04609,-1.87568 -21.26935,-2.4322 -36.64578,-4.16359 -39.84267,15.17031 -4.03992,24.23952 18.75883,53.67322 18.98556,53.93911 l -0.0227,0.80592 -0.73996,0.18551 c 0,0 -36.33867,-16.73681 -37.22704,-17.2315 l -1.15426,-0.82241 -0.92753,-0.88837 c -2.74137,-2.63625 -8.24473,-8.55185 -19.41635,-21.49814 -21.66304,-25.04338 -47.01559,-28.34127 -66.55561,-23.57994 -4.76133,1.13365 -10.82121,4.61705 -14.75807,8.5333 -10.20286,10.05858 -9.0486,30.32001 -8.47147,37.69905 0.68019,8.34779 1.11304,8.96614 1.29855,9.64633 l -0.12367,0.84509 -0.72142,0.0824 -0.41223,-0.28857 -29.80472,-14.57257 -1.13365,-4.86439 c -0.76263,-3.21545 -1.64894,-6.78129 -3.33911,-11.25406 -10.65632,-28.09393 -34.60727,-49.22106 -60.99042,-53.77628 -17.82924,-3.07116 -50.334099,-3.42156 -67.54498,29.06269 -7.19353,13.56259 -6.760682,31.22693 1.133651,46.10867 8.038615,15.23421 22.405063,25.00216 39.409826,26.87783 16.860483,1.83652 29.536763,-2.06118 36.647843,-11.27467 7.17292,-9.29594 8.51269,-21.9516 3.42156,-32.25752 -5.46213,-11.06649 -13.70687,-16.94293 -25.16705,-17.90962 -8.718802,-0.78325 -15.190918,2.84443 -17.520056,6.55456 -0.68019,1.15633 -1.9169,3.29996 -1.937512,6.34845 v 0.10306 c 0,8.30657 7.605767,10.57387 9.151654,10.67899 0.474073,0 2.761984,-0.0618 5.791924,-0.82448 l 1.46344,-0.47201 1.00998,-0.35246 0.74203,-0.14222 c 5.52397,-1.00998 10.84182,2.24669 12.38771,7.62638 0.26795,0.9873 0.41224,1.97873 0.41224,2.96604 0,3.56585 -1.81384,6.88435 -4.82317,8.90431 l 0.12367,-0.0433 -0.32979,0.1855 -0.49468,0.30918 c -1.58712,1.00998 -3.05056,1.5665 -4.59644,2.04057 -4.32849,1.42016 -8.16229,2.0818 -12.016703,2.0818 -13.15035,-0.0206 -31.47427,-11.33651 -31.721613,-32.58731 -0.123671,-11.99609 5.894985,-22.92036 16.489468,-29.949 12.202205,-8.05922 33.288108,-10.8006 52.848738,1.19549 24.07463,14.73746 30.36124,43.59197 24.07463,63.27833 -9.13105,28.50617 -34.81339,43.73831 -68.719858,40.70837 C 66.926625,241.46206 44.624621,228.78578 31.3506,209.69923 25.455615,201.24631 21.085906,191.82877 18.736157,182.42977 13.315245,160.93163 18.797993,138.09371 22.879136,127.9733 35.864591,95.798231 60.722463,68.116538 96.690113,45.670251 l 2.267302,-1.422216 C 175.46854,-2.7696199 229.61583,-0.87333118 269.25239,0.5076617 c 46.7497,1.6283349 96.60766,17.7467893 103.49202,20.0347023 0.0227,-1.545887 0.29062,-15.479487 0.29062,-15.479487 l 0.20612,-0.4740722 0.53591,-0.1442828 c 3.13506,0.4328485 70.30696,10.408976 98.60907,26.898443 3.50195,2.061184 5.23335,4.204814 7.39965,6.430893 7.81189,8.079838 18.15903,41.738963 19.25146,48.685151 l -0.41224,0.700803 c -0.41224,0.144283 -1.38099,0.865697 -2.67954,1.731394 -6.59579,4.617051 -22.03405,15.417654 -41.82141,13.645034 -17.78801,-1.5665 -41.01755,-11.769357 -69.02903,-30.216949 1.23877,2.906269 7.06986,16.716198 8.05922,19.045335 l 0.37102,0.45346 c 4.06259,2.102407 42.97773,21.930994 62.29102,21.539364 15.57636,-0.30917 32.21011,-7.91494 38.86774,-11.91364 z M 476.58683,62.631729 C 477.12479,46.801841 464.6938,33.445372 448.8433,32.888853 c -7.66761,-0.267954 -14.98481,2.452808 -20.58916,7.688214 -5.62703,5.235406 -8.84248,12.346489 -9.11043,20.014091 -0.5153,15.829888 11.89302,29.165745 27.72085,29.742876 7.70883,0.267954 15.00542,-2.452808 20.61184,-7.708826 5.60641,-5.235405 8.82186,-12.325876 9.11043,-19.993479 z"
         id="path20" />
    </g>
    <g
       style="fill:none;fill-rule:nonzero"
       transform="matrix(1.0305917,0,0,1.0305917,8.9167825,-0.87333118)"
       id="g96">
      <g
         id="g83">
        <path
           d="m 481.3,287.24 v 1.62 c 0,3.56 -2.702,6.16 -6.442,6.16 H 426.2 c -3.54,0 -6.18,-2.66 -6.18,-6.16 v -61.04 c 0,-3.52 2.74,-6.16 6.3,-6.16 l 0.02,0.06 h 46.5 c 3.74,0 6.46,2.58 6.46,6.138 v 1.622 c 0,3.558 -2.72,6.138 -6.46,6.138 0,0 -36.04,0 -37.82,0 v 15.98 h 29.18 c 3.74,0 6.46,2.622 6.46,6.18 v 1.602 c 0,3.58 -2.72,6.158 -6.46,6.158 0,0 -27.398,0 -29.18,0 v 15.56 h 39.84 c 3.76,0.002 6.44,2.622 6.44,6.142 z"
           fill="#73ba25"
           id="path6" />
        <path
           id="path14"
           d="m 407.2,266.82 v 9.78 c 0,11.202 -6.68,18.42 -17.1,18.42 h -39.74 c -3.74,0 -6.44,-2.62 -6.44,-6.16 v -1.62 c 0,-3.542 2.7,-6.14 6.44,-6.14 h 37.702 c 4.1,0 4.218,-5.62 4.218,-6.24 V 269 c 0,-1.92 -0.76,-4.18 -4.218,-4.18 H 360.44 c -7.86,0 -16.378,-6.44 -16.378,-16.82 v -9.06 c 0,-7.08 6.68,-17.28 18.718,-17.28 v 0.08 h 32.442 c 3.78,0 6.58,2.66 6.58,6.14 v 1.62 c 0,3.52 -2.782,6.16 -6.442,6.16 h -30.12 c -3.96,0 -6.22,1.94 -6.22,5.34 v 5.38 c 0,2.2 1.84,5.218 5.942,5.218 h 27.2 c 7.498,0.002 15.038,4.722 15.038,15.222 z"
           style="fill:#73ba25" />
        <path
           id="path16"
           d="m 324.62,221.66 c 3.622,0 6.442,2.84 6.442,6.458 v 48.06 c 0,11.18 -8.782,19.282 -20.9,19.282 h -22.46 c -12.12,0 -20.898,-8.102 -20.898,-19.282 v -48.06 c 0,-3.62 2.86,-6.458 6.44,-6.458 h 2.04 c 3.602,0 6.46,2.9 6.46,6.458 V 274.4 c 0,3.7 2.98,6.68 6.66,6.68 h 21.02 c 3.66,0 6.66,-2.98 6.66,-6.68 v -46.28 c 0,-3.558 2.9,-6.458 6.458,-6.458 h 0.042 2.036 z"
           style="fill:#73ba25" />
        <path
           id="path18"
           d="m 253.9,266.82 v 9.78 c 0,11.202 -6.72,18.42 -17.1,18.42 h -39.76 c -3.76,0 -6.46,-2.62 -6.46,-6.16 v -1.62 c 0,-3.542 2.72,-6.14 6.46,-6.14 h 37.7 c 4.08,0 4.18,-5.62 4.18,-6.24 V 269 c 0,-1.92 -0.72,-4.18 -4.18,-4.18 h -27.62 c -7.9,0 -16.38,-6.44 -16.38,-16.82 v -9.06 c 0,-7.08 6.66,-17.28 18.72,-17.28 l 0.04,0.08 h 32.46 c 3.76,0 6.58,2.66 6.58,6.14 v 1.62 c 0,3.52 -2.78,6.16 -6.46,6.16 h -30.12 c -3.98,0 -6.24,1.94 -6.24,5.34 v 5.38 c 0,2.2 1.84,5.218 5.94,5.218 h 27.18 c 7.5,0.002 15.06,4.722 15.06,15.222 z"
           style="fill:#73ba25" />
      </g>
      <g
         id="g77">
        <path
           id="path30"
           d="m 37.8,261.28 v 23.042 c 0,5.92 -4.8,10.74 -10.68,10.74 H 12.24 c -5.86,0 -10.64,-4.82 -10.64,-10.74 V 261.28 c 0,-5.84 4.94,-10.558 11.02,-10.558 h 14.16 c 6.08,-0.002 11.02,4.738 11.02,10.558 z m -7.84,22.14 v -21 c 0,-2.44 -2.06,-4.5 -4.48,-4.5 h -11.6 c -2.46,0 -4.48,2.02 -4.48,4.5 v 21 c 0,2.52 1.92,4.48 4.38,4.48 h 11.7 c 2.48,0 4.48,-2.02 4.48,-4.48 z"
           style="fill:#73ba25" />
        <path
           id="path22"
           d="m 154.24,253.2 c 2.6,-1.238 5.84,-2.76 10.12,-2.76 h 1.32 c 7.48,0 12.32,4.46 12.32,11.32 v 30.04 c 0,1.818 -1.48,3.298 -3.26,3.298 h -1.28 c -1.82,0 -3.26,-1.48 -3.26,-3.298 v -28.96 c 0,-2.72 -2.22,-4.94 -4.92,-4.94 h -10.86 c -2.72,0 -4.92,2.218 -4.92,4.94 v 28.96 c 0,1.818 -1.48,3.298 -3.26,3.298 h -1.28 c -1.82,0 -3.26,-1.48 -3.26,-3.298 v -38.28 c 0,-1.638 1.1,-2.798 2.62,-2.798 h 1.26 c 1.2,0 2.08,0.52 2.56,1.54 l 0.9,1.64 c 0.38,0.68 0.58,0.718 1.08,0.718 1.12,0 2.5,-0.68 4.12,-1.42 z"
           style="fill:#73ba25" />
        <path
           id="path24"
           d="m 132.7,261.34 v 8.86 c 0,3.782 -2.2,6.022 -5.84,6.022 0,0 -21.72,0 -22.74,0 v 6.68 c 0,3.298 1.86,5.02 5.4,5.02 h 12.6 c 1.88,0 3.26,1.3 3.26,3.08 v 1 c 0,1.8 -1.38,3.1 -3.26,3.1 h -15.36 c -5.68,0 -10.48,-5.04 -10.48,-10.958 V 261.28 c 0,-5.84 4.94,-10.558 11.02,-10.558 l 0.02,0.04 h 14.34 c 6.08,-0.002 11.04,4.758 11.04,10.578 z m -7.88,8.08 c 0,-0.92 0,-7.1 0,-7.1 0,-2.48 -1.92,-4.4 -4.38,-4.4 h -11.96 c -2.48,0 -4.38,1.96 -4.38,4.4 v 7.1 z"
           style="fill:#73ba25" />
        <path
           id="path26"
           d="m 56.68,282.96 c 0,1.878 1.04,3.5 2.58,4.34 l -1.84,4.058 c -0.34,0 -0.72,0.602 -0.72,1.16 v 19.38 c 0,1.78 -1.46,3.26 -3.26,3.26 h -1.28 c -1.84,0 -3.26,-1.46 -3.26,-3.26 v -58.38 c 0,-1.558 1.16,-2.798 2.54,-2.798 h 1.46 c 1.24,0 2.24,0.958 2.46,1.458 l 0.96,1.9 c 0.24,0.34 0.66,0.54 1.1,0.54 l 1.82,3.92 c -1.54,0.82 -2.56,2.442 -2.56,4.342 z"
           style="fill:#73ba25" />
        <path
           id="path28"
           d="m 72.92,250.46 c 7.5,0 12.32,4.458 12.32,11.318 v 22.282 c 0,6.978 -4.72,11.298 -12.32,11.298 h -1.34 c -4.3,0 -7.54,-1.478 -10.12,-2.66 -1.6,-0.738 -2.96,-1.34 -4.04,-1.34 l 1.84,-4.058 c 0.7,0.378 1.5,0.6 2.34,0.6 h 10.86 c 2.74,0 4.92,-2.22 4.92,-4.94 v -20.08 c 0,-2.762 -2.16,-4.92 -4.92,-4.92 H 61.6 c -0.86,0 -1.66,0.218 -2.36,0.578 l -1.82,-3.92 c 1.08,0 2.44,-0.638 4,-1.398 2.62,-1.24 5.84,-2.782 10.14,-2.782 v 0.022 z"
           style="fill:#73ba25" />
      </g>
    </g>
  </g>
</svg>
