<?xml version="1.0" encoding="UTF-8" standalone="no"?>
<svg
   xmlns:dc="http://purl.org/dc/elements/1.1/"
   xmlns:cc="http://creativecommons.org/ns#"
   xmlns:rdf="http://www.w3.org/1999/02/22-rdf-syntax-ns#"
   xmlns:svg="http://www.w3.org/2000/svg"
   xmlns="http://www.w3.org/2000/svg"
   xmlns:sodipodi="http://sodipodi.sourceforge.net/DTD/sodipodi-0.dtd"
   xmlns:inkscape="http://www.inkscape.org/namespaces/inkscape"
   inkscape:version="1.0 (1.0+r73+1)"
   sodipodi:docname="pay-american_express.svg"
   id="svg11"
   version="1.1"
   viewBox="0 0 512 187.08864"
   height="187.08864"
   width="512">
  <metadata
     id="metadata17">
    <rdf:RDF>
      <cc:Work
         rdf:about="">
        <dc:format>image/svg+xml</dc:format>
        <dc:type
           rdf:resource="http://purl.org/dc/dcmitype/StillImage" />
        <dc:title>AmericanExpress-light</dc:title>
      </cc:Work>
    </rdf:RDF>
  </metadata>
  <defs
     id="defs15" />
  <sodipodi:namedview
     inkscape:current-layer="svg11"
     inkscape:window-maximized="1"
     inkscape:window-y="24"
     inkscape:window-x="0"
     inkscape:cy="93.544319"
     inkscape:cx="256"
     inkscape:zoom="3.5566406"
     fit-margin-bottom="0"
     fit-margin-right="0"
     fit-margin-left="0"
     fit-margin-top="0"
     inkscape:showpageshadow="false"
     showgrid="false"
     id="namedview13"
     inkscape:window-height="1033"
     inkscape:window-width="1920"
     inkscape:pageshadow="2"
     inkscape:pageopacity="0"
     guidetolerance="10"
     gridtolerance="10"
     objecttolerance="10"
     borderopacity="1"
     bordercolor="#666666"
     pagecolor="#ffffff" />
  <title
     id="title2">AmericanExpress-light</title>
  <desc
     id="desc4">Created with Sketch.</desc>
  <g
     transform="matrix(7.4235694,0,0,7.4235694,-114.6039,-129.34983)"
     id="g28">
    <path
       style="fill-rule:evenodd;stroke:none;stroke-width:1"
       d="M 84.407361,34.665583 H 80.87432 c -0.352741,0 -0.587087,0.01317 -0.784495,0.146086 -0.204502,0.130966 -0.283269,0.325342 -0.283269,0.581908 0,0.305098 0.172701,0.512644 0.423926,0.602393 0.204502,0.07097 0.42417,0.0917 0.747068,0.0917 l 1.050641,0.02805 c 1.060181,0.0261 1.767866,0.207789 2.199375,0.650926 0.07852,0.0617 0.125734,0.130966 0.179795,0.200229 z m 0,5.332034 c -0.470892,0.686533 -1.388461,1.034555 -2.630639,1.034555 h -3.743658 v -1.734258 h 3.728492 c 0.369865,0 0.628672,-0.04853 0.784495,-0.200229 0.13503,-0.125112 0.229208,-0.306806 0.229208,-0.527521 0,-0.235592 -0.09418,-0.42265 -0.236792,-0.534837 -0.140656,-0.123405 -0.345402,-0.179499 -0.682977,-0.179499 -1.820215,-0.0617 -4.091019,0.05609 -4.091019,-2.503224 0,-1.173082 0.747069,-2.407866 2.781325,-2.407866 h 3.861321 v -1.609146 h -3.587591 c -1.082687,0 -1.869139,0.258517 -2.426138,0.660438 v -0.660438 h -5.306533 c -0.848585,0 -1.844676,0.20974 -2.315813,0.660438 v -0.660438 h -9.476075 v 0.660438 c -0.754162,-0.542398 -2.026673,-0.660438 -2.614005,-0.660438 h -6.25052 v 0.660438 c -0.596627,-0.576054 -1.923444,-0.660438 -2.732156,-0.660438 h -6.995387 l -1.60079,1.727186 -1.499274,-1.727186 h -10.44966 v 11.284996 h 10.252986 l 1.64947,-1.754501 1.553824,1.754501 6.319992,0.0056 v -2.654677 h 0.621333 c 0.838556,0.01293 1.827553,-0.02073 2.700112,-0.396799 v 3.045622 h 5.212843 v -2.94124 h 0.251469 c 0.320941,0 0.352497,0.01317 0.352497,0.332902 V 42.6201 h 15.835695 c 1.005386,0 2.056272,-0.256565 2.638222,-0.72214 v 0.72214 h 5.023019 c 1.045259,0 2.066057,-0.146086 2.842724,-0.520204 z m -7.73267,-3.230974 c 0.377448,0.389483 0.579749,0.881152 0.579749,1.713528 0,1.739868 -1.09027,2.552001 -3.04527,2.552001 h -3.775704 v -1.734258 h 3.760538 c 0.367663,0 0.628427,-0.04853 0.791833,-0.200229 0.133318,-0.125112 0.228964,-0.306806 0.228964,-0.527521 0,-0.235592 -0.103474,-0.42265 -0.236547,-0.534837 -0.148239,-0.123405 -0.352741,-0.179499 -0.690316,-0.179499 -1.812876,-0.0617 -4.083191,0.05609 -4.083191,-2.503224 0,-1.173082 0.739241,-2.407866 2.77154,-2.407866 h 3.886272 v 1.721333 h -3.556035 c -0.352497,0 -0.581706,0.01317 -0.776668,0.146086 -0.212329,0.130966 -0.291097,0.325341 -0.291097,0.581907 0,0.305099 0.180285,0.512644 0.424171,0.602393 0.204502,0.07097 0.42417,0.0917 0.754406,0.0917 l 1.043548,0.02805 c 1.052353,0.02561 1.774715,0.207057 2.213807,0.650438 z M 59.182433,36.267169 c -0.259297,0.153403 -0.579993,0.166572 -0.957197,0.166572 h -2.354953 v -1.816447 h 2.386998 c 0.345159,0 0.690561,0.0073 0.925152,0.146086 0.251224,0.130966 0.40142,0.381435 0.40142,0.727506 0,0.346071 -0.150196,0.624831 -0.40142,0.776283 z m 1.170749,1.006508 c 0.431509,0.158769 0.784251,0.443381 0.949613,0.678973 0.27373,0.394848 0.313358,0.763357 0.321186,1.47623 v 1.603292 h -1.946194 v -1.011874 c 0,-0.486548 0.04697,-1.206981 -0.313357,-1.58305 -0.28327,-0.289734 -0.715024,-0.358997 -1.422219,-0.358997 h -2.071683 v 2.953921 h -1.947906 v -8.087678 h 4.47556 c 0.981414,0 1.696192,0.04317 2.332448,0.381679 0.611794,0.368508 0.99658,0.873348 0.99658,1.795961 -2.44e-4,1.290877 -0.863752,1.949608 -1.374028,2.151543 z m 2.448887,-4.329183 h 6.469944 v 1.672556 h -4.539406 v 1.470376 H 69.1612 v 1.650119 h -4.428593 v 1.609146 l 4.539406,0.0073 v 1.678165 h -6.469944 v -8.087678 z m -13.079076,3.7324 h -2.50515 v -2.0596 h 2.527655 c 0.699856,0 1.185671,0.284369 1.185671,0.991632 0,0.699459 -0.46331,1.067968 -1.208176,1.067968 z m -4.435932,3.619724 -2.976287,-3.294383 2.976287,-3.189758 z M 37.600868,39.346691 H 32.8347 v -1.609146 h 4.255892 V 36.087426 H 32.8347 V 34.61705 h 4.860102 l 2.120363,2.356894 z m 15.411524,-3.737765 c 0,2.246658 -1.68127,2.710526 -3.37575,2.710526 h -2.418799 v 2.71272 h -3.767875 l -2.386999,-2.677357 -2.480687,2.677357 h -7.678609 v -8.087678 h 7.79676 l 2.385041,2.651018 2.465766,-2.651018 h 6.194258 c 1.538412,0 3.266894,0.424602 3.266894,2.664432 z"
       id="EXPRESS"
       fill="#0072ce" />
    <path
       style="fill-rule:evenodd;stroke:none;stroke-width:1"
       d="M 21.65485,23.624227 20.328034,20.400814 19.0088,23.624227 Z m 29.229597,-1.283561 c -0.266391,0.161207 -0.581461,0.166573 -0.958909,0.166573 h -2.354953 v -1.795961 h 2.386998 c 0.33782,0 0.690316,0.01512 0.91928,0.145842 0.251469,0.117796 0.407047,0.368509 0.407047,0.714824 0,0.353388 -0.147995,0.637756 -0.399463,0.768722 z m 16.799985,1.283561 -1.341494,-3.223413 -1.334156,3.223413 z M 36.36823,27.11323 h -1.98729 l -0.0073,-6.332689 -2.810924,6.332689 H 29.860653 L 27.04239,20.774931 v 6.338299 h -3.942778 l -0.744867,-1.803521 h -4.036223 l -0.75245,1.803521 h -2.105441 l 3.471396,-8.085727 h 2.880152 l 3.296983,7.655516 v -7.655516 h 3.16391 l 2.53695,5.485193 2.330491,-5.485193 h 3.227511 v 8.085727 z m 7.920538,0 h -6.475815 v -8.085727 h 6.475815 v 1.683775 h -4.537204 v 1.45745 h 4.428348 v 1.657435 h -4.428348 v 1.614755 h 4.537204 z m 9.130671,-5.908087 c 0,1.28917 -0.863018,1.955217 -1.365955,2.155202 0.42417,0.160963 0.786452,0.445332 0.958908,0.680924 0.27373,0.402164 0.320941,0.761405 0.320941,1.483545 v 1.588416 h -1.955244 l -0.0073,-1.019678 c 0,-0.486549 0.04672,-1.186252 -0.306019,-1.575247 -0.283269,-0.284368 -0.715023,-0.346071 -1.412923,-0.346071 h -2.080979 v 2.940996 h -1.938365 v -8.085727 h 4.458681 c 0.990709,0 1.720654,0.0261 2.34737,0.387288 0.613261,0.361192 0.980924,0.888469 0.980924,1.790352 z m 3.102266,5.908087 h -1.977994 v -8.085727 h 1.977994 z m 22.947276,0 h -2.747078 l -3.674431,-6.068807 v 6.068807 h -3.947916 l -0.754407,-1.803521 h -4.026928 l -0.731902,1.803521 h -2.268357 c -0.942275,0 -2.135285,-0.207789 -2.810924,-0.894322 -0.681266,-0.686533 -1.035719,-1.616462 -1.035719,-3.086839 0,-1.199177 0.21184,-2.295435 1.045014,-3.161711 0.626716,-0.645316 1.60813,-0.942855 2.943997,-0.942855 h 1.876722 v 1.732552 h -1.837338 c -0.70744,0 -1.106904,0.10487 -1.49169,0.478987 -0.330481,0.340462 -0.557244,0.984072 -0.557244,1.831569 0,0.866275 0.172702,1.490862 0.533026,1.89888 0.298436,0.319975 0.840758,0.417041 1.351034,0.417041 h 0.870602 l 2.732156,-6.358785 h 2.904613 l 3.282061,7.647955 v -7.647955 h 2.95158 l 3.407551,5.631279 v -5.631279 h 1.985578 z m -64.030893,1.588172 h 3.312149 l 0.746824,-1.795961 h 1.671975 l 0.744866,1.795961 h 6.516911 v -1.373066 l 0.581706,1.378919 h 3.383089 l 0.581705,-1.399405 v 1.393552 h 16.195775 l -0.0076,-2.948068 h 0.313358 c 0.219424,0.0076 0.283514,0.0278 0.283514,0.388994 v 2.559074 h 8.376509 v -0.686289 c 0.67564,0.360948 1.726526,0.686289 3.10936,0.686289 h 3.52399 l 0.754162,-1.795961 h 1.671975 l 0.737528,1.795961 h 6.790885 v -1.705968 l 1.028381,1.705968 h 5.441808 V 17.42421 h -5.385545 v 1.33185 L 75.05725,17.42421 h -5.526201 v 1.33185 L 68.838547,17.42421 H 61.37398 c -1.249517,0 -2.347859,0.17389 -3.235095,0.658487 V 17.42421 h -5.151199 v 0.658487 C 52.423104,17.583223 51.653775,17.42421 50.79834,17.42421 H 31.979021 l -1.262727,2.912706 -1.296728,-2.912706 h -5.927622 v 1.33185 l -0.651178,-1.33185 h -5.055309 l -2.347614,5.361788 v 5.915404 z"
       id="AMERICAN"
       fill="#0072ce" />
  </g>
</svg>
