<?xml version="1.0" encoding="UTF-8" standalone="no"?>
<!-- Creator: CorelDRAW 2018 (64-Bit) -->

<svg
   xmlns:dc="http://purl.org/dc/elements/1.1/"
   xmlns:cc="http://creativecommons.org/ns#"
   xmlns:rdf="http://www.w3.org/1999/02/22-rdf-syntax-ns#"
   xmlns:svg="http://www.w3.org/2000/svg"
   xmlns="http://www.w3.org/2000/svg"
   xmlns:sodipodi="http://sodipodi.sourceforge.net/DTD/sodipodi-0.dtd"
   xmlns:inkscape="http://www.inkscape.org/namespaces/inkscape"
   style="clip-rule:evenodd;fill-rule:evenodd;image-rendering:optimizeQuality;shape-rendering:geometricPrecision;text-rendering:geometricPrecision"
   width="450"
   version="1.0"
   height="512"
   xml:space="preserve"
   inkscape:version="0.92.4 (unknown)"
   sodipodi:docname="artifactory.svg"><sodipodi:namedview
     pagecolor="#ffffff"
     bordercolor="#666666"
     borderopacity="1"
     objecttolerance="10"
     gridtolerance="10"
     guidetolerance="10"
     inkscape:pageopacity="0"
     inkscape:pageshadow="2"
     inkscape:window-width="1600"
     inkscape:window-height="851"
     id="namedview15"
     showgrid="false"
     inkscape:showpageshadow="false"
     fit-margin-top="0"
     fit-margin-left="0"
     fit-margin-right="0"
     fit-margin-bottom="0"
     inkscape:zoom="1.2597656"
     inkscape:cx="225"
     inkscape:cy="256"
     inkscape:window-x="0"
     inkscape:window-y="24"
     inkscape:window-maximized="1" /><defs
     id="defs4"><style
       type="text/css"
       id="style2"><![CDATA[
    .fil1 {fill:#40BE46}
    .fil0 {fill:black;fill-rule:nonzero}
   ]]></style></defs><path
     class="fil1"
     d="M 450,512 H 0 V 477.49445 H 450 Z M 224.11162,383.92213 c -106.05325,0 -192.346065,-86.1201 -192.346065,-191.96107 C 31.765555,86.1201 118.05837,0 224.11162,0 c 106.05325,0 192.34607,86.1201 192.34607,191.96106 0,105.84097 -86.29282,191.96107 -192.34607,191.96107 z m 0,-347.25999 v 0 c -85.7886,0 -155.610391,69.65807 -155.610391,155.29892 0,85.64085 69.797781,155.29892 155.610391,155.29892 85.81262,0 155.6104,-69.65807 155.6104,-155.29892 0,-85.61688 -69.79778,-155.29892 -155.6104,-155.29892 z"
     id="path9"
     inkscape:connector-curvature="0"
     style="fill:#40be46;stroke-width:2.39862037"
     sodipodi:nodetypes="cccccsssssccsssc" /><metadata
     id="metadata8"><rdf:RDF><cc:Work
         rdf:about=""><dc:title></dc:title></cc:Work></rdf:RDF></metadata></svg>