<?xml version="1.0" encoding="UTF-8" standalone="no"?>
<svg
   xmlns:dc="http://purl.org/dc/elements/1.1/"
   xmlns:cc="http://creativecommons.org/ns#"
   xmlns:rdf="http://www.w3.org/1999/02/22-rdf-syntax-ns#"
   xmlns:svg="http://www.w3.org/2000/svg"
   xmlns="http://www.w3.org/2000/svg"
   xmlns:sodipodi="http://sodipodi.sourceforge.net/DTD/sodipodi-0.dtd"
   xmlns:inkscape="http://www.inkscape.org/namespaces/inkscape"
   viewBox="0 0 512 512"
   fill="#ffffff"
   fill-rule="evenodd"
   stroke="#000000"
   stroke-linecap="round"
   stroke-linejoin="round"
   version="1.1"
   id="svg11"
   sodipodi:docname="oracle-icon.svg"
   width="512"
   height="512"
   inkscape:version="1.0 (1.0+r73+1)">
  <metadata
     id="metadata17">
    <rdf:RDF>
      <cc:Work
         rdf:about="">
        <dc:format>image/svg+xml</dc:format>
        <dc:type
           rdf:resource="http://purl.org/dc/dcmitype/StillImage" />
        <dc:title />
      </cc:Work>
    </rdf:RDF>
  </metadata>
  <defs
     id="defs15" />
  <sodipodi:namedview
     inkscape:document-rotation="0"
     pagecolor="#ffffff"
     bordercolor="#666666"
     borderopacity="1"
     objecttolerance="10"
     gridtolerance="10"
     guidetolerance="10"
     inkscape:pageopacity="0"
     inkscape:pageshadow="2"
     inkscape:window-width="1920"
     inkscape:window-height="1033"
     id="namedview13"
     showgrid="false"
     inkscape:showpageshadow="false"
     fit-margin-top="0"
     fit-margin-left="0"
     fit-margin-right="0"
     fit-margin-bottom="0"
     inkscape:zoom="1.6386719"
     inkscape:cx="256"
     inkscape:cy="256"
     inkscape:window-x="0"
     inkscape:window-y="24"
     inkscape:window-maximized="1"
     inkscape:current-layer="svg11" />
  <g
     id="g26">
    <path
       style="fill-rule:nonzero;stroke:none;stroke-width:1"
       d="M 0,0 H 512 V 512 H 0 Z"
       fill="#e30613"
       id="path11" />
    <path
       style="fill-rule:nonzero;stroke:none;stroke-width:1"
       d="M 161.6,417.6 C 71.44,417.6 0,344.448 0,256 0,165.84 73.144,94.4 161.6,94.4 h 188.8 c 90.16,0 161.6,73.152 161.6,161.6 0,90.16 -73.144,161.6 -161.6,161.6 z m 185.408,-57.84 c 57.84,0 105.464,-47.624 105.464,-105.464 0,-57.84 -47.624,-105.464 -105.464,-105.464 h -180.32 c -57.84,0 -105.464,47.624 -105.464,105.464 0,57.84 47.64,105.464 105.472,105.464 z"
       id="path13" />
  </g>
  <symbol
     id="A"
     overflow="visible"
     transform="translate(-0.5,-0.5)">
    <g
       stroke="none"
       fill-rule="nonzero"
       id="g8">
      <path
         d="M 0,0 H 64 V 64 H 0 Z"
         fill="#e30613"
         id="path4" />
      <path
         d="M 20.2,52.2 C 8.93,52.2 0,43.056 0,32 0,20.73 9.143,11.8 20.2,11.8 H 43.8 C 55.07,11.8 64,20.944 64,32 64,43.27 54.857,52.2 43.8,52.2 Z m 23.176,-7.23 c 7.23,0 13.183,-5.953 13.183,-13.183 0,-7.23 -5.953,-13.183 -13.183,-13.183 h -22.54 c -7.23,0 -13.183,5.953 -13.183,13.183 0,7.23 5.955,13.183 13.184,13.183 z"
         id="path6" />
    </g>
  </symbol>
</svg>
