<?xml version="1.0" encoding="UTF-8" standalone="no"?>
<svg
   xmlns:dc="http://purl.org/dc/elements/1.1/"
   xmlns:cc="http://creativecommons.org/ns#"
   xmlns:rdf="http://www.w3.org/1999/02/22-rdf-syntax-ns#"
   xmlns:svg="http://www.w3.org/2000/svg"
   xmlns="http://www.w3.org/2000/svg"
   xmlns:sodipodi="http://sodipodi.sourceforge.net/DTD/sodipodi-0.dtd"
   xmlns:inkscape="http://www.inkscape.org/namespaces/inkscape"
   sodipodi:docname="gecko.svg"
   inkscape:version="1.0 (1.0+r73+1)"
   id="svg4570"
   version="1.1"
   viewBox="0 0 331.91268 331.91272"
   height="512.00006"
   width="512">
  <defs
     id="defs4564" />
  <sodipodi:namedview
     fit-margin-bottom="0"
     fit-margin-right="0"
     fit-margin-left="0"
     fit-margin-top="0"
     inkscape:showpageshadow="false"
     inkscape:document-rotation="0"
     inkscape:window-maximized="1"
     inkscape:window-y="24"
     inkscape:window-x="0"
     inkscape:window-height="1033"
     inkscape:window-width="1920"
     showgrid="false"
     inkscape:current-layer="layer1"
     inkscape:document-units="mm"
     inkscape:cy="256.00003"
     inkscape:cx="256"
     inkscape:zoom="1.6035154"
     inkscape:pageshadow="2"
     inkscape:pageopacity="0.0"
     borderopacity="1.0"
     bordercolor="#666666"
     pagecolor="#ffffff"
     id="base" />
  <metadata
     id="metadata4567">
    <rdf:RDF>
      <cc:Work
         rdf:about="">
        <dc:format>image/svg+xml</dc:format>
        <dc:type
           rdf:resource="http://purl.org/dc/dcmitype/StillImage" />
        <dc:title></dc:title>
      </cc:Work>
    </rdf:RDF>
  </metadata>
  <g
     transform="translate(18.793779,-99.813156)"
     id="layer1"
     inkscape:groupmode="layer"
     inkscape:label="Layer 1">
    <path
       sodipodi:nodetypes="csssccssccsssscccssssscscsccscssscscsssccccccssscccccccccsscscccsssccssssscscsscsssscscsssssccscccscsssscsccscssccsscsccscccccscssssssccaaaaaaaaaaaaaaaaassccccsscsscscsccccccssssssssccsssssssssscscsscccscccccccccccsscccccccsccccc"
       inkscape:connector-curvature="0"
       id="path13860"
       d="m 157.61828,430.79801 c -11.72707,-1.96128 -26.33289,-7.30202 -35.94105,-13.14212 -8.51893,-5.17803 -24.25562,-22.6088 -31.416904,-32.97309 -2.294461,-3.3207 -4.14841,-6.73557 -6.159751,-7.95049 -2.01136,-1.21494 -6.028814,-0.23005 -10.12304,-0.76827 C 56.48532,373.66418 45.850306,362.43145 45.865408,346.272 c 0.01162,-12.42939 3.218276,-20.78404 10.238991,-26.6769 8.737968,-7.33424 19.089746,-8.83342 29.779957,-4.31286 9.747231,4.12185 14.331794,11.72023 15.052924,24.94855 l 0.47656,8.74197 -18.363672,0.51533 c -14.620189,0.41029 -18.363667,1.05262 -18.363667,3.15092 0,1.4496 1.792031,4.34874 3.982289,6.44252 3.325383,3.179 10.082712,4.75944 18.071004,3.4049 4.322931,-0.73303 11.074518,-2.07248 15.397446,-2.80548 l 0.1477,11.94067 -15.062793,4.65728 12.312467,12.37162 c 21.106566,21.20794 45.566326,30.29342 74.392046,30.07291 28.5462,-0.21839 54.03061,-11.00553 73.92551,-31.2915 5.95641,-6.07348 12.21767,-13.3354 12.21767,-14.11063 0,-0.77525 -4.3411,1.02836 -7.95067,1.98112 -8.75906,2.31201 -16.08736,-0.0627 -22.7806,-6.46117 -5.225,-4.99497 -9.76688,-15.28826 -9.76688,-23.56906 0,-8.28079 2.29179,-19.70651 7.5168,-24.70146 6.30901,-6.03124 16.03005,-9.08286 25.50023,-7.44565 4.90535,0.84805 9.54612,3.69377 15.32993,9.40038 l 7.31359,10.06041 -0.36544,-16.08396 c -0.17817,-7.84443 -3.06475,-19.09952 -5.16451,-25.0784 -7.54631,-21.48746 -23.5055,-40.83383 -43.58604,-52.83674 -8.009,-4.78727 -10.2307,-5.29387 -19.77626,-4.50948 -5.91448,0.48601 -14.35572,0.0871 -18.75829,-0.88622 -7.50528,-1.65946 -8.00391,-1.52907 -7.99226,2.08991 0.008,2.12287 -1.18485,5.60837 2.28249,6.91606 4.62461,1.74413 7.88657,7.72728 5.22649,10.53609 0.008,1.54767 2.9467,3.80355 6.6045,5.06799 5.1079,1.76571 6.59208,3.2787 6.59208,6.72004 0,5.73278 -4.44652,7.297 -10.30725,3.62596 -7.09359,-4.44323 -8.61365,-3.53616 -5.60597,3.34527 3.70517,8.47725 -0.48207,8.3765 -4.95085,9.49365 l 0.63641,57.22146 c 0.4046,0 4.25207,-6.19053 8.25001,-12.6101 l 7.26902,-11.67195 19.77625,0.20049 c 0,0.53186 -4.21432,7.40737 -9.36514,14.41896 -6.89934,9.39173 -8.93119,13.52231 -7.71692,15.6878 0.90653,1.61673 5.57437,9.01625 10.37295,16.44343 l 8.7247,13.50393 -20.07369,0.18852 c -1.39005,-0.50993 -5.73552,-6.83774 -9.65659,-14.06179 l -7.12919,-13.13455 -0.0295,14.4516 -0.20314,13.7882 h -18.67607 v -46.81362 l -0.86737,-47.14533 h 8.48947 c 3.56074,0 5.77211,-0.20987 6.96291,-0.88487 1.19079,-0.67499 1.36101,-1.81513 0.83946,-3.67561 -0.62464,-2.22815 -3.06784,-4.95979 -3.08198,-6.69279 -0.0397,-4.86891 -3.38129,-3.73248 -6.61779,2.25065 -3.23319,5.97703 -8.49154,7.02135 -12.44196,2.47096 -2.21001,-2.54567 -1.7455,-3.56805 3.53629,-7.78337 3.34429,-2.669 6.08161,-5.19884 6.08294,-5.62184 0.001,-0.42304 -3.60076,-0.76916 -8.00466,-0.76916 -6.68993,0 -8.00713,-0.57902 -8.00713,-3.51987 0,-2.22461 1.65143,-3.89255 4.48776,-4.53263 4.05924,-0.91608 4.19413,-1.24575 1.41259,-3.45257 -3.79073,-3.00751 -3.90423,-4.91052 -0.37019,-6.20694 1.48774,-0.54576 4.87796,0.64172 7.53381,2.63884 2.65585,1.99712 4.82883,3.26908 4.82883,2.82655 0,-0.4425 -1.27134,-4.24924 -2.82519,-8.45941 -5.52812,-14.97857 -2.45038,-25.06117 9.06263,-29.68889 l 5.75415,-2.3129 -10.93733,-4.78258 c -11.22805,-4.90969 -16.77947,-4.90001 -9.43595,0.0171 2.26826,1.51882 4.61478,4.38797 4.61478,6.37591 0,2.01694 -4.37034,7.59272 -9.88813,12.61549 -6.19568,5.63988 -9.00895,9.35073 -7.5338,9.93745 1.29487,0.51503 2.35432,2.14221 2.35432,3.61601 0,1.86319 -1.57803,2.50318 -5.1795,2.10061 -4.74796,-0.53075 -5.17949,-0.072 -5.17949,5.50502 0,7.0914 -4.97299,11.48846 -8.82668,7.80444 -1.79224,-1.71333 -1.84254,-3.49085 -0.21546,-7.61175 1.16757,-2.95704 1.73206,-5.37644 1.25438,-5.37644 -0.47763,0 -2.81312,2.16127 -5.18993,4.80283 -2.9295,3.25578 -5.36967,4.4183 -7.57558,3.60908 -4.51011,-1.65448 -3.1148,-8.71569 2.22297,-11.24956 7.56293,-3.59015 7.22513,-4.80671 -0.97509,-3.51162 -7.16837,1.13213 -8.00467,0.8916 -8.00467,-2.30247 0,-3.7261 3.39671,-5.75246 9.64261,-5.75246 2.8849,0 3.56652,-1.06031 3.14198,-4.88744 -0.3851,-3.47188 0.41252,-5.0746 2.7539,-5.5336 2.47346,-0.4849 3.29604,0.53305 3.29604,4.0788 v 4.72498 l 6.56074,-4.78379 6.56075,-4.78379 -6.87076,-4.45732 c -5.41988,-3.51609 -7.19169,-3.95106 -8.39054,-2.05982 -5.68805,8.97313 -11.20175,12.05324 -30.046925,16.78504 -9.748626,2.44777 -22.636715,4.46567 -28.640219,4.48424 -9.105212,0.0282 -11.682166,-0.69919 -15.538476,-4.38573 -2.995546,-2.86364 -4.62303,-6.46201 -4.62303,-10.22152 0,-7.77108 13.038709,-33.12613 21.99106,-42.76379 3.64299,-3.92187 8.728922,-7.40314 13.369676,-9.56445 2.320369,-1.08066 3.201165,0.29611 5.062947,-0.0149 4.275966,-3.38303 5.300247,-1.29495 7.677888,0.59064 0.616876,-0.66684 4.153009,-2.04828 6.062999,0.0417 1.38074,1.51078 2.86788,-1.11144 5.1484,-3.4626 2.59843,-2.67892 4.72441,-6.57648 4.72441,-8.66126 0,-5.16944 5.7002,-9.69217 13.79897,-10.94854 6.37153,-0.98844 6.67236,-1.34617 5.61341,-6.67501 -0.6154,-3.09683 -1.31144,-5.86349 -1.54671,-6.14816 -0.2353,-0.28464 -2.60216,0.42955 -5.25972,1.58709 -5.6636,2.46689 -10.7225,1.11822 -10.7225,-2.85856 0,-1.67326 2.27656,-3.23758 5.65037,-3.88263 5.66008,-1.08217 7.93433,-4.23123 3.05581,-4.23123 -1.42703,0 -3.64968,-1.21536 -4.93926,-2.70079 -1.87061,-2.15471 -1.87061,-3.24685 0,-5.40158 1.28958,-1.48542 3.05416,-2.70079 3.9213,-2.70079 0.86715,0 3.73501,2.22525 6.37304,4.94499 l 4.79642,4.94497 -2.29802,-5.82009 c -1.81815,-4.6048 -1.80975,-6.28686 0.0403,-8.05542 3.46371,-3.311206 8.84365,0.66231 8.75244,6.46436 -0.0408,2.59782 0.39096,4.7233 0.95954,4.7233 0.56858,0 2.09238,-1.62048 3.38624,-3.60105 2.83583,-4.34094 8.99794,-4.73062 10.62708,-0.67206 1.35529,3.37632 -1.9075,7.87416 -5.71195,7.87416 -1.42702,0 -2.59458,0.80068 -2.59458,1.77929 0,0.97863 1.90701,1.58629 4.23776,1.3504 3.1317,-0.31696 4.23778,0.511 4.23778,3.17214 0,2.82582 -1.06407,3.4828 -4.94286,3.05171 l -4.94284,-0.54934 4.68208,9.04421 c 4.60343,8.89226 5.72523,6.74656 9.67882,6.57408 1.34821,-0.0588 1.77618,-2.16341 3.07326,-2.51988 1.48329,-0.40766 3.04036,0.77594 4.57872,0.65737 1.69798,-0.13094 3.16339,-1.49318 4.86687,-1.49026 1.86616,0.003 3.47088,1.45252 5.32546,1.65092 2.03839,0.21805 4.11526,-0.91022 6.12803,-0.5328 1.91307,0.35871 3.31256,2.07996 5.19283,2.57225 2.09623,0.54884 4.47783,-0.38478 6.50983,0.35246 1.79864,0.65258 2.78859,2.63522 4.52778,3.42141 1.72179,0.77834 3.90706,0.29743 5.58277,1.16279 1.59262,0.82246 2.31872,2.75358 3.87558,3.63637 1.37992,0.78247 3.37703,0.3501 4.6058,1.33633 0.86385,0.69337 0.78041,2.07902 1.52834,2.88618 1.36428,1.47228 3.75246,1.82006 5.13049,3.28061 1.40753,1.49183 1.86329,3.6068 2.94775,5.32765 0.56125,0.8906 1.30424,1.67147 1.83668,2.57811 0.43638,0.74312 0.2589,2.05555 1.10324,2.32893 3.00086,0.97163 2.1716,2.38745 8.37557,-4.29574 5.5565,-5.98572 7.96539,-7.39142 11.05822,-6.45302 2.17479,0.65986 8.39624,5.68977 13.82541,11.17756 l 9.87121,9.97781 -1.2346,-6.29127 c -0.74695,-3.80631 -0.43524,-6.76357 0.78914,-7.48697 3.28443,-1.94051 7.50909,2.75018 7.50909,8.33743 0,2.84962 0.66175,5.18111 1.47053,5.18111 0.8088,0 2.46218,-2.51152 3.67421,-5.58115 2.68738,-6.80615 7.09771,-6.07498 7.09771,1.17671 0,3.73728 -1.32341,5.83842 -4.70863,7.47564 -4.9436,2.39094 -4.11226,2.90402 3.91724,2.4176 2.67242,-0.16197 6.00816,1.02936 7.4127,2.64724 2.15712,2.48473 2.13378,3.19526 -0.15034,4.5751 -1.48725,0.89846 -5.45862,1.15164 -8.82531,0.56266 -3.36666,-0.58899 -6.11584,-0.37304 -6.10931,0.47988 0.005,0.85293 2.612,2.96546 5.78991,4.69452 3.67831,2.00134 5.54918,4.29137 5.14837,6.30183 -0.92705,4.64975 -8.4019,5.02717 -11.31285,0.57122 -3.43865,-5.26369 -5.55048,-4.61016 -3.30964,1.02417 1.03664,2.60653 1.38231,6.25259 0.76819,8.10237 -2.27523,6.85289 -10.28007,2.38594 -10.28007,-5.73658 0,-4.76965 -7.47337,-14.30702 -11.21079,-14.30702 -1.08535,0 -0.99206,2.45732 -0.99206,4.31411 0,1.8568 -1.44597,4.76729 -2.01387,7.61437 -0.94213,4.72322 0.18962,6.07196 12.9245,15.40231 38.05838,27.88397 54.93149,71.05105 45.73407,117.00294 -5.43221,27.14009 -18.94358,49.9072 -39.19728,66.04869 -16.08899,12.82234 -39.71616,22.87442 -63.63161,27.07177 -16.04076,2.81529 -39.48711,3.71043 -50.21061,1.91701 z M 247.55303,327.8235 c -18.18731,2.84499 -9.4704,34.78504 1.19321,33.18005 14.21193,-2.13905 14.13356,-35.57757 -1.19321,-33.18005 z m -164.031993,7.52697 c 0,-6.65638 -3.550521,-10.68479 -9.417259,-10.68479 -5.866741,0 -9.417277,4.02841 -9.417277,10.68479 0,3.26295 1.401088,2.89857 9.662594,2.89857 8.26154,0 9.171942,0.36438 9.171942,-2.89857 z m 2.671151,-114.40759 c 4.716097,-1.73007 3.462697,-3.89767 -1.707475,-2.95285 -2.577666,0.47107 -4.222742,1.57406 -3.655737,2.45111 1.223531,1.89255 1.501092,1.91852 5.363212,0.50174 z M 68.393517,187.15521 c 0.03302,-0.86397 -1.211429,-0.5622 -2.765279,0.67059 -1.553851,1.23281 -2.825176,3.51247 -2.825176,5.06592 0,2.26109 0.551556,2.12733 2.765282,-0.6706 1.520907,-1.92227 2.792232,-4.20193 2.825173,-5.06591 z M 1.7157546,374.15159 c -14.2174306,-5.2057 -20.5095336,-14.3112 -20.5095336,-29.68013 0,-15.08458 8.515569,-25.74564 22.3755136,-31.28171 10.3870584,-2.4924 38.1466124,-1.06353 38.1710914,2.15093 l -0.757558,11.27106 c -1.766006,-0.64785 -13.209777,-1.98799 -17.484613,-2.54813 -18.7410876,-2.45564 -30.7750474,14.84083 -21.900316,31.24706 3.5230709,6.51287 9.16333,9.29825 17.848622,9.29825 l 8.882234,-0.67482 0.124468,-14.52809 c -1.972889,-0.94593 -12.610975,-0.19632 -15.352175,-0.19632 l -0.197072,-9.77193 28.152652,-1.02992 -0.481123,34.51492 c -0.01492,1.0631 -10.044758,2.57413 -17.644861,3.05938 -9.704879,0.61957 -16.0238343,0.0747 -21.227263,-1.83055 z m 125.1246854,0.63966 c -13.30241,-3.64215 -20.71797,-14.49946 -20.71797,-30.33369 0,-21.88756 23.86024,-36.06343 45.07584,-30.60221 -0.0149,4.15626 -0.0292,9.37048 -0.0436,13.96362 -6.12837,-2.22742 -18.08101,-0.0563 -21.53294,4.65518 -4.05039,5.52816 -3.58253,19.65596 0.82301,24.85164 3.00607,3.5452 5.19419,4.20552 13.18417,3.97867 l 9.57993,-0.27199 -0.0247,12.81197 c -3.60665,1.98413 -20.41768,2.56931 -26.34355,0.94681 z"
       style="fill:#068bac;stroke-width:1.84152" />
  </g>
</svg>
