<?xml version="1.0" encoding="UTF-8" standalone="no"?>
<svg
   xmlns:dc="http://purl.org/dc/elements/1.1/"
   xmlns:cc="http://creativecommons.org/ns#"
   xmlns:rdf="http://www.w3.org/1999/02/22-rdf-syntax-ns#"
   xmlns:svg="http://www.w3.org/2000/svg"
   xmlns="http://www.w3.org/2000/svg"
   xmlns:sodipodi="http://sodipodi.sourceforge.net/DTD/sodipodi-0.dtd"
   xmlns:inkscape="http://www.inkscape.org/namespaces/inkscape"
   inkscape:version="1.0 (1.0+r73+1)"
   sodipodi:docname="social-pinterest.svg"
   version="1.1"
   height="512"
   width="512"
   viewBox="0 0 73.728 73.728"
   id="Layer_1">
  <metadata
     id="metadata13">
    <rdf:RDF>
      <cc:Work
         rdf:about="">
        <dc:format>image/svg+xml</dc:format>
        <dc:type
           rdf:resource="http://purl.org/dc/dcmitype/StillImage" />
        <dc:title></dc:title>
      </cc:Work>
    </rdf:RDF>
  </metadata>
  <defs
     id="defs11" />
  <sodipodi:namedview
     inkscape:current-layer="Layer_1"
     inkscape:window-maximized="1"
     inkscape:window-y="24"
     inkscape:window-x="0"
     inkscape:cy="256"
     inkscape:cx="256"
     inkscape:zoom="1.6035156"
     fit-margin-bottom="0"
     fit-margin-right="0"
     fit-margin-left="0"
     fit-margin-top="0"
     inkscape:showpageshadow="false"
     showgrid="false"
     id="namedview9"
     inkscape:window-height="1033"
     inkscape:window-width="1920"
     inkscape:pageshadow="2"
     inkscape:pageopacity="0"
     guidetolerance="10"
     gridtolerance="10"
     objecttolerance="10"
     borderopacity="1"
     bordercolor="#666666"
     pagecolor="#ffffff" />
  <style
     id="style2">.st0{fill:#ca2127}.st1{fill:#fff}</style>
  <g
     transform="matrix(0.21029093,0,0,0.21029093,-0.86219281,-0.88322191)"
     id="g17">
    <path
       class="st0"
       d="m 354.7,179.5 c 0,96.8 -78.5,175.3 -175.3,175.3 C 82.6,354.8 4.1,276.3 4.1,179.5 4.1,82.7 82.6,4.2 179.4,4.2 c 96.8,0 175.3,78.5 175.3,175.3 z"
       id="path4" />
    <path
       class="st1"
       d="m 164.7,62.9 c -49.4,5.3 -98.6,43.3 -100.6,97.7 -1.3,33.2 12.6,58.1 45.8,65.1 3.8,-15.7 4.5,-24.2 4.5,-24.2 0,0 -14.6,-14 -16.1,-22.9 C 86.1,107 185,58.1 236.9,108.1 c 35.8,34.7 12.2,141.4 -45.6,130.3 -55.4,-10.6 27.1,-95.5 -17.1,-112.2 -35.9,-13.6 -55,41.5 -38,68.8 -10,47 -31.5,91.3 -22.8,150.2 28.3,-19.5 37.8,-56.9 45.6,-95.9 14.2,8.2 21.8,16.8 39.9,18.1 66.8,4.9 104.1,-63.5 95,-126.7 -8.2,-56 -66.8,-84.5 -129.2,-77.8 z"
       id="path6" />
  </g>
</svg>
