<?xml version="1.0" encoding="UTF-8" standalone="no"?>
<svg
   xmlns:dc="http://purl.org/dc/elements/1.1/"
   xmlns:cc="http://creativecommons.org/ns#"
   xmlns:rdf="http://www.w3.org/1999/02/22-rdf-syntax-ns#"
   xmlns:svg="http://www.w3.org/2000/svg"
   xmlns="http://www.w3.org/2000/svg"
   xmlns:xlink="http://www.w3.org/1999/xlink"
   xmlns:sodipodi="http://sodipodi.sourceforge.net/DTD/sodipodi-0.dtd"
   xmlns:inkscape="http://www.inkscape.org/namespaces/inkscape"
   inkscape:version="1.0 (1.0+r73+1)"
   sodipodi:docname="hw-xbox.svg"
   id="svg2"
   height="512"
   width="512"
   version="1.1">
  <sodipodi:namedview
     inkscape:current-layer="svg2"
     inkscape:window-maximized="1"
     inkscape:window-y="24"
     inkscape:window-x="0"
     inkscape:cy="256"
     inkscape:cx="256"
     inkscape:zoom="1.6035156"
     fit-margin-bottom="0"
     fit-margin-right="0"
     fit-margin-left="0"
     fit-margin-top="0"
     inkscape:showpageshadow="false"
     showgrid="false"
     id="namedview145"
     inkscape:window-height="1033"
     inkscape:window-width="1920"
     inkscape:pageshadow="2"
     inkscape:pageopacity="0"
     guidetolerance="10"
     gridtolerance="10"
     objecttolerance="10"
     borderopacity="1"
     bordercolor="#666666"
     pagecolor="#ffffff"
     inkscape:document-rotation="0" />
  <defs
     id="defs4">
    <linearGradient
       spreadMethod="pad"
       gradientTransform="matrix(-55.596222,315.30197,315.30197,55.596237,625.08789,206.5918)"
       gradientUnits="userSpaceOnUse"
       id="linearGradient5564"
       y2="0"
       x2="1"
       y1="0"
       x1="0">
      <stop
         offset="0"
         style="stop-color:#4a7d62;stop-opacity:1"
         id="stop5566" />
      <stop
         offset="0.83146697"
         style="stop-color:#000000;stop-opacity:1"
         id="stop5568" />
      <stop
         offset="0.83146697"
         style="stop-color:#000000;stop-opacity:1"
         id="stop5570" />
      <stop
         offset="1"
         style="stop-color:#000000;stop-opacity:1"
         id="stop5572" />
    </linearGradient>
    <linearGradient
       spreadMethod="pad"
       gradientTransform="matrix(57.405304,123.10608,123.10608,-57.405304,544.34863,308.62207)"
       gradientUnits="userSpaceOnUse"
       id="linearGradient5542"
       y2="0"
       x2="1"
       y1="0"
       x1="0">
      <stop
         offset="0"
         style="stop-color:#ffff00;stop-opacity:1"
         id="stop5544" />
      <stop
         offset="0.41572601"
         style="stop-color:#aeff00;stop-opacity:1"
         id="stop5546" />
      <stop
         offset="1"
         style="stop-color:#575757;stop-opacity:1"
         id="stop5548" />
    </linearGradient>
    <linearGradient
       spreadMethod="pad"
       gradientTransform="matrix(19.704803,160.48279,160.48279,-19.704803,528.9707,540.91943)"
       gradientUnits="userSpaceOnUse"
       id="linearGradient5520"
       y2="0"
       x2="1"
       y1="0"
       x1="0">
      <stop
         offset="0"
         style="stop-color:#000000;stop-opacity:1"
         id="stop5522" />
      <stop
         offset="0.87078899"
         style="stop-color:#45755c;stop-opacity:1"
         id="stop5524" />
      <stop
         offset="1"
         style="stop-color:#45755c;stop-opacity:1"
         id="stop5526" />
    </linearGradient>
    <linearGradient
       spreadMethod="pad"
       gradientTransform="matrix(-123.55646,119.31706,119.31706,123.55647,588.98633,485.63184)"
       gradientUnits="userSpaceOnUse"
       id="linearGradient5498"
       y2="0"
       x2="1"
       y1="0"
       x1="0">
      <stop
         offset="0"
         style="stop-color:#ffff00;stop-opacity:1"
         id="stop5500" />
      <stop
         offset="0.47752401"
         style="stop-color:#9dff00;stop-opacity:1"
         id="stop5502" />
      <stop
         offset="1"
         style="stop-color:#4a4a4a;stop-opacity:1"
         id="stop5504" />
    </linearGradient>
    <linearGradient
       spreadMethod="pad"
       gradientTransform="matrix(179.03551,310.09863,310.09863,-179.03551,150.04297,206.6123)"
       gradientUnits="userSpaceOnUse"
       id="linearGradient5478"
       y2="0"
       x2="1"
       y1="0"
       x1="0">
      <stop
         offset="0"
         style="stop-color:#4a7d62;stop-opacity:1"
         id="stop5480" />
      <stop
         offset="1"
         style="stop-color:#182920;stop-opacity:1"
         id="stop5482" />
    </linearGradient>
    <linearGradient
       spreadMethod="pad"
       gradientTransform="matrix(221.12239,149.14896,149.14896,-221.12239,150.16309,295.60059)"
       gradientUnits="userSpaceOnUse"
       id="linearGradient5454"
       y2="0"
       x2="1"
       y1="0"
       x1="0">
      <stop
         offset="0"
         style="stop-color:#ffff00;stop-opacity:1"
         id="stop5456" />
      <stop
         offset="0.421341"
         style="stop-color:#9dff00;stop-opacity:1"
         id="stop5458" />
      <stop
         offset="0.421341"
         style="stop-color:#9dff00;stop-opacity:1"
         id="stop5460" />
      <stop
         offset="1"
         style="stop-color:#5c5c5c;stop-opacity:1"
         id="stop5462" />
    </linearGradient>
    <linearGradient
       spreadMethod="pad"
       gradientTransform="matrix(138.34399,-205.10341,-205.10341,-138.34399,228.25391,725.86377)"
       gradientUnits="userSpaceOnUse"
       id="linearGradient5434"
       y2="0"
       x2="1"
       y1="0"
       x1="0">
      <stop
         offset="0"
         style="stop-color:#4a7d62;stop-opacity:1"
         id="stop5436" />
      <stop
         offset="1"
         style="stop-color:#000000;stop-opacity:1"
         id="stop5438" />
    </linearGradient>
    <linearGradient
       spreadMethod="pad"
       gradientTransform="matrix(112.95387,139.48642,139.48642,-112.95386,242.33008,465.07959)"
       gradientUnits="userSpaceOnUse"
       id="linearGradient5412"
       y2="0"
       x2="1"
       y1="0"
       x1="0">
      <stop
         offset="0"
         style="stop-color:#ffff00;stop-opacity:1"
         id="stop5414" />
      <stop
         offset="0.5"
         style="stop-color:#9dff00;stop-opacity:1"
         id="stop5416" />
      <stop
         offset="1"
         style="stop-color:#458c41;stop-opacity:1"
         id="stop5418" />
    </linearGradient>
    <radialGradient
       spreadMethod="pad"
       gradientTransform="matrix(-59.413574,-151.80127,-183.85619,71.964798,430.58789,518.58398)"
       gradientUnits="userSpaceOnUse"
       id="radialGradient5376"
       fy="0"
       fx="0"
       r="1"
       cy="0"
       cx="0">
      <stop
         offset="0"
         style="stop-color:#ffffff;stop-opacity:1"
         id="stop5378" />
      <stop
         offset="0.95506299"
         style="stop-color:#000000;stop-opacity:1"
         id="stop5380" />
      <stop
         offset="0.95506299"
         style="stop-color:#000000;stop-opacity:1"
         id="stop5382" />
      <stop
         offset="1"
         style="stop-color:#000000;stop-opacity:1"
         id="stop5384" />
    </radialGradient>
    <clipPath
       id="clipPath5368">
      <path
         id="path5370"
         d="M 481.117,609.926 H 625.518 V 355.03 H 481.117 Z" />
    </clipPath>
    <radialGradient
       spreadMethod="pad"
       gradientTransform="matrix(207.42525,-21.509659,-19.788208,-190.87936,415.48047,501.28809)"
       gradientUnits="userSpaceOnUse"
       id="radialGradient5340"
       fy="0"
       fx="0"
       r="1"
       cy="0"
       cx="0">
      <stop
         offset="0"
         style="stop-color:#ffffff;stop-opacity:1"
         id="stop5342" />
      <stop
         offset="0.95506299"
         style="stop-color:#000000;stop-opacity:1"
         id="stop5344" />
      <stop
         offset="0.95506299"
         style="stop-color:#000000;stop-opacity:1"
         id="stop5346" />
      <stop
         offset="1"
         style="stop-color:#000000;stop-opacity:1"
         id="stop5348" />
    </radialGradient>
    <clipPath
       id="clipPath5332">
      <path
         id="path5334"
         d="M 242.805,695.386 H 579.33 V 553.03 H 242.805 Z" />
    </clipPath>
    <radialGradient
       spreadMethod="pad"
       gradientTransform="matrix(207.42525,-21.509659,-19.788208,-190.87936,415.48047,501.28809)"
       gradientUnits="userSpaceOnUse"
       xlink:href="#radialGradient5340"
       id="radialGradient6072"
       fy="0"
       fx="0"
       r="1"
       cy="0"
       cx="0" />
    <radialGradient
       spreadMethod="pad"
       gradientTransform="matrix(-59.413574,-151.80127,-183.85619,71.964798,430.58789,518.58398)"
       gradientUnits="userSpaceOnUse"
       xlink:href="#radialGradient5376"
       id="radialGradient6074"
       fy="0"
       fx="0"
       r="1"
       cy="0"
       cx="0" />
    <linearGradient
       spreadMethod="pad"
       gradientTransform="matrix(112.95387,139.48642,139.48642,-112.95386,242.33008,465.07959)"
       gradientUnits="userSpaceOnUse"
       xlink:href="#linearGradient5412"
       id="linearGradient6076"
       y2="0"
       x2="1"
       y1="0"
       x1="0" />
    <linearGradient
       spreadMethod="pad"
       gradientTransform="matrix(138.34399,-205.10341,-205.10341,-138.34399,228.25391,725.86377)"
       gradientUnits="userSpaceOnUse"
       xlink:href="#linearGradient5434"
       id="linearGradient6078"
       y2="0"
       x2="1"
       y1="0"
       x1="0" />
    <linearGradient
       spreadMethod="pad"
       gradientTransform="matrix(221.12239,149.14896,149.14896,-221.12239,150.16309,295.60059)"
       gradientUnits="userSpaceOnUse"
       xlink:href="#linearGradient5454"
       id="linearGradient6080"
       y2="0"
       x2="1"
       y1="0"
       x1="0" />
    <linearGradient
       spreadMethod="pad"
       gradientTransform="matrix(179.03551,310.09863,310.09863,-179.03551,150.04297,206.6123)"
       gradientUnits="userSpaceOnUse"
       xlink:href="#linearGradient5478"
       id="linearGradient6082"
       y2="0"
       x2="1"
       y1="0"
       x1="0" />
    <linearGradient
       spreadMethod="pad"
       gradientTransform="matrix(-123.55646,119.31706,119.31706,123.55647,588.98633,485.63184)"
       gradientUnits="userSpaceOnUse"
       xlink:href="#linearGradient5498"
       id="linearGradient6084"
       y2="0"
       x2="1"
       y1="0"
       x1="0" />
    <linearGradient
       spreadMethod="pad"
       gradientTransform="matrix(19.704803,160.48279,160.48279,-19.704803,528.9707,540.91943)"
       gradientUnits="userSpaceOnUse"
       xlink:href="#linearGradient5520"
       id="linearGradient6086"
       y2="0"
       x2="1"
       y1="0"
       x1="0" />
    <linearGradient
       spreadMethod="pad"
       gradientTransform="matrix(57.405304,123.10608,123.10608,-57.405304,544.34863,308.62207)"
       gradientUnits="userSpaceOnUse"
       xlink:href="#linearGradient5542"
       id="linearGradient6088"
       y2="0"
       x2="1"
       y1="0"
       x1="0" />
    <linearGradient
       spreadMethod="pad"
       gradientTransform="matrix(-55.596222,315.30197,315.30197,55.596237,625.08789,206.5918)"
       gradientUnits="userSpaceOnUse"
       xlink:href="#linearGradient5564"
       id="linearGradient6090"
       y2="0"
       x2="1"
       y1="0"
       x1="0" />
  </defs>
  <metadata
     id="metadata7">
    <rdf:RDF>
      <cc:Work
         rdf:about="">
        <dc:format>image/svg+xml</dc:format>
        <dc:type
           rdf:resource="http://purl.org/dc/dcmitype/StillImage" />
        <dc:title></dc:title>
      </cc:Work>
    </rdf:RDF>
  </metadata>
  <g
     id="layer1"
     transform="matrix(0.64117406,0,0,0.64117406,-17.712199,-20.36952)">
    <path
       style="fill:#000000;fill-opacity:1;fill-rule:nonzero;stroke:none;stroke-width:0.727651"
       id="path5302"
       d="M 27.624634,830.30421 H 826.15975 V 31.769095 H 27.624634 Z" />
    <g
       id="g5834"
       transform="translate(2.994043,60.520587)">
      <g
         id="g5328"
         transform="matrix(1.25,0,0,-1.25,-97.211226,943.55044)">
        <g
           id="g5330" />
        <g
           id="g5350">
          <g
             id="g5352"
             clip-path="url(#clipPath5332)">
            <g
               id="g5354">
              <g
                 id="g5356">
                <g
                   id="g5358">
                  <g
                     id="g5360">
                    <path
                       style="fill:url(#radialGradient6072);stroke:none"
                       id="path5362"
                       d="m 417.093,553.03 -174.288,83.727 c 0,0 175.192,135.82 336.525,-5.986 z" />
                  </g>
                </g>
              </g>
            </g>
          </g>
        </g>
      </g>
      <g
         id="g5364"
         transform="matrix(1.25,0,0,-1.25,-97.211226,943.55044)">
        <g
           id="g5366" />
        <g
           id="g5386">
          <g
             id="g5388"
             clip-path="url(#clipPath5368)">
            <g
               id="g5390">
              <g
                 id="g5392">
                <g
                   id="g5394">
                  <g
                     id="g5396">
                    <path
                       style="fill:url(#radialGradient6074);stroke:none"
                       id="path5398"
                       d="m 481.117,501.931 114.419,107.995 c 0,0 101.094,-174.088 -67.989,-254.896 z" />
                  </g>
                </g>
              </g>
            </g>
          </g>
        </g>
      </g>
      <g
         id="g5400"
         transform="matrix(1.25,0,0,-1.25,-97.211226,943.55044)">
        <g
           id="g5402">
          <g
             id="g5408">
            <g
               id="g5410">
              <path
                 style="fill:url(#linearGradient6076);stroke:none"
                 id="path5420"
                 d="M 344.644,507.724 V 382.227 c 24.426,20.367 48.894,41.889 72.242,64.093 v 0 108.361 c 0,0 -131.226,43.744 -214.074,95.919 v 0 c 34.127,-38.852 90.552,-100.237 141.832,-142.876" />
            </g>
          </g>
        </g>
      </g>
      <g
         id="g5422"
         transform="matrix(1.25,0,0,-1.25,-97.211226,943.55044)">
        <g
           id="g5424">
          <g
             id="g5430">
            <g
               id="g5432">
              <path
                 style="fill:url(#linearGradient6078);stroke:none"
                 id="path5440"
                 d="m 202.812,650.6 c 82.848,-52.175 214.074,-95.919 214.074,-95.919 v 0 14.449 c 0,0 -170.67,56.89 -245.62,118.295 v 0 c 0,0 12.187,-14.789 31.546,-36.825" />
            </g>
          </g>
        </g>
      </g>
      <g
         id="g5442"
         transform="matrix(1.25,0,0,-1.25,-97.211226,943.55044)">
        <g
           id="g5444">
          <g
             id="g5450">
            <g
               id="g5452">
              <path
                 style="fill:url(#linearGradient6080);stroke:none"
                 id="path5464"
                 d="m 176.804,256.105 c 42.305,28.866 104.913,73.64 167.84,126.122 v 0 102.02 c 0,0 -85.697,-130.065 -167.84,-228.142" />
            </g>
          </g>
        </g>
      </g>
      <g
         id="g5466"
         transform="matrix(1.25,0,0,-1.25,-97.211226,943.55044)">
        <g
           id="g5468">
          <g
             id="g5474">
            <g
               id="g5476">
              <path
                 style="fill:url(#linearGradient6082);stroke:none"
                 id="path5484"
                 d="m 124.31,221.469 c 0,0 20.413,12.745 52.494,34.636 v 0 c 82.143,98.077 167.84,228.142 167.84,228.142 v 0 23.477 c 0,0 -127.325,-193.242 -220.334,-286.255" />
            </g>
          </g>
        </g>
      </g>
      <g
         id="g5486"
         transform="matrix(1.25,0,0,-1.25,-97.211226,943.55044)">
        <g
           id="g5488">
          <g
             id="g5494">
            <g
               id="g5496">
              <path
                 style="fill:url(#linearGradient6084);stroke:none"
                 id="path5506"
                 d="M 416.886,554.681 V 446.32 c 23.349,-22.204 47.817,-43.726 72.243,-64.093 v 0 125.497 c 51.28,42.639 107.709,104.024 141.837,142.876 v 0 c -82.853,-52.175 -214.08,-95.919 -214.08,-95.919" />
            </g>
          </g>
        </g>
      </g>
      <g
         id="g5508"
         transform="matrix(1.25,0,0,-1.25,-97.211226,943.55044)">
        <g
           id="g5510">
          <g
             id="g5516">
            <g
               id="g5518">
              <path
                 style="fill:url(#linearGradient6086);stroke:none"
                 id="path5528"
                 d="m 416.886,569.13 v -14.449 c 0,0 131.227,43.744 214.08,95.919 v 0 c 19.355,22.036 31.542,36.825 31.542,36.825 v 0 C 587.558,626.02 416.886,569.13 416.886,569.13" />
            </g>
          </g>
        </g>
      </g>
      <g
         id="g5530"
         transform="matrix(1.25,0,0,-1.25,-97.211226,943.55044)">
        <g
           id="g5532">
          <g
             id="g5538">
            <g
               id="g5540">
              <path
                 style="fill:url(#linearGradient6088);stroke:none"
                 id="path5550"
                 d="m 489.129,382.227 c 62.933,-52.482 125.537,-97.256 167.845,-126.122 v 0 C 574.832,354.182 489.129,484.247 489.129,484.247 v 0 z" />
            </g>
          </g>
        </g>
      </g>
      <g
         id="g5552"
         transform="matrix(1.25,0,0,-1.25,-97.211226,943.55044)">
        <g
           id="g5554">
          <g
             id="g5560">
            <g
               id="g5562">
              <path
                 style="fill:url(#linearGradient6090);stroke:none"
                 id="path5574"
                 d="m 489.129,484.247 c 0,0 85.703,-130.065 167.845,-228.142 v 0 c 32.077,-21.891 52.491,-34.636 52.491,-34.636 v 0 C 616.454,314.482 489.129,507.724 489.129,507.724 v 0 z" />
            </g>
          </g>
        </g>
      </g>
    </g>
  </g>
  <g
     transform="matrix(4.3313957,0,0,4.3313957,-827.35303,-26.76014)"
     fill="#90b258"
     id="g194" />
</svg>
