<?xml version="1.0" encoding="UTF-8" standalone="no"?>
<svg
   xmlns:dc="http://purl.org/dc/elements/1.1/"
   xmlns:cc="http://creativecommons.org/ns#"
   xmlns:rdf="http://www.w3.org/1999/02/22-rdf-syntax-ns#"
   xmlns:svg="http://www.w3.org/2000/svg"
   xmlns="http://www.w3.org/2000/svg"
   xmlns:sodipodi="http://sodipodi.sourceforge.net/DTD/sodipodi-0.dtd"
   xmlns:inkscape="http://www.inkscape.org/namespaces/inkscape"
   inkscape:version="1.0 (1.0+r73+1)"
   sodipodi:docname="telecom-algar.svg"
   id="svg12"
   version="1.1"
   viewBox="-14.60103 -9.518375 53.991364 14.296331"
   width="512"
   height="200.26291">
  <metadata
     id="metadata18">
    <rdf:RDF>
      <cc:Work
         rdf:about="">
        <dc:format>image/svg+xml</dc:format>
        <dc:type
           rdf:resource="http://purl.org/dc/dcmitype/StillImage" />
        <dc:title></dc:title>
      </cc:Work>
    </rdf:RDF>
  </metadata>
  <defs
     id="defs16" />
  <sodipodi:namedview
     inkscape:current-layer="svg12"
     inkscape:window-maximized="1"
     inkscape:window-y="24"
     inkscape:window-x="0"
     inkscape:cy="100.13145"
     inkscape:cx="256"
     inkscape:zoom="3.5917969"
     fit-margin-bottom="0"
     fit-margin-right="0"
     fit-margin-left="0"
     fit-margin-top="0"
     inkscape:showpageshadow="false"
     showgrid="false"
     id="namedview14"
     inkscape:window-height="1033"
     inkscape:window-width="1920"
     inkscape:pageshadow="2"
     inkscape:pageopacity="0"
     guidetolerance="10"
     gridtolerance="10"
     objecttolerance="10"
     borderopacity="1"
     bordercolor="#666666"
     pagecolor="#ffffff" />
  <g
     transform="matrix(0.55466667,0,0,0.55466667,-14.60103,-12.92926)"
     id="g25">
    <path
       d="M 12.8852,18.5737 H 7.1702 L 9.4456,10.6362 C 9.9483,8.89 10.0806,7.6994 10.0806,7.6994 H 10.16 c 0,0 0.1058,1.2435 0.5556,2.9368 z m 2.9898,8.5196 c -0.4498,0 -0.8202,-0.291 -0.926,-0.6879 V 26.379 l -1.2965,-4.498 h -7.329 l -1.3493,4.498 c -0.1059,0.3968 -0.5027,0.7143 -0.926,0.7143 H 0.979 C 0.4498,27.0933 0,26.6435 0,26.1143 0,26.0085 0.0265,25.9292 0.053,25.8233 V 25.7969 L 7.3553,3.413 C 7.4612,2.9897 7.858,2.6986 8.3078,2.6986 h 4.1804 c 0.4234,0 0.7938,0.291 0.926,0.6615 l 7.2761,22.4102 c 0.0265,0.1058 0.053,0.2117 0.053,0.3175 0,0.5292 -0.4234,0.979 -0.9526,0.979 H 15.875 Z m 5.424,-24.421 c 0,-0.3969 0.238,-0.7144 0.5556,-0.8731 l 3.0956,-1.614 C 25.109,0.0794 25.3735,0 25.5852,0 c 0.5292,0 0.979,0.4233 0.979,0.979 v 20.3993 c 0.0264,1.2171 1.0848,2.1696 2.3018,2.1696 0.5292,0 0.979,0.4233 0.979,0.979 v 1.5875 c 0,0.5291 -0.4233,0.979 -0.979,0.979 h -1.0848 c -3.5983,0 -6.5087,-2.9105 -6.5087,-6.5088 V 2.6722 Z m 24.13,6.5352 c 0.344,0.1587 0.582,0.5027 0.582,0.8996 v 16.7746 c 0,5.318 -3.3073,7.8845 -8.1756,8.0698 -2.3548,0.1058 -4.3392,-0.4498 -5.9796,-1.1642 -0.3704,-0.1588 -0.6085,-0.5027 -0.6085,-0.926 0,-0.1323 0.0264,-0.2382 0.053,-0.344 l 0.529,-1.3494 c 0.1324,-0.3969 0.5028,-0.6879 0.9526,-0.6879 0.1323,0 0.2646,0.0265 0.3704,0.0794 1.0583,0.3968 2.3548,0.6879 3.7042,0.6879 2.8575,0 3.8893,-1.3494 3.8893,-3.4925 v -1.0319 c -0.635,0.344 -1.6933,0.5821 -3.2543,0.5821 -4.4715,0 -7.6994,-3.4396 -7.6994,-9.0223 0,-6.2442 3.2014,-10.16 9.6044,-10.16 2.4606,0 4.6037,0.4498 6.0325,1.0848 -0.0265,0 0,0 0,0 z m -4.7096,14.552 c -0.4498,0.2911 -1.1642,0.4499 -1.8786,0.4499 -2.6987,0 -3.81,-2.0109 -3.81,-6.2442 0,-4.4715 1.1377,-6.7204 3.9159,-6.7204 0.7408,0 1.3493,0.1058 1.7727,0.3175 z m 18.0975,0.6615 v -7.1173 c -3.0692,-0.238 -5.6092,0.8996 -5.6092,3.8365 0,2.1696 1.2965,3.466 3.5454,3.466 1.4552,0 2.0638,-0.1852 2.0638,-0.1852 z m 5.2916,-6.3235 v 7.2495 c 0,0.397 -0.238,0.741 -0.6085,0.8997 h -0.0265 c -1.6404,0.635 -4.101,1.0848 -7.0114,1.0848 -5.6356,0 -8.6254,-2.0373 -8.6254,-5.9003 0,-4.789 3.9423,-6.985 10.9537,-6.641 -0.1587,-1.852 -1.2435,-2.9898 -3.8629,-2.9898 -1.3494,0 -2.6458,0.291 -3.7042,0.688 -0.1058,0.0528 -0.238,0.0793 -0.3704,0.0793 -0.4498,0 -0.8202,-0.291 -0.9525,-0.688 l -0.5292,-1.3493 c -0.0529,-0.1058 -0.0529,-0.2117 -0.0529,-0.344 0,-0.4233 0.2646,-0.7672 0.6086,-0.926 1.614,-0.7144 3.5983,-1.27 5.9796,-1.1642 4.8683,0.1853 8.1756,2.7517 8.1756,8.0698 v 1.9315 z m 2.6194,-7.5935 c 0,-0.7673 0.5292,-1.3759 1.2171,-1.614 1.7992,-0.6085 4.154,-0.926 7.6994,-0.8202 h 0.0264 c 0.5292,0 0.979,0.4233 0.979,0.979 v 1.3229 c 0,0.5291 -0.4498,0.979 -0.979,0.979 H 75.565 c -1.2965,-0.106 -2.884,0.1587 -3.5719,0.4762 v 14.3139 c -0.0264,0.5292 -0.4498,0.9525 -0.979,0.9525 H 67.707 c -0.5292,0 -0.979,-0.4233 -0.979,-0.979 v -0.0528 z"
       clip-rule="evenodd"
       fill="#0068a6"
       fill-rule="evenodd"
       id="path2" />
    <path
       d="m 80.5656,9.0752 c 0,-0.3175 0.1852,-0.635 0.4763,-0.8202 0.3175,-0.1852 0.7143,-0.1588 1.0054,0.0265 l 5.662,3.2543 c 0.2911,0.1852 0.4763,0.4763 0.4763,0.8202 0,0.3705 -0.2116,0.688 -0.5291,0.8732 0,0 -5.6357,3.2543 -5.6621,3.2808 -0.291,0.1587 -0.6615,0.1587 -0.9525,0 -0.3175,-0.1852 -0.5027,-0.5292 -0.4763,-0.8731 v -2.6723 z"
       fill="#00aeef"
       id="path4" />
    <path
       d="m 89.6408,14.2875 c 0,-0.3175 0.1852,-0.635 0.4763,-0.8202 0.3175,-0.1852 0.7144,-0.1588 1.0054,0.0264 l 5.662,3.2544 c 0.2911,0.1588 0.4763,0.4763 0.4763,0.8202 0,0.3704 -0.2116,0.688 -0.5291,0.8732 0,0 -5.6357,3.2543 -5.6621,3.2543 -0.291,0.1588 -0.6615,0.1588 -0.9525,-0.0264 -0.3175,-0.1852 -0.5027,-0.5292 -0.4763,-0.8732 z"
       fill="#ffcb05"
       id="path6" />
    <path
       d="m 80.5656,19.5262 c 0,-0.3175 0.1852,-0.635 0.4763,-0.8202 0.3175,-0.1852 0.7143,-0.1587 1.0054,0.0265 l 5.662,3.2544 c 0.2911,0.1587 0.4763,0.4762 0.4763,0.8202 0,0.3704 -0.2116,0.7144 -0.5291,0.8731 0,0 -5.6357,3.2544 -5.6621,3.2544 -0.291,0.1587 -0.6615,0.1587 -0.9525,-0.0265 -0.3175,-0.1852 -0.5027,-0.5291 -0.4763,-0.8731 v -2.6723 z"
       fill="#00a651"
       id="path8" />
    <path
       d="m 63.8969,31.5119 v -1.2171 h -4.5244 v 1.217 h 1.3494 v 6.456 h 1.8256 v -6.456 z m 3.5718,2.884 -2.1166,0.3174 c -0.053,-1.2435 0.3969,-1.852 1.1112,-1.852 0.6615,0 1.0054,0.4762 1.0054,1.5345 z m 1.6405,0.635 c 0.0793,-2.0374 -0.8202,-3.2015 -2.5665,-3.2015 -1.7462,0 -2.7252,1.217 -2.7252,3.0956 0,1.905 1.0583,3.122 2.9369,3.122 1.0318,0 1.6933,-0.2116 2.1696,-0.4233 L 68.527,36.539 c -0.3174,0.1587 -0.873,0.3175 -1.5874,0.3175 -0.8996,0 -1.3494,-0.4234 -1.4552,-1.323 z M 71.702,29.21 h -1.7727 v 8.7312 h 1.7462 V 29.21 Z m 4.498,5.1858 -2.1167,0.3175 c -0.0529,-1.2435 0.397,-1.852 1.1113,-1.852 0.6614,0 1.0054,0.4762 1.0054,1.5345 z m 1.6404,0.635 c 0.0794,-2.0373 -0.8202,-3.2014 -2.5664,-3.2014 -1.7463,0 -2.7253,1.217 -2.7253,3.0956 0,1.905 1.0584,3.122 2.937,3.122 1.0318,0 1.6933,-0.2116 2.1695,-0.4233 L 77.2583,36.539 c -0.3175,0.1587 -0.873,0.3175 -1.5875,0.3175 -0.8996,0 -1.3493,-0.4234 -1.4552,-1.323 z m 4.5773,2.593 -0.3704,-1.0584 c -0.1852,0.1588 -0.3969,0.2381 -0.7408,0.2381 -0.688,0 -1.1113,-0.7143 -1.1113,-1.905 0,-1.217 0.3704,-1.905 1.1377,-1.905 0.344,0 0.5556,0.1059 0.7144,0.2382 l 0.3704,-0.9525 c -0.2646,-0.2117 -0.7408,-0.4234 -1.4817,-0.4234 -1.3493,0 -2.487,1.0584 -2.487,3.0957 0,2.0108 1.0583,3.122 2.487,3.122 0.7409,-0.0264 1.2171,-0.2116 1.4817,-0.4498 z m 3.81,-2.6988 c 0,1.0848 -0.1587,1.958 -0.926,1.958 -0.7673,0 -0.926,-0.8732 -0.926,-1.958 0,-1.0583 0.1587,-2.0108 0.926,-2.0108 0.7673,0 0.926,0.926 0.926,2.0108 z m 1.7463,0.0265 c 0,-1.7992 -0.926,-3.0957 -2.6988,-3.0957 -1.7462,0 -2.6723,1.323 -2.6723,3.0957 0,1.7727 0.926,3.122 2.6723,3.122 1.7727,0 2.6988,-1.3493 2.6988,-3.122 z m 9.3662,2.9897 v -4.2068 c 0,-1.0584 -0.7408,-1.905 -2.1696,-1.905 -1.0054,0 -1.614,0.2646 -2.0108,0.6085 -0.344,-0.344 -0.926,-0.6085 -1.9315,-0.6085 -1.0583,0 -1.7727,0.1323 -2.4606,0.4498 v 5.662 H 90.514 V 33.02 c 0.2116,-0.0794 0.3968,-0.1058 0.7143,-0.1058 0.6086,0 0.9525,0.3175 0.9525,0.7937 v 4.2333 h 1.7463 v -4.736 c 0.2116,-0.2117 0.4498,-0.291 0.7673,-0.291 0.6085,0 0.8731,0.344 0.8731,0.8202 v 4.2068 z"
       fill="#808285"
       id="path10" />
  </g>
</svg>
