<?xml version="1.0" encoding="UTF-8" standalone="no"?>
<svg
   xmlns:dc="http://purl.org/dc/elements/1.1/"
   xmlns:cc="http://creativecommons.org/ns#"
   xmlns:rdf="http://www.w3.org/1999/02/22-rdf-syntax-ns#"
   xmlns:svg="http://www.w3.org/2000/svg"
   xmlns="http://www.w3.org/2000/svg"
   xmlns:sodipodi="http://sodipodi.sourceforge.net/DTD/sodipodi-0.dtd"
   xmlns:inkscape="http://www.inkscape.org/namespaces/inkscape"
   id="Layer_1"
   viewBox="0 0 104.8576 104.8576"
   width="512"
   height="512"
   version="1.1"
   sodipodi:docname="ms-windows-store.svg"
   inkscape:version="0.92.4 (unknown)">
  <metadata
     id="metadata23">
    <rdf:RDF>
      <cc:Work
         rdf:about="">
        <dc:format>image/svg+xml</dc:format>
        <dc:type
           rdf:resource="http://purl.org/dc/dcmitype/StillImage" />
        <dc:title></dc:title>
      </cc:Work>
    </rdf:RDF>
  </metadata>
  <defs
     id="defs21" />
  <sodipodi:namedview
     pagecolor="#ffffff"
     bordercolor="#666666"
     borderopacity="1"
     objecttolerance="10"
     gridtolerance="10"
     guidetolerance="10"
     inkscape:pageopacity="0"
     inkscape:pageshadow="2"
     inkscape:window-width="1600"
     inkscape:window-height="851"
     id="namedview19"
     showgrid="false"
     inkscape:showpageshadow="false"
     fit-margin-top="0"
     fit-margin-left="0"
     fit-margin-right="0"
     fit-margin-bottom="0"
     inkscape:zoom="1.2597656"
     inkscape:cx="256"
     inkscape:cy="256"
     inkscape:window-x="0"
     inkscape:window-y="24"
     inkscape:window-maximized="1"
     inkscape:current-layer="Layer_1" />
  <style
     id="style2">.st0{fill:#00a1f1}.st1{fill:#fff}</style>
  <g
     id="g39"
     transform="scale(0.2048)">
    <g
       id="g6983">
      <path
         d="m 64,0 h 384 c 35.3,0 64,28.7 64,64 v 384 c 0,35.3 -28.7,64 -64,64 H 64 C 28.7,512 0,483.3 0,448 V 64 C 0,28.7 28.7,0 64,0 Z"
         class="st0"
         id="rect2984"
         inkscape:connector-curvature="0"
         style="fill:#00a1f1" />
      <g
         transform="matrix(15.99685,0,0,15.99685,-5338.792,-6028.476)"
         id="g3372">
        <g
           transform="translate(0.446,-0.045)"
           id="g3368">
          <path
             d="m 355.8,380.4 c 0,0 0,0.1 0,0 -0.7,1.2 -0.8,2.7 -1.1,4 v 0.1 c -0.1,1.4 -0.6,2.9 -0.3,4.3 v 0.1 l 0.2,0.2 c 0,0 0.1,0 0.2,-0.1 0.2,-0.1 0.2,-0.3 0.3,-0.6 0,0 0,-0.1 0.1,-0.1 v -0.1 c 0.6,-2.4 1,-4.9 0.8,-7.3 0,-0.1 0,-0.2 -0.2,-0.3 l -0.2,-0.2 h 0.2 c 0.1,0 0.1,0 0,0 0,0 0.1,0 0,0 z"
             class="st0"
             id="path3366"
             inkscape:connector-curvature="0"
             style="fill:#00a1f1" />
          <path
             d="m 361.4,381.6 c -1,0.5 -1.6,1.7 -2.3,2.7 v 0.2 c -0.9,1.6 -2.1,3.2 -2.2,5.1 0,0.3 0.2,0.4 0.3,0.5 0.2,0 0.5,-0.1 0.6,-0.2 1.6,-2.3 2.9,-4.9 3.9,-7.5 0.1,-0.2 0.1,-0.2 0,-0.3 0,-0.4 -0.2,-0.5 -0.3,-0.5 z"
             class="st0"
             id="path3364"
             inkscape:connector-curvature="0"
             style="fill:#00a1f1" />
        </g>
        <path
           d="m 345.7,382.3 c -0.2,0 -0.4,0.2 -0.6,0.2 -0.6,0.2 -1,0.8 -1.1,1.4 -0.2,0.6 -0.1,1.4 0,2.1 0.1,0.7 0.2,1.5 0.4,2.1 0.1,0.5 0.2,0.7 0.3,0.9 v 0.1 c 0,0.1 0,0 -0.1,0.1 v 0.1 c 0,0 -0.1,0.1 -0.2,0.1 -0.1,0 -0.2,0 -0.3,-0.1 -0.1,0 -0.2,-0.1 -0.2,-0.1 0,0 -0.1,0 -0.1,-0.1 l -0.1,-0.2 c -0.1,-0.2 -0.2,-0.4 -0.3,-0.7 -0.2,-0.6 -0.6,-1.2 -0.9,-1.9 -0.3,-0.6 -0.8,-1.2 -1.2,-1.6 -0.2,-0.2 -0.5,-0.4 -0.8,-0.5 -0.3,-0.1 -0.6,0 -0.8,0.1 -0.7,0.4 -1.1,1 -1.2,1.7 -0.2,0.7 -0.1,1.4 0,2.1 0.1,0.7 0.3,1.2 0.4,1.7 0,0.2 0.1,0.4 0.1,0.5 0,0.1 0,0.3 -0.1,0.4 -0.1,0.4 -0.4,1.1 -0.4,1.1 0,0 -5.5,14.5 6.2,13.5 0.1,0 0.3,-0.1 0.4,-0.1 2.3,-0.5 4.5,-1.2 6.4,-1.9 0.4,-0.2 0.9,-0.4 1.4,-0.6 1.1,-0.5 2.5,-1.2 3.9,-1.9 1.4,-0.7 2.6,-1.5 3.6,-2.4 1,-0.8 1.7,-1.8 1.5,-2.7 -0.2,-1.5 -1.2,-2.6 -2.5,-3.4 -1.3,-0.9 -3,-1.4 -4.6,-1.9 -1.6,-0.4 -3.2,-0.8 -4.4,-1 -0.6,-0.1 -1.2,-0.1 -1.5,-0.2 -0.1,0 -0.2,0 -0.2,-0.1 h -0.1 c 0,0 -0.1,0 -0.1,-0.1 v -0.1 -0.9 c 0,-0.7 -0.1,-1.7 -0.2,-2.7 -0.2,-0.9 -0.4,-1.8 -0.9,-2.4 -0.3,-0.4 -0.7,-0.6 -1.2,-0.6 -0.2,0 -0.4,-0.1 -0.5,0 z"
           class="st0"
           id="path3302"
           inkscape:connector-curvature="0"
           style="fill:#00a1f1" />
      </g>
    </g>
    <g
       transform="matrix(4.67988,0,0,4.67988,-14628.123,-100339.87)"
       id="g18086">
      <g
         transform="translate(2886.772,21269.267)"
         id="bag_1_">
        <g
           id="handles_1_">
          <path
             d="m 292.3,191.3 c -3.7,1.3 -6.4,2.4 -6.4,9.4 v 3.4 l 2.2,-0.4 v -2.9 c -0.1,-4.8 1.2,-5.8 4.4,-7.2 0,-0.9 0,-1.7 -0.2,-2.3 z"
             class="st1"
             id="path205"
             inkscape:connector-curvature="0"
             style="fill:#ffffff" />
          <path
             d="m 298.7,189.8 c 0.1,0.7 0.3,1.4 0.3,2.2 5.8,-0.8 5.7,1.6 5.7,6.5 v 1.8 l 2.2,-0.4 v -1.4 c 0,-7.7 -1.2,-9.8 -8.2,-8.7 z"
             class="st1"
             id="path207"
             inkscape:connector-curvature="0"
             style="fill:#ffffff" />
          <path
             d="m 276,206.1 v -10.2 c -0.1,-6.3 3.2,-8.2 9.2,-9.6 9,-2.1 9.6,3.7 9.6,7.4 v 8.6 l 2.2,-0.4 v -8 c 0,-7 -2.2,-12.3 -12.3,-10 -5.4,1.2 -10.9,2.6 -10.9,11.8 v 10.8 z"
             class="st1"
             id="path209"
             inkscape:connector-curvature="0"
             style="fill:#ffffff" />
        </g>
        <path
           d="m 318,200.4 -60.8,12.2 v 44.2 l 60.8,12.2 12.1,-4.4 v -59.7 z m -34.2,47.2 -13.5,-1.9 v -11.2 h 13.5 z m 0,-14.8 h -13.5 v -10.3 l 13.5,-1.9 z m 18.7,17.4 -17,-2.5 v -13.2 h 17 z m 0,-17.4 h -17 v -12.3 l 17,-2.5 z"
           class="st1"
           id="path211"
           inkscape:connector-curvature="0"
           style="fill:#ffffff" />
      </g>
    </g>
  </g>
</svg>
