<?xml version="1.0" encoding="UTF-8" standalone="no"?>
<svg
   xmlns:dc="http://purl.org/dc/elements/1.1/"
   xmlns:cc="http://creativecommons.org/ns#"
   xmlns:rdf="http://www.w3.org/1999/02/22-rdf-syntax-ns#"
   xmlns:svg="http://www.w3.org/2000/svg"
   xmlns="http://www.w3.org/2000/svg"
   xmlns:sodipodi="http://sodipodi.sourceforge.net/DTD/sodipodi-0.dtd"
   xmlns:inkscape="http://www.inkscape.org/namespaces/inkscape"
   width="1280"
   height="512"
   viewBox="0 0 512 204.8"
   version="1.1"
   id="svg4"
   sodipodi:docname="ibm.svg.2019_10_05_22_12_34.0.svg"
   inkscape:version="0.92.4 (unknown)">
  <metadata
     id="metadata10">
    <rdf:RDF>
      <cc:Work
         rdf:about="">
        <dc:format>image/svg+xml</dc:format>
        <dc:type
           rdf:resource="http://purl.org/dc/dcmitype/StillImage" />
        <dc:title></dc:title>
      </cc:Work>
    </rdf:RDF>
  </metadata>
  <defs
     id="defs8" />
  <sodipodi:namedview
     pagecolor="#ffffff"
     bordercolor="#666666"
     borderopacity="1"
     objecttolerance="10"
     gridtolerance="10"
     guidetolerance="10"
     inkscape:pageopacity="0"
     inkscape:pageshadow="2"
     inkscape:window-width="1600"
     inkscape:window-height="851"
     id="namedview6"
     showgrid="false"
     inkscape:showpageshadow="false"
     fit-margin-top="0"
     fit-margin-left="0"
     fit-margin-right="0"
     fit-margin-bottom="0"
     inkscape:zoom="1.1695312"
     inkscape:cx="640"
     inkscape:cy="256"
     inkscape:window-x="0"
     inkscape:window-y="24"
     inkscape:window-maximized="1"
     inkscape:current-layer="svg4" />
  <path
     d="M 0,0 V 14.0119 H 99.659776 V 0 Z m 113.77971,0 v 14.0119 h 142.0201 C 255.79981,14.0119 241.29331,0 222.08,0 Z m 169.88007,0 v 14.0119 h 85.91974 L 364.48,0 Z m 147.52,0 -5.10004,14.0119 h 85.13997 V 0 Z M 0,27.24966 V 41.26157 H 99.659776 V 27.24966 Z m 113.77971,0.02 v 13.99245 h 158.49984 c 0,0 -1.85088,-10.78426 -5.08006,-13.99245 z m 169.88007,0 v 13.99245 h 95.34003 l -4.72013,-13.99245 z m 137.31993,0 -4.72013,13.99245 h 94.96013 V 27.26963 Z M 28.639744,54.49933 V 68.5312 H 71.799808 V 54.49933 Z m 113.780226,0 V 68.5312 h 43.16006 V 54.49933 Z m 85.13997,0 V 68.5312 H 270.72 c 0,0 2.74022,-7.41018 2.74022,-14.03187 z m 84.74009,0 V 68.5312 h 76.51994 l -5.10003,-14.03187 z m 99.27987,0 -5.12,14.03187 h 76.89984 V 54.49933 Z M 28.639744,81.76947 V 95.78138 H 71.799808 V 81.76947 Z m 113.780226,0 v 14.01191 h 110.23974 c 0,0 9.22215,-7.18951 12.16,-14.01191 z m 169.88006,0 v 14.01191 h 43.16007 v -7.79981 l 2.74022,7.79981 h 79.05997 l 2.9399,-7.79981 v 7.79981 h 43.16007 V 81.76947 h -81.02042 l -4.29978,11.86816 -4.32025,-11.86816 z M 28.639744,109.01914 v 14.0119 h 43.160064 v -14.0119 z m 113.780226,0 v 14.0119 h 122.39974 c -2.93837,-6.79987 -12.16,-14.0119 -12.16,-14.0119 z m 169.88006,0 v 14.0119 h 43.16007 v -14.0119 z m 50.99981,0 5.21984,14.0119 h 59.27987 l 4.96026,-14.0119 z m 76.89984,0 v 14.0119 h 43.16006 v -14.0119 z M 28.639744,136.2688 v 14.01139 H 71.799808 V 136.2688 Z m 113.780226,0 v 14.01139 h 43.16006 V 136.2688 Z m 85.13997,0 v 14.01139 h 45.89977 c 0,-6.61248 -2.74022,-14.01139 -2.74022,-14.01139 z m 84.74009,0 v 14.01139 H 355.4601 V 136.2688 Z m 60.8,0 5.0601,14.01139 h 39.7399 l 5.10003,-14.01139 z m 67.09965,0 v 14.01139 h 43.16006 V 136.2688 Z M 0.779776,163.51846 v 14.03188 h 99.659774 v -14.03188 z m 112.999934,0 v 14.03188 h 153.41978 c 3.22918,-3.2128 5.08006,-14.03188 5.08006,-14.03188 z m 170.66035,0 v 14.03188 h 71.02004 v -14.03188 z m 98.47962,0 5.19987,14.03188 h 20.21991 l 4.87987,-14.03188 z m 57.28,0 v 14.03188 H 512 V 163.51846 Z M 0.779776,190.7881 V 204.8 h 99.659774 v -14.0119 z m 112.999934,0 v 13.99193 H 222.08 c 19.21331,0 33.71981,-13.99193 33.71981,-13.99193 z m 170.66035,0 V 204.8 h 71.02004 v -14.0119 z m 108.33972,0 5.00019,13.97248 0.86016,0.0195 5.08006,-13.99193 z m 47.4199,0 V 204.8 H 512 v -14.0119 z"
     id="path2"
     inkscape:connector-curvature="0"
     style="fill:#1f70c1;stroke-width:0.51200002" />
</svg>
