<?xml version="1.0" encoding="UTF-8" standalone="no"?>
<svg
   xmlns:dc="http://purl.org/dc/elements/1.1/"
   xmlns:cc="http://creativecommons.org/ns#"
   xmlns:rdf="http://www.w3.org/1999/02/22-rdf-syntax-ns#"
   xmlns:svg="http://www.w3.org/2000/svg"
   xmlns="http://www.w3.org/2000/svg"
   xmlns:sodipodi="http://sodipodi.sourceforge.net/DTD/sodipodi-0.dtd"
   xmlns:inkscape="http://www.inkscape.org/namespaces/inkscape"
   inkscape:version="1.0 (1.0+r73+1)"
   sodipodi:docname="hw-msx_turbo_r.svg"
   viewBox="0 0 135.47046 58.282512"
   version="1.1"
   height="220.27905"
   width="512"
   id="svg5942">
  <defs
     id="defs9" />
  <sodipodi:namedview
     fit-margin-bottom="0"
     fit-margin-right="0"
     fit-margin-left="0"
     fit-margin-top="0"
     inkscape:showpageshadow="false"
     inkscape:current-layer="g63"
     inkscape:window-maximized="1"
     inkscape:window-y="24"
     inkscape:window-x="0"
     inkscape:cy="110.13953"
     inkscape:cx="256"
     inkscape:zoom="3.5566406"
     showgrid="false"
     id="namedview7"
     inkscape:window-height="1033"
     inkscape:window-width="1920"
     inkscape:pageshadow="2"
     inkscape:pageopacity="0"
     guidetolerance="10"
     gridtolerance="10"
     objecttolerance="10"
     borderopacity="1"
     bordercolor="#666666"
     pagecolor="#ffffff" />
  <metadata
     id="metadata5939">
    <rdf:RDF>
      <cc:Work
         rdf:about="">
        <dc:format>image/svg+xml</dc:format>
        <dc:type
           rdf:resource="http://purl.org/dc/dcmitype/StillImage" />
        <dc:title></dc:title>
      </cc:Work>
    </rdf:RDF>
  </metadata>
  <g
     transform="matrix(0.91103203,0,0,0.91103203,-14.499623,-0.43968559)"
     id="g63">
    <g
       transform="matrix(1.1906976,0,0,1.1906976,-3.0350675,-0.09191719)"
       id="g120">
      <path
         style="fill:#000000;stroke-width:0.896923"
         id="path6498"
         d="M 15.915602,27.346751 V 0.48200491 H 140.80037 V 54.211496 H 15.915602 Z" />
      <g
         id="g72"
         transform="matrix(0.99208364,0,0,1.0015301,9.6503532,-1.614977)">
        <path
           sodipodi:nodetypes="cccccccccccccccccccccccccccccccccccc"
           id="path2830"
           d="M 10.70651,32.307962 16.547591,9.315345 h 5.416274 l 2.814339,10.036038 2.920541,-10.036038 h 5.09767 l 4.779067,16.939135 11.660167,-0.022 c 1.224006,-0.01193 1.299086,-2.543055 -0.09065,-2.542394 l -6.790452,-0.09065 c -2.915955,0.02821 -5.990812,-3.12644 -5.84108,-7.327902 0.03111,-3.853781 3.391583,-6.888588 7.690495,-6.887543 l 17.319951,-0.01555 4.407361,6.000383 4.30116,-6.053484 7.1686,0.0531 -7.858909,11.044952 8.496115,11.976103 -7.13105,-0.022 -4.94481,-6.87199 -4.703971,6.87199 -7.2748,-0.0064 8.283713,-11.841465 -3.610849,-5.256972 -15.055946,0.022 c -1.643133,0.01506 -1.582884,2.600007 0.01288,2.551503 l 6.343652,0.09709 c 2.681053,0.01736 6.456903,2.803416 6.362976,7.153046 0.041,5.056766 -4.513507,7.366893 -6.706245,7.243695 l -16.604978,0.022 -2.761239,-10.345534 -2.761238,10.323538 H 22.244921 L 19.361929,22.05956 16.828646,32.345549 Z"
           style="fill:#ffffff;fill-opacity:1;stroke:none;stroke-width:0;stroke-linecap:butt;stroke-linejoin:miter;stroke-miterlimit:4;stroke-dasharray:none;stroke-opacity:1" />
        <g
           id="g51"
           style="fill:#ffffff">
          <path
             d="m 70.8996,43.59229 v -2.5496 h 2.8056 v 5.0992 h -2.8056 z m 5.9506,4.0678 c 0.80535,-0.63327 1.1881,-1.9026 1.1881,-3.9403 0,-2.0984 -0.38134,-3.2908 -1.2994,-4.063 -0.75714,-0.63687 -0.87435,-0.6538 -4.5267,-0.6538 -4.1854,0 -4.6514,0.14815 -5.2927,1.6824 -0.43136,1.032 -0.48064,5.2457 -0.07073,6.047 0.67868,1.3266 1.0902,1.4375 5.3556,1.4436 3.6309,0.005 4.0413,-0.0404 4.6459,-0.51585 z"
             id="path39"
             style="fill:#ffffff" />
          <path
             d="m 56.1062,43.59229 v -2.5496 h 2.8056 v 5.0992 h -2.8056 z m 6.2827,4.1375 c 0.91889,-0.74406 1.1503,-1.5295 1.1503,-3.9045 0,-4.2998 -0.5437,-4.8832 -4.6912,-5.034 l -2.7418,-0.0997 v -3.023 l -4.4634,0.1472 -0.13658,12.366 5.1694,-0.006 c 4.5125,-0.005 5.2385,-0.0617 5.7134,-0.44618 z"
             id="path35"
             style="fill:#ffffff" />
          <path
             id="path31"
             d="m 45.0819,44.67589 0.07077,-3.6332 h 4.3219 v -2.0397 l -2.8693,0.006 c -3.4795,0.008 -4.7289,0.26759 -5.4836,1.1421 -0.53727,0.62256 -0.57387,0.89716 -0.57387,4.3052 0,2.0021 0.08078,3.721 0.17951,3.8197 0.09872,0.0987 1.103,0.14651 2.2317,0.10624 l 2.0522,-0.0732 z"
             style="fill:#ffffff" />
          <path
             id="path29"
             d="m 37.232,43.71979 v -4.7168 h -4.591 v 7.139 h -2.8056 v -7.139 h -4.3359 v 4.1674 c 0,3.6509 0.05532,4.2155 0.44634,4.556 0.73368,0.63892 1.0072,0.66912 6.2488,0.69007 l 5.0373,0.0201 z"
             style="fill:#ffffff" />
          <path
             id="path27"
             d="m 22.694,47.42699 v -1.0095 l -4.2084,-0.1481 -0.07268,-2.6134 -0.07269,-2.6134 h 4.3537 v -2.0397 h -4.3359 v -3.3344 l -4.4634,0.1472 -0.07594,1.5935 -0.07594,1.5935 h -3.0363 v 2.0397 h 3.0606 l 0.0035,2.7408 c 0.0019,1.5075 0.07597,3.0115 0.16457,3.3424 0.2709,1.0116 1.3937,1.2897 5.2518,1.3007 l 3.507,0.01 z"
             style="fill:#ffffff" />
        </g>
      </g>
      <g
         id="g76"
         transform="matrix(1.0015301,0,0,1.0015301,-0.01638497,-0.00740324)">
        <path
           d="M 136.25183,27.312363 V 4.83845 H 91.304 v 44.947826 h 44.94783 z"
           id="path21"
           style="fill:#ffffff;stroke-width:0.900705" />
        <path
           id="path25"
           style="fill:#000000;stroke-width:0.941373"
           d="m 117.64362,20.15794 v -3.338678 h -10.14908 v 6.677356 h 10.14908 z M 99.27825,27.312223 V 9.1882395 h 18.6136 l 8.45116,6.2590735 v 8.764836 h -7.10209 l 9.02266,6.558099 0.007,7.33312 0.007,7.333118 h -8.45059 l -0.064,-7.094608 -0.064,-7.094608 -12.20316,-0.127393 v 14.316236 h -8.21609 z" />
      </g>
    </g>
  </g>
</svg>
