<?xml version="1.0" encoding="UTF-8" standalone="no"?>
<svg
   xmlns:dc="http://purl.org/dc/elements/1.1/"
   xmlns:cc="http://creativecommons.org/ns#"
   xmlns:rdf="http://www.w3.org/1999/02/22-rdf-syntax-ns#"
   xmlns:svg="http://www.w3.org/2000/svg"
   xmlns="http://www.w3.org/2000/svg"
   xmlns:sodipodi="http://sodipodi.sourceforge.net/DTD/sodipodi-0.dtd"
   xmlns:inkscape="http://www.inkscape.org/namespaces/inkscape"
   width="512"
   height="512"
   viewBox="0 0 52.4288 52.433735"
   preserveAspectRatio="xMinYMin meet"
   version="1.1"
   id="svg18"
   sodipodi:docname="lang-python.svg"
   inkscape:version="0.92.4 (unknown)">
  <metadata
     id="metadata22">
    <rdf:RDF>
      <cc:Work
         rdf:about="">
        <dc:format>image/svg+xml</dc:format>
        <dc:type
           rdf:resource="http://purl.org/dc/dcmitype/StillImage" />
        <dc:title></dc:title>
      </cc:Work>
    </rdf:RDF>
  </metadata>
  <sodipodi:namedview
     pagecolor="#ffffff"
     bordercolor="#666666"
     borderopacity="1"
     objecttolerance="10"
     gridtolerance="10"
     guidetolerance="10"
     inkscape:pageopacity="0"
     inkscape:pageshadow="2"
     inkscape:window-width="1920"
     inkscape:window-height="1032"
     id="namedview20"
     showgrid="false"
     borderlayer="false"
     inkscape:showpageshadow="false"
     fit-margin-top="0"
     fit-margin-left="0"
     fit-margin-right="0"
     fit-margin-bottom="0"
     inkscape:zoom="1.6132812"
     inkscape:cx="256"
     inkscape:cy="256"
     inkscape:window-x="0"
     inkscape:window-y="23"
     inkscape:window-maximized="1"
     inkscape:current-layer="svg18" />
  <defs
     id="defs12">
    <linearGradient
       x1="24.714632"
       y1="22.897127"
       x2="151.13583"
       y2="148.33623"
       id="a"
       gradientTransform="matrix(0.2061584,0,0,0.20661815,1.1488209,-0.29938301)"
       gradientUnits="userSpaceOnUse">
      <stop
         stop-color="#387EB8"
         offset="0%"
         id="stop2" />
      <stop
         stop-color="#366994"
         offset="100%"
         id="stop4" />
    </linearGradient>
    <linearGradient
       x1="102.48345"
       y1="103.26573"
       x2="238.2592"
       y2="231.90517"
       id="b"
       gradientTransform="matrix(0.20615837,0,0,0.20661819,1.1488209,-0.29938301)"
       gradientUnits="userSpaceOnUse">
      <stop
         stop-color="#FFE052"
         offset="0%"
         id="stop7" />
      <stop
         stop-color="#FFC331"
         offset="100%"
         id="stop9" />
    </linearGradient>
  </defs>
  <circle
     style="opacity:1;fill:none;fill-opacity:1;stroke:none;stroke-width:1.37497509;stroke-linecap:round;stroke-linejoin:round;stroke-miterlimit:4;stroke-dasharray:none;stroke-dashoffset:0;stroke-opacity:1;paint-order:stroke fill markers"
     id="path816"
     cx="26.216867"
     cy="26.216867"
     r="26.216867" />
  <g
     id="g830"
     transform="matrix(0.98789346,0,0,0.98789346,-0.98246345,0.59847639)">
    <path
       inkscape:connector-curvature="0"
       style="fill:url(#a);stroke-width:0.20638815"
       id="path14"
       d="m 27.342779,-0.28452301 c -13.380556,0 -12.545097,5.80260001 -12.545097,5.80260001 l 0.01486,6.01167 h 12.768822 v 1.80487 H 9.740966 c 0,0 -8.5622188,-0.97106 -8.5622188,12.52982 0,13.50129 7.4733149,13.02247 7.4733149,13.02247 H 13.11211 v -6.26511 c 0,0 -0.240442,-7.47332 7.354022,-7.47332 h 12.66439 c 0,0 7.115231,0.11496 7.115231,-6.87665 V 6.711617 c 0,0 1.080649,-6.99614001 -12.902974,-6.99614001 z M 20.302054,3.758207 a 2.2950362,2.2950362 0 0 1 2.2971,2.2971 2.2950362,2.2950362 0 0 1 -2.2971,2.2971 2.2950362,2.2950362 0 0 1 -2.2971,-2.2971 2.2950362,2.2950362 0 0 1 2.2971,-2.2971 z" />
    <path
       inkscape:connector-curvature="0"
       style="fill:url(#b);stroke-width:0.20638815"
       id="path16"
       d="m 27.72274,52.149207 c 13.380556,0 12.545097,-5.8026 12.545097,-5.8026 l -0.01486,-6.01147 H 27.483949 v -1.80486 h 17.840398 c 0,0 8.562218,0.97105 8.562218,-12.53024 0,-13.50109 -7.473314,-13.02227 -7.473314,-13.02227 h -4.460048 v 6.26491 c 0,0 0.240442,7.47332 -7.354023,7.47332 H 21.93479 c 0,0 -7.115231,-0.11496 -7.115231,6.87685 v 11.56042 c 0,0 -1.080442,6.99594 12.902974,6.99594 z m 7.040725,-4.04232 a 2.2950362,2.2950362 0 0 1 -2.2971,-2.2971 2.2950362,2.2950362 0 0 1 2.2971,-2.2973 2.2950362,2.2950362 0 0 1 2.2971,2.2971 2.2950362,2.2950362 0 0 1 -2.2971,2.2971 z" />
  </g>
</svg>
