<?xml version="1.0" encoding="UTF-8" standalone="no"?>
<svg
   xmlns:dc="http://purl.org/dc/elements/1.1/"
   xmlns:cc="http://creativecommons.org/ns#"
   xmlns:rdf="http://www.w3.org/1999/02/22-rdf-syntax-ns#"
   xmlns:svg="http://www.w3.org/2000/svg"
   xmlns="http://www.w3.org/2000/svg"
   xmlns:sodipodi="http://sodipodi.sourceforge.net/DTD/sodipodi-0.dtd"
   xmlns:inkscape="http://www.inkscape.org/namespaces/inkscape"
   width="511.93982"
   height="512"
   viewBox="0.004 0 13.104226 13.1072"
   version="1.1"
   id="svg6"
   sodipodi:docname="bitcoin.svg"
   inkscape:version="0.92.4 (unknown)">
  <metadata
     id="metadata12">
    <rdf:RDF>
      <cc:Work
         rdf:about="">
        <dc:format>image/svg+xml</dc:format>
        <dc:type
           rdf:resource="http://purl.org/dc/dcmitype/StillImage" />
        <dc:title></dc:title>
      </cc:Work>
    </rdf:RDF>
  </metadata>
  <defs
     id="defs10" />
  <sodipodi:namedview
     pagecolor="#ffffff"
     bordercolor="#666666"
     borderopacity="1"
     objecttolerance="10"
     gridtolerance="10"
     guidetolerance="10"
     inkscape:pageopacity="0"
     inkscape:pageshadow="2"
     inkscape:window-width="938"
     inkscape:window-height="610"
     id="namedview8"
     showgrid="false"
     inkscape:showpageshadow="false"
     fit-margin-top="0"
     fit-margin-left="0"
     fit-margin-right="0"
     fit-margin-bottom="0"
     inkscape:zoom="0.7890625"
     inkscape:cx="255.96991"
     inkscape:cy="256"
     inkscape:window-x="0"
     inkscape:window-y="24"
     inkscape:window-maximized="0"
     inkscape:current-layer="svg6" />
  <g
     id="g16"
     transform="matrix(0.20479897,0,0,0.20479897,-3.0389277e-4,1.2199355e-4)">
    <path
       id="path2"
       d="M 63.04,39.741 C 58.766,56.884 41.402,67.316 24.257,63.042 7.12,58.768 -3.313,41.404 0.962,24.262 5.234,7.117 22.597,-3.317 39.737,0.957 56.881,5.231 67.313,22.597 63.039,39.741 Z"
       inkscape:connector-curvature="0"
       style="fill:#f7931a" />
    <path
       id="path4"
       d="m 46.11,27.441 c 0.636,-4.258 -2.606,-6.547 -7.039,-8.074 l 1.438,-5.768 -3.512,-0.875 -1.4,5.616 c -0.922,-0.23 -1.87,-0.447 -2.812,-0.662 l 1.41,-5.653 -3.509,-0.875 -1.439,5.766 C 28.483,16.742 27.733,16.57 27.005,16.389 l 0.004,-0.018 -4.842,-1.209 -0.934,3.75 c 0,0 2.605,0.597 2.55,0.634 1.422,0.355 1.68,1.296 1.636,2.042 l -1.638,6.571 c 0.098,0.025 0.225,0.061 0.365,0.117 l -0.37,-0.092 -2.297,9.205 c -0.174,0.432 -0.615,1.08 -1.609,0.834 0.035,0.051 -2.552,-0.637 -2.552,-0.637 l -1.743,4.02 4.57,1.139 c 0.85,0.213 1.683,0.436 2.502,0.646 l -1.453,5.835 3.507,0.875 1.44,-5.772 c 0.957,0.26 1.887,0.5 2.797,0.726 l -1.434,5.745 3.511,0.875 1.453,-5.823 c 5.987,1.133 10.49,0.676 12.383,-4.738 1.527,-4.36 -0.075,-6.875 -3.225,-8.516 2.294,-0.531 4.022,-2.04 4.483,-5.157 z M 38.087,38.69 c -1.086,4.36 -8.426,2.004 -10.807,1.412 l 1.928,-7.729 c 2.38,0.594 10.011,1.77 8.88,6.317 z m 1.085,-11.312 c -0.99,3.966 -7.1,1.951 -9.083,1.457 l 1.748,-7.01 c 1.983,0.494 8.367,1.416 7.335,5.553 z"
       inkscape:connector-curvature="0"
       style="fill:#ffffff" />
  </g>
</svg>
