<?xml version="1.0" encoding="UTF-8" standalone="no"?>
<svg
   xmlns:dc="http://purl.org/dc/elements/1.1/"
   xmlns:cc="http://creativecommons.org/ns#"
   xmlns:rdf="http://www.w3.org/1999/02/22-rdf-syntax-ns#"
   xmlns:svg="http://www.w3.org/2000/svg"
   xmlns="http://www.w3.org/2000/svg"
   xmlns:sodipodi="http://sodipodi.sourceforge.net/DTD/sodipodi-0.dtd"
   xmlns:inkscape="http://www.inkscape.org/namespaces/inkscape"
   viewBox="-1.146 0 47.922685 48.180937"
   width="511.67307"
   height="512"
   version="1.1"
   id="svg21"
   sodipodi:docname="steam.svg"
   inkscape:version="0.92.4 (unknown)">
  <metadata
     id="metadata27">
    <rdf:RDF>
      <cc:Work
         rdf:about="">
        <dc:format>image/svg+xml</dc:format>
        <dc:type
           rdf:resource="http://purl.org/dc/dcmitype/StillImage" />
        <dc:title></dc:title>
      </cc:Work>
    </rdf:RDF>
  </metadata>
  <defs
     id="defs25" />
  <sodipodi:namedview
     pagecolor="#ffffff"
     bordercolor="#666666"
     borderopacity="1"
     objecttolerance="10"
     gridtolerance="10"
     guidetolerance="10"
     inkscape:pageopacity="0"
     inkscape:pageshadow="2"
     inkscape:window-width="1600"
     inkscape:window-height="851"
     id="namedview23"
     showgrid="false"
     inkscape:showpageshadow="false"
     fit-margin-top="0"
     fit-margin-left="0"
     fit-margin-right="0"
     fit-margin-bottom="0"
     inkscape:zoom="1.2597656"
     inkscape:cx="260.53347"
     inkscape:cy="256.00001"
     inkscape:window-x="0"
     inkscape:window-y="24"
     inkscape:window-maximized="1"
     inkscape:current-layer="svg21" />
  <linearGradient
     id="a"
     x1="116.68862"
     x2="116.68862"
     y2="232.87497"
     gradientTransform="scale(0.99946338,1.0005369)"
     y1="0"
     gradientUnits="userSpaceOnUse">
    <stop
       offset="0"
       stop-color="#111d2e"
       id="stop2" />
    <stop
       offset=".212"
       stop-color="#051839"
       id="stop4" />
    <stop
       offset=".407"
       stop-color="#0a1b48"
       id="stop6" />
    <stop
       offset=".581"
       stop-color="#132e62"
       id="stop8" />
    <stop
       offset=".738"
       stop-color="#144b7e"
       id="stop10" />
    <stop
       offset=".873"
       stop-color="#136497"
       id="stop12" />
    <stop
       offset="1"
       stop-color="#1387b8"
       id="stop14" />
  </linearGradient>
  <g
     id="g31"
     transform="matrix(0.20678514,0,0,0.20678514,-1.2907157,0)">
    <path
       id="path17"
       d="m 4.891,150.01 c 14.393,48.01 58.916,82.99 111.61,82.99 64.34,0 116.5,-52.16 116.5,-116.5 C 233.001,52.159 180.841,0 116.501,0 54.761,0 4.241,48.029 0.251,108.76 c 7.54,12.66 10.481,20.49 4.641,41.25 z"
       style="fill:url(#a)"
       inkscape:connector-curvature="0" />
    <path
       id="path19"
       d="m 110.5,87.322 c 0,0.196 0,0.392 0.01,0.576 L 82.002,129.31 c -4.618,-0.21 -9.252,0.6 -13.646,2.41 a 31.698,31.698 0 0 0 -5.455,2.88 L 0.302,108.83 c 0,0 -1.448,23.83 4.588,41.59 l 44.254,18.26 c 2.222,9.93 9.034,18.64 19.084,22.83 16.443,6.87 35.402,-0.96 42.242,-17.41 1.78,-4.3 2.61,-8.81 2.49,-13.31 l 40.79,-29.15 c 0.33,0.01 0.67,0.02 1,0.02 24.41,0 44.25,-19.9 44.25,-44.338 C 199,62.882 179.16,43 154.75,43 130.35,43 110.5,62.882 110.5,87.322 Z m -6.84,83.918 c -5.294,12.71 -19.9,18.74 -32.596,13.45 -5.857,-2.44 -10.279,-6.91 -12.83,-12.24 l 14.405,5.97 c 9.363,3.9 20.105,-0.54 23.997,-9.9 3.904,-9.37 -0.525,-20.13 -9.883,-24.03 l -14.891,-6.17 c 5.746,-2.18 12.278,-2.26 18.381,0.28 6.153,2.56 10.927,7.38 13.457,13.54 2.53,6.16 2.52,12.96 -0.04,19.1 m 51.09,-54.38 c -16.25,0 -29.48,-13.25 -29.48,-29.538 0,-16.275 13.23,-29.529 29.48,-29.529 16.26,0 29.49,13.254 29.49,29.529 0,16.288 -13.23,29.538 -29.49,29.538 M 132.66,87.277 c 0,-12.253 9.92,-22.191 22.14,-22.191 12.23,0 22.15,9.938 22.15,22.191 0,12.254 -9.92,22.183 -22.15,22.183 -12.22,0 -22.14,-9.929 -22.14,-22.183 z"
       inkscape:connector-curvature="0"
       style="fill:#ffffff" />
  </g>
</svg>
