<?xml version="1.0" encoding="UTF-8" standalone="no"?>
<svg
   xmlns:dc="http://purl.org/dc/elements/1.1/"
   xmlns:cc="http://creativecommons.org/ns#"
   xmlns:rdf="http://www.w3.org/1999/02/22-rdf-syntax-ns#"
   xmlns:svg="http://www.w3.org/2000/svg"
   xmlns="http://www.w3.org/2000/svg"
   xmlns:sodipodi="http://sodipodi.sourceforge.net/DTD/sodipodi-0.dtd"
   xmlns:inkscape="http://www.inkscape.org/namespaces/inkscape"
   width="512"
   height="512"
   viewBox="221.807 89.47 127.20496 127.19329"
   enable-background="new 221.807 89.47 440 621.061"
   version="1.1"
   id="svg29"
   sodipodi:docname="lang-html5.svg"
   inkscape:version="0.92.4 (unknown)">
  <metadata
     id="metadata35">
    <rdf:RDF>
      <cc:Work
         rdf:about="">
        <dc:format>image/svg+xml</dc:format>
        <dc:type
           rdf:resource="http://purl.org/dc/dcmitype/StillImage" />
        <dc:title></dc:title>
      </cc:Work>
    </rdf:RDF>
  </metadata>
  <defs
     id="defs33" />
  <sodipodi:namedview
     pagecolor="#ffffff"
     bordercolor="#666666"
     borderopacity="1"
     objecttolerance="10"
     gridtolerance="10"
     guidetolerance="10"
     inkscape:pageopacity="0"
     inkscape:pageshadow="2"
     inkscape:window-width="1920"
     inkscape:window-height="1032"
     id="namedview31"
     showgrid="false"
     inkscape:showpageshadow="false"
     fit-margin-top="0"
     fit-margin-left="0"
     fit-margin-right="0"
     fit-margin-bottom="0"
     inkscape:zoom="1.6132812"
     inkscape:cx="256"
     inkscape:cy="256"
     inkscape:window-x="0"
     inkscape:window-y="23"
     inkscape:window-maximized="1"
     inkscape:current-layer="svg29" />
  <filter
     id="a"
     width="1.5"
     height="1.5"
     x="-0.050000001"
     y="-0.050000001">
    <feFlood
       flood-color="#000"
       result="floodFill"
       flood-opacity=".5"
       id="feFlood2" />
    <feComposite
       in="floodFill"
       in2="SourceAlpha"
       operator="in"
       result="coloredAlpha"
       id="feComposite4" />
    <feGaussianBlur
       in="coloredAlpha"
       result="blur"
       stdDeviation="8"
       id="feGaussianBlur6" />
    <feComposite
       in="blur"
       in2="SourceGraphic"
       operator="out"
       result="maskedOffsetBlur"
       id="feComposite8" />
    <feMerge
       id="feMerge14">
      <feMergeNode
         in="maskedOffsetBlur"
         id="feMergeNode10" />
      <feMergeNode
         in="SourceGraphic"
         id="feMergeNode12" />
    </feMerge>
  </filter>
  <circle
     style="opacity:1;fill:none;fill-opacity:1;stroke:none;stroke-width:3.33570862;stroke-linecap:round;stroke-linejoin:round;stroke-miterlimit:4;stroke-dasharray:none;stroke-dashoffset:0;stroke-opacity:1;paint-order:stroke fill markers"
     id="path816"
     cx="285.40948"
     cy="153.06665"
     r="63.602482" />
  <g
     id="g1023"
     transform="matrix(0.21061546,0,0,0.21060416,192.3581,64.976861)">
    <path
       d="M 261.849,660.647 221.807,211.522 h 440 L 621.721,660.576 441.537,710.53 Z"
       id="path17"
       inkscape:connector-curvature="0"
       style="fill:#e44d26" />
    <path
       d="M 441.807,672.348 587.403,631.981 621.661,248.246 H 441.807 Z"
       id="path19"
       inkscape:connector-curvature="0"
       style="fill:#f16529" />
    <path
       d="m 441.807,414.82 h -72.888 l -5.035,-56.406 h 77.923 V 303.33 H 303.683 l 1.32,14.778 13.538,151.794 h 123.266 z m 0,143.056 -0.242,0.066 -61.346,-16.566 -3.922,-43.93 h -55.294 l 7.718,86.489 112.834,31.323 0.252,-0.071 z"
       id="path21"
       inkscape:connector-curvature="0"
       style="fill:#ebebeb" />
    <path
       d="m 441.617,414.82 v 55.082 h 67.83 l -6.395,71.44 -61.435,16.58 v 57.307 l 112.924,-31.294 0.826,-9.309 12.946,-145.014 1.344,-14.792 h -14.842 z m 0,-111.49 v 55.084 H 574.67 l 1.103,-12.382 2.51,-27.924 1.318,-14.778 z"
       id="path25"
       inkscape:connector-curvature="0"
       style="fill:#ffffff" />
  </g>
</svg>
