<?xml version="1.0" encoding="UTF-8" standalone="no"?>
<svg
   xmlns:dc="http://purl.org/dc/elements/1.1/"
   xmlns:cc="http://creativecommons.org/ns#"
   xmlns:rdf="http://www.w3.org/1999/02/22-rdf-syntax-ns#"
   xmlns:svg="http://www.w3.org/2000/svg"
   xmlns="http://www.w3.org/2000/svg"
   xmlns:sodipodi="http://sodipodi.sourceforge.net/DTD/sodipodi-0.dtd"
   xmlns:inkscape="http://www.inkscape.org/namespaces/inkscape"
   inkscape:version="1.0 (1.0+r73+1)"
   height="459.64035"
   width="512"
   sodipodi:docname="spring-boot.svg"
   xml:space="preserve"
   viewBox="0 0 512 459.64036"
   y="0px"
   x="0px"
   id="Layer_1"
   version="1.1"><metadata
   id="metadata15"><rdf:RDF><cc:Work
       rdf:about=""><dc:format>image/svg+xml</dc:format><dc:type
         rdf:resource="http://purl.org/dc/dcmitype/StillImage" /><dc:title>icon-spring-boot</dc:title></cc:Work></rdf:RDF></metadata><defs
   id="defs13" /><sodipodi:namedview
   inkscape:current-layer="Layer_1"
   inkscape:window-maximized="1"
   inkscape:window-y="24"
   inkscape:window-x="0"
   inkscape:cy="229.82018"
   inkscape:cx="256"
   inkscape:zoom="1.8253402"
   fit-margin-bottom="0"
   fit-margin-right="0"
   fit-margin-left="0"
   fit-margin-top="0"
   inkscape:showpageshadow="false"
   showgrid="false"
   id="namedview11"
   inkscape:window-height="1033"
   inkscape:window-width="1920"
   inkscape:pageshadow="2"
   inkscape:pageopacity="0"
   guidetolerance="10"
   gridtolerance="10"
   objecttolerance="10"
   borderopacity="1"
   bordercolor="#666666"
   pagecolor="#ffffff" />
<style
   id="style2"
   type="text/css">
	.st0{fill:#6DB33F;}
</style>
<title
   id="title4">icon-spring-boot</title>
<path
   style="stroke-width:1.00402"
   id="path6"
   d="M 505.44877,202.20963 404.54476,27.61055 C 395.80979,12.449848 374.32376,0 356.75341,0 H 155.14619 C 137.67624,0 116.08981,12.449848 107.35484,27.61055 L 6.5512305,202.20963 c -8.734974,15.1607 -8.734974,39.95999 0,55.1207 L 107.35484,432.02981 c 8.73497,15.1607 30.221,27.61055 47.79135,27.61055 h 201.70762 c 17.46995,0 38.95598,-12.44985 47.79135,-27.61055 L 505.44877,257.33033 c 8.73497,-15.16071 8.73497,-39.96 0,-55.1207 z M 234.16256,96.586724 c 0,-11.445828 9.33739,-20.783214 20.78322,-20.783214 11.44583,0 20.78321,9.337386 20.78321,20.783214 V 220.784 c 0,11.44583 -9.33738,20.78321 -20.78321,20.78321 -11.44583,0 -20.78322,-9.33738 -20.78322,-20.78321 v 0 z m 20.78322,265.161686 c -77.71115,0 -140.96441,-63.25326 -140.96441,-140.96441 0.1004,-44.57849 21.18482,-86.44612 56.92793,-113.15306 8.23297,-6.12452 19.7792,-4.41768 25.90372,3.81528 6.12452,8.23296 4.41769,19.77919 -3.81528,25.90372 v 0 c -46.08451,34.23708 -55.72311,99.39798 -21.48602,145.48249 34.23708,46.08452 99.39798,55.72311 145.4825,21.48603 26.40572,-19.57839 41.96803,-50.60261 41.96803,-83.53446 -0.1004,-33.03226 -15.76311,-64.05648 -42.36964,-83.73527 -8.23297,-6.02412 -9.9398,-17.67075 -3.91568,-25.90372 6.02412,-8.23296 17.67075,-9.93979 25.90372,-3.91567 36.04431,26.60653 57.22914,68.77537 57.32954,113.55466 0,77.81155 -63.25326,140.96441 -140.96441,140.96441 z"
   class="st0" />
</svg>
