<?xml version="1.0" encoding="UTF-8" standalone="no"?>
<svg
   xmlns:dc="http://purl.org/dc/elements/1.1/"
   xmlns:cc="http://creativecommons.org/ns#"
   xmlns:rdf="http://www.w3.org/1999/02/22-rdf-syntax-ns#"
   xmlns:svg="http://www.w3.org/2000/svg"
   xmlns="http://www.w3.org/2000/svg"
   xmlns:sodipodi="http://sodipodi.sourceforge.net/DTD/sodipodi-0.dtd"
   xmlns:inkscape="http://www.inkscape.org/namespaces/inkscape"
   inkscape:version="1.0 (1.0+r73+1)"
   sodipodi:docname="gradle.svg"
   id="svg27"
   version="1.1"
   preserveAspectRatio="xMidYMid"
   viewBox="0 0 52.367664 52.6336"
   height="512"
   width="509.35736">
  <metadata
     id="metadata33">
    <rdf:RDF>
      <cc:Work
         rdf:about="">
        <dc:format>image/svg+xml</dc:format>
        <dc:type
           rdf:resource="http://purl.org/dc/dcmitype/StillImage" />
        <dc:title></dc:title>
      </cc:Work>
    </rdf:RDF>
  </metadata>
  <defs
     id="defs31" />
  <sodipodi:namedview
     inkscape:current-layer="svg27"
     inkscape:window-maximized="1"
     inkscape:window-y="24"
     inkscape:window-x="0"
     inkscape:cy="256"
     inkscape:cx="254.67868"
     inkscape:zoom="1.6035156"
     fit-margin-bottom="0"
     fit-margin-right="0"
     fit-margin-left="0"
     fit-margin-top="0"
     inkscape:showpageshadow="false"
     showgrid="false"
     id="namedview29"
     inkscape:window-height="1033"
     inkscape:window-width="1920"
     inkscape:pageshadow="2"
     inkscape:pageopacity="0"
     guidetolerance="10"
     gridtolerance="10"
     objecttolerance="10"
     borderopacity="1"
     bordercolor="#666666"
     pagecolor="#ffffff" />
  <g
     transform="matrix(0.20536017,0,0,0.20536017,-0.18749384,-0.07381603)"
     id="g38">
    <path
       d="m 105.61,45.74 h 72.158 l 36.4,63.049 h 41.569 C 246.274,47.342 193.172,0.291 129.077,0.291 c -16.21,0 -31.702,3.039 -45.978,8.53 l 22.51,36.92"
       fill="#006533"
       id="path21" />
    <path
       d="m 216.098,146.763 -38.33,66.39 H 81.112 L 32.785,129.447 71.395,62.572 50.063,27.584 c -29.91,23.463 -49.15,59.908 -49.15,100.87 0,70.783 57.381,128.164 128.164,128.164 64.564,0 117.953,-47.749 126.84,-109.855 h -39.82"
       fill="#82b816"
       id="path23" />
    <path
       d="m 174.51,128.115 c 0,25.28 -20.493,45.773 -45.773,45.773 -25.28,0 -45.772,-20.493 -45.772,-45.773 0,-25.28 20.493,-45.773 45.772,-45.773 25.28,0 45.773,20.493 45.773,45.773"
       fill="#006532"
       id="path25" />
  </g>
</svg>
