<?xml version="1.0" encoding="UTF-8" standalone="no"?>
<svg
   width="512"
   height="512"
   viewBox="0 0 54.659687 54.660096"
   version="1.1"
   id="svg6"
   sodipodi:docname="social-facebook.svg"
   inkscape:version="1.1 (1:1.1+202105261517+ce6663b3b7)"
   xmlns:inkscape="http://www.inkscape.org/namespaces/inkscape"
   xmlns:sodipodi="http://sodipodi.sourceforge.net/DTD/sodipodi-0.dtd"
   xmlns="http://www.w3.org/2000/svg"
   xmlns:svg="http://www.w3.org/2000/svg"
   xmlns:rdf="http://www.w3.org/1999/02/22-rdf-syntax-ns#"
   xmlns:cc="http://creativecommons.org/ns#"
   xmlns:dc="http://purl.org/dc/elements/1.1/">
  <metadata
     id="metadata12">
    <rdf:RDF>
      <cc:Work
         rdf:about="">
        <dc:format>image/svg+xml</dc:format>
        <dc:type
           rdf:resource="http://purl.org/dc/dcmitype/StillImage" />
      </cc:Work>
    </rdf:RDF>
  </metadata>
  <defs
     id="defs10" />
  <sodipodi:namedview
     pagecolor="#ffffff"
     bordercolor="#666666"
     borderopacity="1"
     objecttolerance="10"
     gridtolerance="10"
     guidetolerance="10"
     inkscape:pageopacity="0"
     inkscape:pageshadow="2"
     inkscape:window-width="1600"
     inkscape:window-height="851"
     id="namedview8"
     showgrid="false"
     inkscape:showpageshadow="false"
     fit-margin-top="0"
     fit-margin-left="0"
     fit-margin-right="0"
     fit-margin-bottom="0"
     inkscape:zoom="1.5449219"
     inkscape:cx="256"
     inkscape:cy="256"
     inkscape:window-x="0"
     inkscape:window-y="24"
     inkscape:window-maximized="1"
     inkscape:current-layer="svg6"
     inkscape:pagecheckerboard="0" />
  <g
     id="g16"
     transform="matrix(0.20480153,0,0,0.2048,-2.0474628e-4,0)">
    <path
       id="path2"
       d="m 252.164,266.895 c 8.134,0 14.729,-6.596 14.729,-14.73 V 14.73 C 266.893,6.593 260.297,0 252.164,0 H 14.73 C 6.593,0 0,6.594 0,14.73 v 237.434 c 0,8.135 6.593,14.73 14.73,14.73 h 237.434 z"
       inkscape:connector-curvature="0"
       style="fill:#485a96" />
    <path
       id="path4"
       d="M 184.152,266.895 V 163.539 h 34.692 l 5.194,-40.28 H 184.151 V 97.542 c 0,-11.662 3.238,-19.609 19.962,-19.609 l 21.329,-0.01 V 41.897 c -3.689,-0.49 -16.351,-1.587 -31.08,-1.587 -30.753,0 -51.807,18.771 -51.807,53.244 v 29.705 h -34.781 v 40.28 h 34.781 v 103.355 h 41.597 z"
       inkscape:connector-curvature="0"
       style="fill:#ffffff" />
  </g>
</svg>
