<?xml version="1.0" encoding="UTF-8" standalone="no"?>
<svg
   xmlns:dc="http://purl.org/dc/elements/1.1/"
   xmlns:cc="http://creativecommons.org/ns#"
   xmlns:rdf="http://www.w3.org/1999/02/22-rdf-syntax-ns#"
   xmlns:svg="http://www.w3.org/2000/svg"
   xmlns="http://www.w3.org/2000/svg"
   xmlns:xlink="http://www.w3.org/1999/xlink"
   xmlns:sodipodi="http://sodipodi.sourceforge.net/DTD/sodipodi-0.dtd"
   xmlns:inkscape="http://www.inkscape.org/namespaces/inkscape"
   inkscape:version="1.0 (1.0+r73+1)"
   sodipodi:docname="maxima-2.svg"
   id="svg45"
   version="1.1"
   width="512"
   height="512">
  <metadata
     id="metadata49">
    <rdf:RDF>
      <cc:Work
         rdf:about="">
        <dc:format>image/svg+xml</dc:format>
        <dc:type
           rdf:resource="http://purl.org/dc/dcmitype/StillImage" />
        <dc:title></dc:title>
      </cc:Work>
    </rdf:RDF>
  </metadata>
  <sodipodi:namedview
     inkscape:current-layer="svg45"
     inkscape:window-maximized="1"
     inkscape:window-y="24"
     inkscape:window-x="0"
     inkscape:cy="256"
     inkscape:cx="256"
     inkscape:zoom="1.6386719"
     fit-margin-bottom="0"
     fit-margin-right="0"
     fit-margin-left="0"
     fit-margin-top="0"
     inkscape:showpageshadow="false"
     showgrid="false"
     id="namedview47"
     inkscape:window-height="1033"
     inkscape:window-width="1920"
     inkscape:pageshadow="2"
     inkscape:pageopacity="0"
     guidetolerance="10"
     gridtolerance="10"
     objecttolerance="10"
     borderopacity="1"
     bordercolor="#666666"
     pagecolor="#ffffff" />
  <defs
     id="defs23">
    <filter
       id="emboss">
      <feGaussianBlur
         id="feGaussianBlur11"
         result="blur"
         stdDeviation="2"
         in="SourceAlpha" />
      <feSpecularLighting
         id="feSpecularLighting15"
         kernelUnitLength="1"
         result="spec"
         specularExponent="16"
         specularConstant="1"
         surfaceScale="-3"
         in="blur">
        <feDistantLight
           id="feDistantLight13"
           elevation="45"
           azimuth="45" />
      </feSpecularLighting>
      <feComposite
         id="feComposite17"
         result="specOut"
         operator="in"
         in2="SourceGraphic"
         in="spec" />
    </filter>
    <path
       id="Sigma"
       d="m 20.04,-75.84 h 20.28 c 13.92,0 17.64,2.76 19.68,14.64 h 3.12 l -1.2,-19.56 H 2.64 L 28.8,-38.4 0.6,0 h 63.6 l 6.48,-21.6 H 67.56 C 63.72,-12 60.12,-9.96 46.2,-9.96 H 14.16 l 25.32,-34.32 z" />
    <path
       id="M"
       d="m 64.704,-55.008 v 43.488 c 0,7.968 -1.152,9.216 -8.736,9.696 h 26.88 v 0 c -7.008,-0.48 -8.352,-1.824 -8.352,-8.64 v -42.624 c 0,-6.816 1.248,-8.064 8.352,-8.64 v -1.824 H 63.744 l -21.216,48.48 -22.176,-48.48 H 1.344 v 1.824 c 7.872,0.48 9.12,1.632 9.12,8.64 v 38.976 c 0,9.888 -1.344,11.712 -9.312,12.288 h 22.56 v 0 C 16.32,-2.208 14.688,-4.416 14.688,-14.112 V -52.8 L 38.784,0 h 1.344 z" />
    <path
       id="xi"
       d="m 36.12,-91.68 c -1.08,-0.12 -2.04,-0.24 -2.64,-0.24 -5.4,0 -10.8,4.32 -11.64,9.24 -0.72,4.44 1.32,7.08 6.84,8.76 -3.36,2.88 -5.52,6.48 -6.24,10.44 -0.72,4.56 0.6,8.4 4.44,12.72 -4.68,3.12 -6.96,4.92 -9.48,7.32 -5.16,5.04 -9,12.36 -10.08,19.32 -1.68,9.48 1.8,18.24 8.4,21.84 3.6,1.92 8.04,2.64 15.36,2.64 2.16,0 4.8,-0.12 10.56,-0.36 4.68,-0.24 7.8,3.24 7.08,7.92 -0.72,4.56 -4.56,7.92 -9,7.92 -0.6,0 -2.88,-0.24 -5.16,-0.72 -2.76,-0.36 -3.72,-0.48 -4.8,-0.48 -3,0 -5.4,2.04 -5.88,5.04 -0.72,4.08 2.88,6.96 8.76,6.96 5.64,0 10.32,-2.4 15.12,-7.56 4.2,-4.56 6.96,-10.08 7.92,-15.6 0.96,-5.4 -0.36,-9.6 -3.72,-12.48 -2.4,-2.16 -5.04,-2.76 -10.44,-2.76 H 31.08 c -5.16,0 -9.12,-0.48 -11.16,-1.44 -4.68,-2.28 -7.32,-7.92 -6.24,-14.16 1.44,-8.52 7.8,-15.72 18.84,-21.48 3.12,1.2 5.52,1.56 9.24,1.56 9.48,0 15.6,-2.52 16.32,-6.72 0.48,-2.76 -2.4,-4.32 -7.68,-4.32 -4.68,0 -9.24,1.32 -18.24,5.04 C 27.6,-57 26.4,-59.4 27,-63.24 c 0.6,-3.72 3.48,-7.32 8.52,-10.68 6,-0.24 10.2,-0.96 13.8,-2.64 4.32,-2.04 7.56,-5.04 7.92,-7.8 0.48,-2.28 -1.32,-3.6 -4.68,-3.6 -4.44,0 -9.84,2.76 -18.6,9.6 -3.84,-0.12 -6,-2.4 -5.4,-5.52 0.36,-2.64 2.76,-4.44 7.2,-5.64 z" />
    <clipPath
       id="clipPath948"
       clipPathUnits="userSpaceOnUse">
      <rect
         style="opacity:0.5;fill:#782121;fill-rule:evenodd;stroke-width:1.04526;stroke-linecap:square;stroke-dashoffset:200;paint-order:stroke fill markers"
         id="rect950"
         width="119"
         height="119"
         x="7.6423721"
         y="6.9339399" />
    </clipPath>
  </defs>
  <g
     transform="matrix(4.302521,0,0,4.302521,-32.881467,-29.833422)"
     clip-path="url(#clipPath948)"
     id="g932">
    <g
       id="g913">
      <use
         xlink:href="#xi"
         x="1"
         y="99"
         style="fill:#000080"
         id="use27"
         width="100%"
         height="100%" />
      <use
         xlink:href="#xi"
         x="1"
         y="99"
         style="filter:url(#emboss)"
         id="use29"
         width="100%"
         height="100%" />
    </g>
    <g
       id="g921">
      <use
         xlink:href="#Sigma"
         x="56"
         y="99"
         style="fill:#000080"
         id="use33"
         width="100%"
         height="100%" />
      <use
         xlink:href="#Sigma"
         x="56"
         y="99"
         style="filter:url(#emboss)"
         id="use35"
         width="100%"
         height="100%" />
    </g>
    <g
       id="g917">
      <use
         xlink:href="#M"
         x="29"
         y="95"
         style="fill:#b40000"
         id="use39"
         width="100%"
         height="100%" />
      <use
         xlink:href="#M"
         x="29"
         y="95"
         style="filter:url(#emboss)"
         id="use41"
         width="100%"
         height="100%" />
    </g>
  </g>
</svg>
