<?xml version="1.0" encoding="UTF-8" standalone="no"?>
<svg
   xmlns:dc="http://purl.org/dc/elements/1.1/"
   xmlns:cc="http://creativecommons.org/ns#"
   xmlns:rdf="http://www.w3.org/1999/02/22-rdf-syntax-ns#"
   xmlns:svg="http://www.w3.org/2000/svg"
   xmlns="http://www.w3.org/2000/svg"
   xmlns:sodipodi="http://sodipodi.sourceforge.net/DTD/sodipodi-0.dtd"
   xmlns:inkscape="http://www.inkscape.org/namespaces/inkscape"
   inkscape:version="1.0 (1.0+r73+1)"
   height="187.29514"
   width="512"
   sodipodi:docname="browser-opera-3.svg.svg"
   id="svg10"
   version="1.1"
   viewBox="0 0 511.99999 187.29513">
  <metadata
     id="metadata16">
    <rdf:RDF>
      <cc:Work
         rdf:about="">
        <dc:format>image/svg+xml</dc:format>
        <dc:type
           rdf:resource="http://purl.org/dc/dcmitype/StillImage" />
        <dc:title>Opera Logo</dc:title>
      </cc:Work>
    </rdf:RDF>
  </metadata>
  <defs
     id="defs14" />
  <sodipodi:namedview
     inkscape:current-layer="svg10"
     inkscape:window-maximized="1"
     inkscape:window-y="24"
     inkscape:window-x="0"
     inkscape:cy="93.647568"
     inkscape:cx="256"
     inkscape:zoom="3.5566406"
     fit-margin-bottom="0"
     fit-margin-right="0"
     fit-margin-left="0"
     fit-margin-top="0"
     inkscape:showpageshadow="false"
     showgrid="false"
     id="namedview12"
     inkscape:window-height="1033"
     inkscape:window-width="1920"
     inkscape:pageshadow="2"
     inkscape:pageopacity="0"
     guidetolerance="10"
     gridtolerance="10"
     objecttolerance="10"
     borderopacity="1"
     bordercolor="#666666"
     pagecolor="#ffffff" />
  <title
     id="title2">Opera Logo</title>
  <g
     transform="scale(2.3295705)"
     id="g8"
     fill="#ff1b2d">
    <path
       id="path4"
       d="m 80.398,40.2 c 0,11.908 -5.18,22.605 -13.406,29.965 C 56.682,75.189 47.072,71.672 43.89,69.478 54.018,67.255 61.67,55.01 61.67,40.198 61.67,25.386 54.02,13.144 43.89,10.92 47.07,8.727 56.68,5.21 66.992,10.233 75.22,17.593 80.398,28.29 80.398,40.2 Z" />
    <path
       id="path6"
       d="m 26.967,17.546 c -4.444,5.246 -7.323,13.003 -7.52,21.707 v 1.894 c 0.196,8.704 3.076,16.46 7.52,21.707 5.767,7.49 14.34,12.237 23.913,12.237 5.888,0 11.397,-1.797 16.11,-4.922 -7.112,6.36 -16.5,10.23 -26.79,10.23 -0.643,0 -1.28,-0.016 -1.915,-0.045 C 16.972,79.353 0,61.758 0,40.2 0,17.997 17.998,0 40.2,0 l 0.15,0.002 C 50.585,0.04 59.915,3.902 66.992,10.232 62.28,7.108 56.77,5.31 50.88,5.31 c -9.573,0 -18.146,4.75 -23.913,12.238 z m 115.686,16.29 c -3.56,0 -6.626,1.678 -8.702,4.335 v -3.745 h -2.834 V 67 h 2.835 V 55.32 c 2.077,2.656 5.144,4.334 8.703,4.334 6.614,0 11.996,-5.79 11.996,-12.91 -0.002,-7.117 -5.383,-12.908 -11.997,-12.908 z m 0,23.017 c -5.07,0 -9.195,-4.534 -9.195,-10.108 0,-5.573 4.125,-10.107 9.195,-10.107 5.07,0 9.195,4.534 9.195,10.107 0,5.574 -4.125,10.108 -9.195,10.108 z M 111.08,24.326 c -9.47,0 -17.175,8.078 -17.175,18.007 0,9.928 7.705,18.007 17.176,18.007 9.472,0 17.177,-8.078 17.177,-18.007 0,-9.93 -7.705,-18.007 -17.176,-18.007 z m 0,33.308 c -7.98,0 -14.47,-6.865 -14.47,-15.302 0,-8.438 6.49,-15.302 14.47,-15.302 7.98,0 14.473,6.864 14.473,15.302 0,8.438 -6.492,15.302 -14.472,15.302 z m 83.23,-23.699 c -0.978,0.043 -1.9,0.3 -2.76,0.758 -1.815,0.967 -3.07,2.44 -3.872,4.318 l -0.06,0.133 c -0.01,0 -0.017,-0.003 -0.026,-0.005 v -4.513 h -0.003 v -0.045 h -2.836 v 24.405 h 2.838 V 46.179 c 0,-1.8 0.283,-3.263 0.873,-4.69 0.545,-1.32 1.31,-2.494 2.403,-3.432 1.286,-1.102 2.76,-1.575 4.45,-1.306 0.273,0.042 0.544,0.102 0.83,0.157 0.16,-0.808 0.545,-1.836 0.71,-2.654 -0.787,-0.22 -1.814,-0.35 -2.55,-0.318 z m -25.125,-0.06 c -6.614,0 -11.995,5.79 -11.995,12.91 0,7.117 5.38,12.907 11.995,12.907 4.73,0 8.83,-2.964 10.78,-7.256 l -2.44,-1.42 c -1.46,3.462 -4.646,5.875 -8.34,5.875 -4.79,0 -8.733,-4.05 -9.153,-9.2 h 21.116 c 0.02,-0.3 0.032,-0.6 0.032,-0.907 0,-7.6 -4.932,-12.908 -11.995,-12.908 z m 0,2.8 c 5.01,0 8.51,3.376 9.098,8.545 h -18.17 c 0.687,-4.832 4.488,-8.544 9.072,-8.544 z m 47.765,-2.249 v 3.746 c -2.077,-2.657 -5.144,-4.335 -8.703,-4.335 -6.614,0 -11.995,5.79 -11.995,12.91 0,7.117 5.38,12.908 11.995,12.908 3.56,0 6.626,-1.678 8.702,-4.335 v 3.668 h 2.834 V 34.426 h -2.835 z m -8.702,22.427 c -5.07,0 -9.195,-4.534 -9.195,-10.108 0,-5.573 4.124,-10.107 9.195,-10.107 5.071,0 9.195,4.534 9.195,10.107 0,5.574 -4.125,10.108 -9.195,10.108 z" />
  </g>
</svg>
