<?xml version="1.0" encoding="UTF-8" standalone="no"?>
<svg
   xmlns:dc="http://purl.org/dc/elements/1.1/"
   xmlns:cc="http://creativecommons.org/ns#"
   xmlns:rdf="http://www.w3.org/1999/02/22-rdf-syntax-ns#"
   xmlns:svg="http://www.w3.org/2000/svg"
   xmlns="http://www.w3.org/2000/svg"
   xmlns:sodipodi="http://sodipodi.sourceforge.net/DTD/sodipodi-0.dtd"
   xmlns:inkscape="http://www.inkscape.org/namespaces/inkscape"
   stroke-miterlimit="1.4"
   viewBox="0 0 489.04626 512"
   version="1.1"
   id="svg68"
   sodipodi:docname="os-gentoo.svg"
   width="489.04626"
   height="512"
   style="clip-rule:evenodd;fill-rule:evenodd;stroke-linejoin:round;stroke-miterlimit:1.39999998"
   inkscape:version="0.92.4 (unknown)">
  <metadata
     id="metadata72">
    <rdf:RDF>
      <cc:Work
         rdf:about="">
        <dc:format>image/svg+xml</dc:format>
        <dc:type
           rdf:resource="http://purl.org/dc/dcmitype/StillImage" />
        <dc:title></dc:title>
      </cc:Work>
    </rdf:RDF>
  </metadata>
  <sodipodi:namedview
     pagecolor="#ffffff"
     bordercolor="#666666"
     borderopacity="1"
     objecttolerance="10"
     gridtolerance="10"
     guidetolerance="10"
     inkscape:pageopacity="0"
     inkscape:pageshadow="2"
     inkscape:window-width="1600"
     inkscape:window-height="851"
     id="namedview70"
     showgrid="false"
     showguides="false"
     inkscape:showpageshadow="false"
     fit-margin-top="0"
     fit-margin-left="0"
     fit-margin-right="0"
     fit-margin-bottom="0"
     inkscape:zoom="1.2597656"
     inkscape:cx="244.52313"
     inkscape:cy="256"
     inkscape:window-x="0"
     inkscape:window-y="24"
     inkscape:window-maximized="1"
     inkscape:current-layer="svg68" />
  <g
     id="g12"
     transform="matrix(1.3134012,0,0,1.3134012,-83.730137,-24.841101)">
    <path
       d="m 63.8,329.8 c 0,-16.5 14,-39.4 34,-60.3 13.2,-14 26.6,-26.2 56,-51.2 C 133.5,207.1 101.8,193.7 86,176 80,169.5 69.5,154.7 71.6,135 75.8,94.8 125.4,33.7 196,20.8 c 23.5,-4.3 50.5,-1.2 72.7,8.8 69.6,31.3 154.8,109 165.2,147 3.6,13.4 3,34.7 -3.4,46.6 -8,14.7 -35.2,44.6 -72.5,75.4 -58.5,48.4 -140.5,100.4 -201.8,109 -19.8,3 -40,0 -54.2,-8 -22.2,-12.5 -29.6,-29.3 -32.2,-34.3 -7,-13.3 -6,-30.2 -6,-35.5 z M 228.6,145 c 0.7,-9.3 37.3,0 35,7.4 -2.4,7.7 -36,3.3 -35,-7.4 z"
       id="path4"
       style="fill:url(#a)"
       inkscape:connector-curvature="0" />
    <path
       d="m 173.6,203 c -19.2,16 -32,27 -48,41.7 -38.7,35.3 -65,62.2 -51.4,99 15.6,42.3 49.8,40.2 90,32.3 C 267.6,355.6 437.6,225 428.9,176.6 421.9,137.6 326.9,59.9 270.6,32.3 253,23.6 232.8,19.3 212.6,20.1 135,24 74.6,94.3 77.8,132.4 c 3,37 96.7,69.5 95.6,70.6 z M 162,73.2 c -23.3,26 -8.4,76 30.2,103.3 45.2,32 118.3,37.7 132.8,13 27.2,-46 -2.5,-94.5 -46.7,-116 C 234.6,52 176.5,57 162,73.2 Z"
       id="path6"
       style="fill:url(#b)"
       inkscape:connector-curvature="0" />
    <path
       d="m 241.4,175.5 c 32.6,4.5 60.8,-8.5 65.2,-40.8 3.3,-24.6 -34.3,-51.4 -57,-57.6 -18.8,-5 -59.7,1.6 -62.5,37.3 -2.8,37 35.3,58.6 54.4,61.2 z m -16,-61.7 c -21.5,33.2 31,43.5 39.2,37.4 34.7,-26.2 -29.8,-52 -39.2,-37.4 z"
       id="path8"
       style="fill:url(#c)"
       inkscape:connector-curvature="0" />
    <path
       d="m 206.3,29 c -38,4 -45.2,9 -79.6,35 -11.7,8.5 -32.7,29.7 -38.2,55 -2,9.6 0.4,18 7.3,23.7 22,18.6 59,33.7 89.5,48.2 9,4.2 3,12 -11.4,24.4 -36.3,31.3 -85.2,69.4 -88.6,98.5 -1.6,13.6 3,32.2 19.7,41.7 19.5,11.2 59.8,4 86.7,-6 39.4,-14.8 91,-47 132,-79 42.7,-33 82.4,-75 84.3,-81.7 2.4,-8.4 2.2,-16.2 -2.4,-25 -7.3,-14 -17,-24.6 -27.6,-36.2 C 350,98 320,72 284.5,52 258.8,37.7 236.2,25.8 206.3,29 Z M 262,95.4 c 27.5,13.3 55.7,48 0,68.2 -15.3,5.4 -63.5,-13.4 -62,-39 2,-38 28.6,-45.4 62,-29.2 z"
       id="path10"
       style="fill:url(#d)"
       inkscape:connector-curvature="0" />
  </g>
  <defs
     id="defs66">
    <linearGradient
       id="a"
       x2="1"
       gradientUnits="userSpaceOnUse"
       gradientTransform="matrix(244.70008,1281.5475,-1281.5475,244.70008,5.2617577,-872.7775)">
      <stop
         offset="0%"
         stop-color="#fff"
         id="stop14" />
      <stop
         offset="34%"
         stop-color="#fff"
         id="stop16" />
      <stop
         offset="51%"
         stop-color="#bebdf3"
         id="stop18" />
      <stop
         offset="75%"
         stop-color="#867fb7"
         id="stop20" />
      <stop
         offset="87%"
         stop-color="#9f99c7"
         id="stop22" />
      <stop
         offset="100%"
         stop-color="#524c76"
         id="stop24" />
    </linearGradient>
    <linearGradient
       id="b"
       x2="1"
       gradientUnits="userSpaceOnUse"
       gradientTransform="matrix(-73.911326,-331.39374,331.39374,-73.911326,306.28015,306.96717)">
      <stop
         offset="0%"
         stop-color="#fff"
         id="stop27" />
      <stop
         offset="34%"
         stop-color="#fff"
         id="stop29" />
      <stop
         offset="51%"
         stop-color="#bebbdb"
         id="stop31" />
      <stop
         offset="75%"
         stop-color="#928bbe"
         id="stop33" />
      <stop
         offset="87%"
         stop-color="#9f99c7"
         id="stop35" />
      <stop
         offset="100%"
         stop-color="#524c76"
         id="stop37" />
    </linearGradient>
    <radialGradient
       id="c"
       cx="0"
       cy="0"
       r="1"
       gradientUnits="userSpaceOnUse"
       gradientTransform="matrix(65.776,0,0,50.415,219.576,105.5)">
      <stop
         offset="0%"
         stop-color="#fff"
         id="stop40" />
      <stop
         offset="34%"
         stop-color="#fff"
         id="stop42" />
      <stop
         offset="51%"
         stop-color="#bebbdb"
         id="stop44" />
      <stop
         offset="75%"
         stop-color="#928bbe"
         id="stop46" />
      <stop
         offset="87%"
         stop-color="#9f99c7"
         id="stop48" />
      <stop
         offset="100%"
         stop-color="#524c76"
         id="stop50" />
    </radialGradient>
    <radialGradient
       id="d"
       cx="0"
       cy="0"
       r="1"
       gradientUnits="userSpaceOnUse"
       gradientTransform="matrix(-9.017,572.145,-487.965,-7.683,69.926,121.634)">
      <stop
         offset="0%"
         stop-color="#fff"
         id="stop53" />
      <stop
         offset="34%"
         stop-color="#fff"
         id="stop55" />
      <stop
         offset="51%"
         stop-color="#bebbdb"
         id="stop57" />
      <stop
         offset="75%"
         stop-color="#928bbe"
         id="stop59" />
      <stop
         offset="87%"
         stop-color="#9f99c7"
         id="stop61" />
      <stop
         offset="100%"
         stop-color="#524c76"
         id="stop63" />
    </radialGradient>
  </defs>
</svg>
