<?xml version="1.0" encoding="UTF-8" standalone="no"?>
<svg
   xmlns:dc="http://purl.org/dc/elements/1.1/"
   xmlns:cc="http://creativecommons.org/ns#"
   xmlns:rdf="http://www.w3.org/1999/02/22-rdf-syntax-ns#"
   xmlns:svg="http://www.w3.org/2000/svg"
   xmlns="http://www.w3.org/2000/svg"
   xmlns:sodipodi="http://sodipodi.sourceforge.net/DTD/sodipodi-0.dtd"
   xmlns:inkscape="http://www.inkscape.org/namespaces/inkscape"
   inkscape:version="1.0 (1.0+r73+1)"
   height="497.56168"
   width="512"
   sodipodi:docname="lang-xcode.svg"
   id="svg19"
   version="1.1"
   stroke-linejoin="round"
   stroke-linecap="round"
   stroke="#000000"
   fill-rule="evenodd"
   fill="#ffffff"
   viewBox="0 0 512 497.56168">
  <metadata
     id="metadata25">
    <rdf:RDF>
      <cc:Work
         rdf:about="">
        <dc:format>image/svg+xml</dc:format>
        <dc:type
           rdf:resource="http://purl.org/dc/dcmitype/StillImage" />
        <dc:title></dc:title>
      </cc:Work>
    </rdf:RDF>
  </metadata>
  <defs
     id="defs23" />
  <sodipodi:namedview
     inkscape:current-layer="svg19"
     inkscape:window-maximized="1"
     inkscape:window-y="24"
     inkscape:window-x="0"
     inkscape:cy="248.78084"
     inkscape:cx="256"
     inkscape:zoom="1.6500467"
     fit-margin-bottom="0"
     fit-margin-right="0"
     fit-margin-left="0"
     fit-margin-top="0"
     inkscape:showpageshadow="false"
     showgrid="false"
     id="namedview21"
     inkscape:window-height="1033"
     inkscape:window-width="1920"
     inkscape:pageshadow="2"
     inkscape:pageopacity="0"
     guidetolerance="10"
     gridtolerance="10"
     objecttolerance="10"
     borderopacity="1"
     bordercolor="#666666"
     pagecolor="#ffffff" />
  <g
     transform="matrix(13.088447,0,0,13.088447,-6.5573714,-6.5435941)"
     id="g62">
    <path
       style="fill:#235ee1;fill-rule:nonzero;stroke:none"
       id="path27"
       d="m 29.314,16.355 0.203,-0.676 2.298,-7.22 c 0.417,-1.06 1.126,-1.656 2.23,-1.78 0.732,-0.08 1.5,-0.146 2.005,0.552 0.327,0.44 0.698,0.698 1.228,0.788 A 3.35,3.35 0 0 1 38.01,8.21 c 0.327,0.124 0.45,-0.01 0.54,-0.315 l 0.867,-2.95 C 39.744,3.83 39.744,3.841 38.662,3.458 38.212,3.3 37.806,3.233 37.332,3.435 36.566,3.75 35.868,3.635 35.248,3.007 34.595,2.354 33.851,1.847 32.961,1.531 30.404,0.631 27.779,0.247 25.087,0.675 c -1.295,0.203 -2.557,0.552 -3.65,1.33 -0.158,0.113 -0.282,0.248 -0.428,0.383 1.487,-0.124 2.917,-0.146 4.348,0.045 0.97,0.124 1.836,0.45 2.478,1.273 0.676,0.867 0.834,1.892 0.924,2.93 0.124,1.453 -0.146,2.85 -0.552,4.235 l -1.25,4.416 c -0.056,0.2 -0.1,0.36 0.158,0.428 l 2.197,0.642 z" />
    <path
       style="fill:#235ee1;fill-rule:nonzero;stroke:none"
       id="path29"
       d="m 22.386,38.5 c 0.7,0.056 1.284,-0.27 1.645,-0.9 a 4.66,4.66 0 0 0 0.484,-1.205 l 3.222,-13.427 1.307,-5.576 c 0.1,-0.36 0,-0.507 -0.35,-0.586 l -1.42,-0.394 c -0.867,-0.26 -0.698,-0.225 -0.957,0.496 L 19.93,35.11 c -0.1,0.248 -0.17,0.518 -0.18,0.777 -0.07,1.533 1.013,2.613 2.646,2.613 z M 0.533,11.478 l 0.135,1 0.98,6.488 0.957,6.534 1,6.578 0.62,4.168 c 0.045,0.293 0.146,0.428 0.496,0.372 l 6.15,-0.98 8.775,-1.363 c 0.113,-0.023 0.203,-0.158 0.304,-0.248 -0.124,-0.068 -0.27,-0.2 -0.383,-0.18 l -4.787,0.72 -9.687,1.52 C 4.755,36.143 4.643,36.064 4.597,35.737 L 3.979,31.537 2.57,22.22 1.05,12.06 C 0.994,11.688 1.118,11.52 1.49,11.474 L 3.44,11.17 11.415,9.875 24.865,7.667 27.895,7.149 C 28.019,7.126 28.109,6.946 28.21,6.845 L 27.804,6.687 C 27.77,6.677 27.724,6.697 27.68,6.71 L 23.906,7.34 0.86,11.14 C 0.578,11.185 0.432,11.264 0.533,11.5 Z m 32.103,-3.74 c -0.068,0 -0.135,0 -0.203,-0.01 -0.034,0.282 -0.135,0.574 -0.1,0.856 l 0.45,2.737 1.217,7.344 2.016,12.03 c 0.045,0.237 0,0.406 -0.293,0.45 l -6.488,1.014 -3.075,0.507 c -0.1,0.01 -0.17,0.158 -0.248,0.248 0.113,0.056 0.214,0.158 0.315,0.158 0.327,-0.023 0.642,-0.08 0.957,-0.124 l 9.394,-1.5 -3.942,-23.7 z m -8.55,14.193 c 0.26,-0.26 0.214,-0.45 0.034,-0.665 l -2.106,-2.534 -5.925,-7.153 c -0.158,-0.2 -0.293,-0.45 -0.338,-0.698 -0.08,-0.484 0.248,-0.924 0.72,-1.115 0.507,-0.2 0.946,-0.056 1.374,0.45 l 5.824,6.96 1.42,1.678 c 0.248,-0.26 0.214,-0.45 0.034,-0.665 L 22.791,15.407 18.094,9.82 c -0.63,-0.732 -1.588,-0.777 -2.287,-0.17 -0.687,0.597 -0.72,1.442 -0.08,2.208 l 8.36,10.062 z m -7.77,-4.742 c -0.08,-0.056 -0.17,-0.135 -0.27,-0.18 l -2.332,-0.856 c -0.248,-0.1 -0.36,0 -0.45,0.214 L 9.006,26.83 c -0.113,0.26 -0.034,0.383 0.203,0.473 l 2.185,0.9 c 0.394,0.18 0.552,0.1 0.698,-0.304 l 4.224,-10.712 z m 7.424,4.833 -1.51,-1.917 c -0.383,-0.586 -0.8,-0.9 -1.52,-0.597 -0.17,0.068 -0.36,0.068 -0.54,0.1 l -4.517,0.777 c -0.237,0.045 -0.44,0.1 -0.54,0.383 l -0.912,2.5 c -0.034,0.1 -0.034,0.203 -0.056,0.36 l 9.597,-1.577 z M 11.08,21.02 5.662,21.9 l 0.35,2.456 c 0.045,0.35 0.2,0.394 0.507,0.35 l 2.794,-0.383 c 0.282,-0.034 0.462,-0.146 0.574,-0.406 l 1.048,-2.433 c 0.056,-0.135 0.08,-0.248 0.146,-0.462 z m 19.802,7.03 -3.4,-2.06 c 0.045,0.214 0.023,0.462 0.135,0.586 a 2.7,2.7 0 0 0 0.755,0.586 c 0.383,0.214 0.788,0.36 1.183,0.552 0.574,0.282 1,0.687 1,1.385 0,0.113 0.056,0.225 0.1,0.35 l 0.113,-0.056 c 0.03,-0.03 0.056,-0.065 0.08,-0.1 0.676,-1.003 0.72,-2.106 0.428,-3.233 -0.327,-1.262 -0.912,-2.354 -2.14,-2.985 -0.338,-0.17 -0.552,-0.023 -0.8,0.146 -0.26,0.18 -0.406,0.394 -0.338,0.777 0.18,-0.113 0.338,-0.2 0.45,-0.304 0.282,-0.293 0.54,-0.225 0.856,-0.023 1.24,0.867 2.016,3.053 1.577,4.382 z" />
    <path
       style="fill:#235ee1;fill-rule:nonzero;stroke:none"
       id="path31"
       d="m 8.227,32.768 a 0.98,0.98 0 0 0 0.135,0.056 L 11.742,28.6 11.359,28.397 9.209,27.53 C 8.871,27.384 8.769,27.485 8.747,27.834 l -0.304,2.85 -0.214,2.084 z m 7.265,-19.42 c -0.653,0.068 -1.08,0.338 -1.33,0.912 l -0.518,1.24 c -0.113,0.237 -0.08,0.383 0.2,0.473 l 2.253,0.834 c 0.27,0.1 0.383,0.01 0.484,-0.225 l 0.54,-1.284 c 0.237,-0.574 0.135,-1.06 -0.383,-1.397 -0.372,-0.237 -0.822,-0.372 -1.24,-0.552 z m 13.213,7.773 2.795,-0.394 c 0.08,-0.01 0.18,-0.214 0.17,-0.304 l -0.406,-2.23 c -0.023,-0.113 -0.214,-0.27 -0.327,-0.27 -0.473,0.034 -0.946,0.1 -1.42,0.18 -0.237,0.034 -0.406,0.146 -0.27,0.484 l 1.307,-0.158 c 0.1,-0.01 0.293,0.08 0.304,0.146 l 0.327,1.746 -2.095,0.282 c -0.248,0.034 -0.473,0.1 -0.394,0.518 z m 0.6,-4.766 -2.176,-0.63 c -0.26,-0.08 -0.214,-0.237 -0.158,-0.428 l 1.25,-4.416 c 0.406,-1.385 0.676,-2.794 0.552,-4.235 -0.1,-1.036 -0.237,-2.05 -0.924,-2.93 -0.642,-0.822 -1.5,-1.15 -2.478,-1.273 -1.43,-0.2 -2.85,-0.17 -4.348,-0.045 0.146,-0.124 0.27,-0.27 0.428,-0.383 1.093,-0.777 2.354,-1.125 3.649,-1.33 2.703,-0.428 5.317,-0.023 7.874,0.856 0.9,0.304 1.633,0.822 2.287,1.476 0.62,0.62 1.318,0.743 2.084,0.428 0.473,-0.203 0.88,-0.135 1.33,0.023 1.08,0.383 1.08,0.372 0.755,1.487 l -0.867,2.95 c -0.1,0.304 -0.214,0.428 -0.54,0.315 A 3.34,3.34 0 0 0 37.291,8.029 C 36.761,7.949 36.379,7.691 36.063,7.241 35.556,6.554 34.79,6.611 34.058,6.689 c -1.104,0.124 -1.814,0.72 -2.23,1.78 -0.935,2.354 -1.622,4.787 -2.298,7.22 l -0.214,0.665 z" />
    <path
       style="fill:#235ee1;fill-rule:nonzero;stroke:none"
       id="path33"
       d="m 22.386,38.5 c -1.633,-0.01 -2.703,-1.07 -2.647,-2.613 0.01,-0.26 0.1,-0.53 0.18,-0.777 l 6.4,-18.192 c 0.248,-0.72 0.1,-0.743 0.957,-0.496 l 1.42,0.394 c 0.35,0.08 0.44,0.225 0.35,0.586 L 27.73,22.98 24.527,36.406 a 4.66,4.66 0 0 1 -0.484,1.205 c -0.372,0.62 -0.946,0.946 -1.656,0.9 z M 0.534,11.478 c -0.1,-0.237 0.045,-0.315 0.338,-0.36 l 7.637,-1.25 7.434,-1.228 7.975,-1.307 3.774,-0.63 c 0.045,-0.01 0.1,-0.034 0.124,-0.023 l 0.406,0.158 c -0.1,0.1 -0.2,0.282 -0.315,0.304 l -3.03,0.518 -21.425,3.505 -1.95,0.304 c -0.372,0.045 -0.496,0.214 -0.44,0.586 l 2.93,19.476 0.608,4.202 c 0.045,0.327 0.146,0.406 0.496,0.35 l 9.687,-1.52 4.787,-0.72 c 0.113,-0.01 0.26,0.113 0.383,0.18 -0.1,0.1 -0.2,0.225 -0.304,0.248 l -8.775,1.363 -6.15,0.98 c -0.35,0.056 -0.45,-0.08 -0.496,-0.372 l -0.62,-4.168 -1,-6.578 -0.957,-6.533 -0.98,-6.488 -0.146,-0.99 z m 32.103,-3.74 3.965,23.722 -2.208,0.36 -7.187,1.15 -0.957,0.124 c -0.1,0.01 -0.214,-0.1 -0.315,-0.158 0.08,-0.1 0.158,-0.225 0.248,-0.248 l 3.075,-0.507 6.488,-1.014 c 0.293,-0.045 0.327,-0.214 0.293,-0.45 l -0.788,-4.686 -2.444,-14.7 -0.45,-2.737 c -0.034,-0.27 0.068,-0.563 0.1,-0.856 0.056,-0.01 0.113,-0.01 0.18,-0.01 z m -8.55,14.193 -1.06,-1.262 -7.3,-8.8 c -0.642,-0.766 -0.608,-1.6 0.08,-2.208 0.7,-0.62 1.667,-0.574 2.287,0.17 l 7.03,8.37 c 0.18,0.214 0.225,0.406 -0.034,0.665 l -1.42,-1.678 -5.824,-6.96 c -0.428,-0.507 -0.867,-0.653 -1.374,-0.45 -0.484,0.2 -0.8,0.63 -0.72,1.115 a 1.4,1.4 0 0 0 0.338,0.698 l 8.04,9.688 c 0.18,0.214 0.237,0.406 -0.034,0.665 z m -7.77,-4.742 -0.135,0.383 -4.1,10.352 c -0.158,0.394 -0.304,0.484 -0.698,0.304 l -2.185,-0.9 C 8.951,27.228 8.884,27.114 8.996,26.855 l 4.258,-10.464 c 0.1,-0.225 0.203,-0.315 0.45,-0.214 l 2.332,0.856 c 0.1,0.023 0.18,0.1 0.27,0.158 z m -2.658,-0.563 -0.54,1.34 -3.492,8.55 c -0.135,0.338 -0.068,0.473 0.248,0.586 l 1.33,0.54 c 0.338,0.17 0.473,0.1 0.608,-0.248 l 3.954,-10.003 -2.106,-0.766 z m 10.07,5.396 -9.585,1.578 c 0.023,-0.158 0.023,-0.26 0.056,-0.36 l 0.912,-2.5 c 0.1,-0.282 0.304,-0.35 0.54,-0.383 l 4.517,-0.777 c 0.18,-0.034 0.372,-0.023 0.54,-0.1 0.7,-0.282 1.126,0.023 1.52,0.597 0.417,0.642 0.935,1.217 1.498,1.926 z m -8.966,1.025 8.144,-1.352 -1.34,-1.678 c -0.08,-0.1 -0.26,-0.135 -0.394,-0.124 l -1.16,0.18 -4,0.698 c -0.17,0.034 -0.417,0.135 -0.473,0.27 -0.282,0.63 -0.507,1.284 -0.766,2.005 z m -3.686,-2.028 -0.146,0.44 -1.048,2.433 c -0.113,0.27 -0.282,0.372 -0.574,0.406 l -2.794,0.383 c -0.315,0.045 -0.462,0 -0.507,-0.35 l -0.35,-2.456 5.418,-0.856 z m -0.698,0.574 -3.83,0.62 c -0.124,0.023 -0.327,0.225 -0.327,0.327 0.034,0.484 0.124,0.97 0.225,1.453 0.023,0.1 0.214,0.214 0.304,0.203 l 2.287,-0.315 c 0.146,-0.023 0.36,-0.1 0.417,-0.214 l 0.924,-2.073 z m 20.5,6.455 c 0.44,-1.33 -0.338,-3.514 -1.577,-4.36 -0.304,-0.214 -0.563,-0.27 -0.856,0.023 -0.113,0.113 -0.27,0.18 -0.45,0.304 -0.068,-0.394 0.08,-0.597 0.338,-0.777 0.248,-0.18 0.462,-0.315 0.8,-0.146 1.228,0.63 1.814,1.723 2.14,2.985 0.293,1.126 0.248,2.23 -0.428,3.233 -0.023,0.036 -0.05,0.07 -0.08,0.1 -0.023,0.023 -0.045,0.023 -0.113,0.056 -0.034,-0.124 -0.1,-0.237 -0.1,-0.35 0,-0.698 -0.417,-1.104 -1,-1.385 L 28.37,27.179 c -0.282,-0.158 -0.552,-0.35 -0.755,-0.586 -0.113,-0.124 -0.1,-0.372 -0.135,-0.586 l 3.4,2.04 z" />
    <path
       style="fill:#235ee1;fill-rule:nonzero;stroke:none"
       id="path35"
       d="m 8.227,32.768 0.203,-2.084 0.304,-2.85 c 0.034,-0.35 0.124,-0.45 0.462,-0.304 l 2.15,0.867 c 0.113,0.045 0.214,0.113 0.383,0.203 l -3.38,4.224 C 8.315,32.814 8.269,32.79 8.225,32.768 Z M 8.8,31.46 c 0.034,0.01 0.068,0.01 0.1,0.023 l 2.14,-2.726 -1.86,-0.732 -0.372,3.436 z m 6.7,-18.112 c 0.417,0.18 0.867,0.315 1.24,0.563 0.518,0.338 0.62,0.822 0.383,1.397 l -0.54,1.284 c -0.1,0.237 -0.214,0.327 -0.484,0.225 l -2.253,-0.834 c -0.27,-0.1 -0.293,-0.237 -0.2,-0.473 l 0.518,-1.24 c 0.248,-0.586 0.665,-0.856 1.33,-0.924 z m -1.373,2.252 1.88,0.687 c 0.068,0.023 0.225,-0.08 0.27,-0.17 l 0.44,-1.003 c 0.146,-0.315 0.08,-0.62 -0.2,-0.777 -0.315,-0.2 -0.665,-0.327 -1.025,-0.417 -0.394,-0.1 -0.72,0.1 -0.88,0.473 l -0.496,1.205 z m 14.588,5.53 c -0.1,-0.428 0.146,-0.484 0.394,-0.518 l 2.095,-0.282 -0.327,-1.746 c -0.01,-0.068 -0.203,-0.158 -0.304,-0.146 l -1.307,0.158 c -0.124,-0.35 0.045,-0.45 0.27,-0.484 l 1.42,-0.18 c 0.113,-0.01 0.304,0.158 0.327,0.27 l 0.406,2.23 c 0.01,0.1 -0.1,0.293 -0.17,0.304 l -2.805,0.394 z m -15.05,-4.496 2.106,0.766 -3.962,10.015 c -0.135,0.35 -0.282,0.417 -0.608,0.248 -0.428,-0.214 -0.88,-0.383 -1.33,-0.54 C 9.556,27.01 9.488,26.875 9.623,26.537 l 3.492,-8.55 0.54,-1.34 z" />
    <path
       style="fill:#235ee1;fill-rule:nonzero;stroke:none"
       id="path37"
       d="m 14.77,23.047 0.755,-1.994 c 0.056,-0.135 0.304,-0.237 0.473,-0.27 l 4,-0.698 1.16,-0.18 c 0.124,-0.01 0.315,0.034 0.394,0.124 l 1.34,1.678 -8.133,1.34 z m -4.39,-1.442 -0.924,2.06 c -0.056,0.113 -0.27,0.2 -0.417,0.214 l -2.287,0.315 c -0.1,0.01 -0.293,-0.113 -0.304,-0.203 -0.1,-0.473 -0.2,-0.957 -0.225,-1.453 -0.01,-0.1 0.2,-0.304 0.327,-0.327 l 3.83,-0.608 z m -1.58,9.855 0.383,-3.436 1.86,0.732 -2.14,2.726 C 8.868503,31.4808 8.834557,31.473 8.803,31.459 Z m 5.33,-15.86 0.496,-1.194 c 0.17,-0.383 0.484,-0.563 0.88,-0.473 0.36,0.08 0.7,0.225 1.025,0.417 0.27,0.17 0.338,0.462 0.2,0.777 l -0.44,1.003 c -0.045,0.08 -0.203,0.2 -0.27,0.17 l -1.88,-0.698 z"
       sodipodi:nodetypes="ccccccccccccccccccccccccccccccccc" />
  </g>
  <symbol
     transform="translate(-0.50100473,-0.49995202)"
     overflow="visible"
     id="A">
    <g
       id="g16"
       fill-rule="nonzero"
       fill="#235ee1"
       stroke="none">
      <path
         id="path4"
         d="m 28.814,15.855 0.203,-0.676 2.298,-7.22 c 0.417,-1.06 1.126,-1.656 2.23,-1.78 0.732,-0.08 1.5,-0.146 2.005,0.552 0.327,0.44 0.698,0.698 1.228,0.788 A 3.35,3.35 0 0 1 37.51,7.71 c 0.327,0.124 0.45,-0.01 0.54,-0.315 l 0.867,-2.95 C 39.244,3.33 39.244,3.341 38.162,2.958 37.712,2.8 37.306,2.733 36.832,2.935 36.066,3.25 35.368,3.135 34.748,2.507 34.095,1.854 33.351,1.347 32.461,1.031 c -2.557,-0.9 -5.182,-1.284 -7.874,-0.856 -1.295,0.203 -2.557,0.552 -3.65,1.33 -0.158,0.113 -0.282,0.248 -0.428,0.383 1.487,-0.124 2.917,-0.146 4.348,0.045 0.97,0.124 1.836,0.45 2.478,1.273 0.676,0.867 0.834,1.892 0.924,2.93 0.124,1.453 -0.146,2.85 -0.552,4.235 l -1.25,4.416 c -0.056,0.2 -0.1,0.36 0.158,0.428 l 2.197,0.642 z" />
      <path
         id="path6"
         d="m 21.886,38 c 0.7,0.056 1.284,-0.27 1.645,-0.9 a 4.66,4.66 0 0 0 0.484,-1.205 l 3.222,-13.427 1.307,-5.576 c 0.1,-0.36 0,-0.507 -0.35,-0.586 l -1.42,-0.394 c -0.867,-0.26 -0.698,-0.225 -0.957,0.496 L 19.43,34.61 c -0.1,0.248 -0.17,0.518 -0.18,0.777 C 19.18,36.92 20.263,38 21.896,38 Z M 0.033,10.978 l 0.135,1 0.98,6.488 0.957,6.534 1,6.578 0.62,4.168 c 0.045,0.293 0.146,0.428 0.496,0.372 l 6.15,-0.98 8.775,-1.363 c 0.113,-0.023 0.203,-0.158 0.304,-0.248 -0.124,-0.068 -0.27,-0.2 -0.383,-0.18 l -4.787,0.72 -9.687,1.52 C 4.255,35.643 4.143,35.564 4.097,35.237 L 3.479,31.037 2.07,21.72 0.55,11.56 C 0.494,11.188 0.618,11.02 0.99,10.974 L 2.94,10.67 10.915,9.375 24.365,7.167 27.395,6.649 C 27.519,6.626 27.609,6.446 27.71,6.345 L 27.304,6.187 C 27.27,6.177 27.224,6.197 27.18,6.21 L 23.406,6.84 0.36,10.64 C 0.078,10.685 -0.068,10.764 0.033,11 Z m 32.103,-3.74 c -0.068,0 -0.135,0 -0.203,-0.01 -0.034,0.282 -0.135,0.574 -0.1,0.856 l 0.45,2.737 1.217,7.344 2.016,12.03 c 0.045,0.237 0,0.406 -0.293,0.45 l -6.488,1.014 -3.075,0.507 c -0.1,0.01 -0.17,0.158 -0.248,0.248 0.113,0.056 0.214,0.158 0.315,0.158 0.327,-0.023 0.642,-0.08 0.957,-0.124 l 9.394,-1.5 -3.942,-23.7 z m -8.55,14.193 c 0.26,-0.26 0.214,-0.45 0.034,-0.665 l -2.106,-2.534 -5.925,-7.153 c -0.158,-0.2 -0.293,-0.45 -0.338,-0.698 -0.08,-0.484 0.248,-0.924 0.72,-1.115 0.507,-0.2 0.946,-0.056 1.374,0.45 l 5.824,6.96 1.42,1.678 c 0.248,-0.26 0.214,-0.45 0.034,-0.665 L 22.291,14.907 17.594,9.32 c -0.63,-0.732 -1.588,-0.777 -2.287,-0.17 -0.687,0.597 -0.72,1.442 -0.08,2.208 l 8.36,10.062 z m -7.77,-4.742 c -0.08,-0.056 -0.17,-0.135 -0.27,-0.18 l -2.332,-0.856 c -0.248,-0.1 -0.36,0 -0.45,0.214 L 8.506,26.33 c -0.113,0.26 -0.034,0.383 0.203,0.473 l 2.185,0.9 c 0.394,0.18 0.552,0.1 0.698,-0.304 l 4.224,-10.712 z m 7.424,4.833 -1.51,-1.917 c -0.383,-0.586 -0.8,-0.9 -1.52,-0.597 -0.17,0.068 -0.36,0.068 -0.54,0.1 l -4.517,0.777 c -0.237,0.045 -0.44,0.1 -0.54,0.383 l -0.912,2.5 c -0.034,0.1 -0.034,0.203 -0.056,0.36 l 9.597,-1.577 z M 10.58,20.52 5.162,21.4 l 0.35,2.456 c 0.045,0.35 0.2,0.394 0.507,0.35 l 2.794,-0.383 c 0.282,-0.034 0.462,-0.146 0.574,-0.406 l 1.048,-2.433 c 0.056,-0.135 0.08,-0.248 0.146,-0.462 z m 19.802,7.03 -3.4,-2.06 c 0.045,0.214 0.023,0.462 0.135,0.586 a 2.7,2.7 0 0 0 0.755,0.586 c 0.383,0.214 0.788,0.36 1.183,0.552 0.574,0.282 1,0.687 1,1.385 0,0.113 0.056,0.225 0.1,0.35 l 0.113,-0.056 c 0.03,-0.03 0.056,-0.065 0.08,-0.1 0.676,-1.003 0.72,-2.106 0.428,-3.233 -0.327,-1.262 -0.912,-2.354 -2.14,-2.985 -0.338,-0.17 -0.552,-0.023 -0.8,0.146 -0.26,0.18 -0.406,0.394 -0.338,0.777 0.18,-0.113 0.338,-0.2 0.45,-0.304 0.282,-0.293 0.54,-0.225 0.856,-0.023 1.24,0.867 2.016,3.053 1.577,4.382 z" />
      <path
         id="path8"
         d="m 7.727,32.268 a 0.98,0.98 0 0 0 0.135,0.056 L 11.242,28.1 10.859,27.897 8.709,27.03 C 8.371,26.884 8.269,26.985 8.247,27.334 l -0.304,2.85 -0.214,2.084 z m 7.265,-19.42 c -0.653,0.068 -1.08,0.338 -1.33,0.912 L 13.144,15 c -0.113,0.237 -0.08,0.383 0.2,0.473 l 2.253,0.834 c 0.27,0.1 0.383,0.01 0.484,-0.225 l 0.54,-1.284 c 0.237,-0.574 0.135,-1.06 -0.383,-1.397 -0.372,-0.237 -0.822,-0.372 -1.24,-0.552 z M 28.205,20.621 31,20.227 c 0.08,-0.01 0.18,-0.214 0.17,-0.304 l -0.406,-2.23 c -0.023,-0.113 -0.214,-0.27 -0.327,-0.27 -0.473,0.034 -0.946,0.1 -1.42,0.18 -0.237,0.034 -0.406,0.146 -0.27,0.484 l 1.307,-0.158 c 0.1,-0.01 0.293,0.08 0.304,0.146 l 0.327,1.746 -2.095,0.282 c -0.248,0.034 -0.473,0.1 -0.394,0.518 z m 0.6,-4.766 -2.176,-0.63 c -0.26,-0.08 -0.214,-0.237 -0.158,-0.428 l 1.25,-4.416 c 0.406,-1.385 0.676,-2.794 0.552,-4.235 -0.1,-1.036 -0.237,-2.05 -0.924,-2.93 -0.642,-0.822 -1.5,-1.15 -2.478,-1.273 -1.43,-0.2 -2.85,-0.17 -4.348,-0.045 0.146,-0.124 0.27,-0.27 0.428,-0.383 1.093,-0.777 2.354,-1.125 3.649,-1.33 2.703,-0.428 5.317,-0.023 7.874,0.856 0.9,0.304 1.633,0.822 2.287,1.476 0.62,0.62 1.318,0.743 2.084,0.428 0.473,-0.203 0.88,-0.135 1.33,0.023 1.08,0.383 1.08,0.372 0.755,1.487 l -0.867,2.95 c -0.1,0.304 -0.214,0.428 -0.54,0.315 A 3.34,3.34 0 0 0 36.791,7.529 C 36.261,7.449 35.879,7.191 35.563,6.741 35.056,6.054 34.29,6.111 33.558,6.189 c -1.104,0.124 -1.814,0.72 -2.23,1.78 -0.935,2.354 -1.622,4.787 -2.298,7.22 l -0.214,0.665 z" />
      <path
         id="path10"
         d="m 21.886,38 c -1.633,-0.01 -2.703,-1.07 -2.647,-2.613 0.01,-0.26 0.1,-0.53 0.18,-0.777 l 6.4,-18.192 c 0.248,-0.72 0.1,-0.743 0.957,-0.496 l 1.42,0.394 c 0.35,0.08 0.44,0.225 0.35,0.586 L 27.23,22.48 24.027,35.906 a 4.66,4.66 0 0 1 -0.484,1.205 c -0.372,0.62 -0.946,0.946 -1.656,0.9 z M 0.034,10.978 c -0.1,-0.237 0.045,-0.315 0.338,-0.36 l 7.637,-1.25 7.434,-1.228 7.975,-1.307 3.774,-0.63 c 0.045,-0.01 0.1,-0.034 0.124,-0.023 l 0.406,0.158 c -0.1,0.1 -0.2,0.282 -0.315,0.304 l -3.03,0.518 -21.425,3.505 -1.95,0.304 c -0.372,0.045 -0.496,0.214 -0.44,0.586 l 2.93,19.476 0.608,4.202 c 0.045,0.327 0.146,0.406 0.496,0.35 l 9.687,-1.52 4.787,-0.72 c 0.113,-0.01 0.26,0.113 0.383,0.18 -0.1,0.1 -0.2,0.225 -0.304,0.248 l -8.775,1.363 -6.15,0.98 c -0.35,0.056 -0.45,-0.08 -0.496,-0.372 l -0.62,-4.168 -1,-6.578 -0.957,-6.533 -0.98,-6.488 -0.146,-0.99 z m 32.103,-3.74 3.965,23.722 -2.208,0.36 -7.187,1.15 -0.957,0.124 c -0.1,0.01 -0.214,-0.1 -0.315,-0.158 0.08,-0.1 0.158,-0.225 0.248,-0.248 l 3.075,-0.507 6.488,-1.014 c 0.293,-0.045 0.327,-0.214 0.293,-0.45 l -0.788,-4.686 -2.444,-14.7 -0.45,-2.737 c -0.034,-0.27 0.068,-0.563 0.1,-0.856 0.056,-0.01 0.113,-0.01 0.18,-0.01 z m -8.55,14.193 -1.06,-1.262 -7.3,-8.8 c -0.642,-0.766 -0.608,-1.6 0.08,-2.208 0.7,-0.62 1.667,-0.574 2.287,0.17 l 7.03,8.37 c 0.18,0.214 0.225,0.406 -0.034,0.665 l -1.42,-1.678 -5.824,-6.96 c -0.428,-0.507 -0.867,-0.653 -1.374,-0.45 -0.484,0.2 -0.8,0.63 -0.72,1.115 a 1.4,1.4 0 0 0 0.338,0.698 l 8.04,9.688 c 0.18,0.214 0.237,0.406 -0.034,0.665 z m -7.77,-4.742 -0.135,0.383 -4.1,10.352 c -0.158,0.394 -0.304,0.484 -0.698,0.304 l -2.185,-0.9 C 8.451,26.728 8.384,26.614 8.496,26.355 l 4.258,-10.464 c 0.1,-0.225 0.203,-0.315 0.45,-0.214 l 2.332,0.856 c 0.1,0.023 0.18,0.1 0.27,0.158 z m -2.658,-0.563 -0.54,1.34 -3.492,8.55 c -0.135,0.338 -0.068,0.473 0.248,0.586 l 1.33,0.54 c 0.338,0.17 0.473,0.1 0.608,-0.248 l 3.954,-10.003 -2.106,-0.766 z m 10.07,5.396 -9.585,1.578 c 0.023,-0.158 0.023,-0.26 0.056,-0.36 l 0.912,-2.5 c 0.1,-0.282 0.304,-0.35 0.54,-0.383 l 4.517,-0.777 c 0.18,-0.034 0.372,-0.023 0.54,-0.1 0.7,-0.282 1.126,0.023 1.52,0.597 0.417,0.642 0.935,1.217 1.498,1.926 z m -8.966,1.025 8.144,-1.352 -1.34,-1.678 c -0.08,-0.1 -0.26,-0.135 -0.394,-0.124 l -1.16,0.18 -4,0.698 c -0.17,0.034 -0.417,0.135 -0.473,0.27 -0.282,0.63 -0.507,1.284 -0.766,2.005 z m -3.686,-2.028 -0.146,0.44 -1.048,2.433 c -0.113,0.27 -0.282,0.372 -0.574,0.406 l -2.794,0.383 c -0.315,0.045 -0.462,0 -0.507,-0.35 l -0.35,-2.456 5.418,-0.856 z m -0.698,0.574 -3.83,0.62 c -0.124,0.023 -0.327,0.225 -0.327,0.327 0.034,0.484 0.124,0.97 0.225,1.453 0.023,0.1 0.214,0.214 0.304,0.203 l 2.287,-0.315 c 0.146,-0.023 0.36,-0.1 0.417,-0.214 l 0.924,-2.073 z m 20.5,6.455 c 0.44,-1.33 -0.338,-3.514 -1.577,-4.36 -0.304,-0.214 -0.563,-0.27 -0.856,0.023 -0.113,0.113 -0.27,0.18 -0.45,0.304 -0.068,-0.394 0.08,-0.597 0.338,-0.777 0.248,-0.18 0.462,-0.315 0.8,-0.146 1.228,0.63 1.814,1.723 2.14,2.985 0.293,1.126 0.248,2.23 -0.428,3.233 -0.023,0.036 -0.05,0.07 -0.08,0.1 -0.023,0.023 -0.045,0.023 -0.113,0.056 -0.034,-0.124 -0.1,-0.237 -0.1,-0.35 0,-0.698 -0.417,-1.104 -1,-1.385 L 27.87,26.679 c -0.282,-0.158 -0.552,-0.35 -0.755,-0.586 -0.113,-0.124 -0.1,-0.372 -0.135,-0.586 l 3.4,2.04 z" />
      <path
         id="path12"
         d="m 7.727,32.268 0.203,-2.084 0.304,-2.85 c 0.034,-0.35 0.124,-0.45 0.462,-0.304 l 2.15,0.867 c 0.113,0.045 0.214,0.113 0.383,0.203 l -3.38,4.224 C 7.815,32.314 7.769,32.29 7.725,32.268 Z M 8.3,30.96 c 0.034,0.01 0.068,0.01 0.1,0.023 L 10.54,28.257 8.68,27.525 8.308,30.961 Z M 15,12.848 c 0.417,0.18 0.867,0.315 1.24,0.563 0.518,0.338 0.62,0.822 0.383,1.397 l -0.54,1.284 c -0.1,0.237 -0.214,0.327 -0.484,0.225 l -2.253,-0.834 c -0.27,-0.1 -0.293,-0.237 -0.2,-0.473 l 0.518,-1.24 c 0.248,-0.586 0.665,-0.856 1.33,-0.924 z m -1.373,2.252 1.88,0.687 c 0.068,0.023 0.225,-0.08 0.27,-0.17 l 0.44,-1.003 c 0.146,-0.315 0.08,-0.62 -0.2,-0.777 -0.315,-0.2 -0.665,-0.327 -1.025,-0.417 -0.394,-0.1 -0.72,0.1 -0.88,0.473 l -0.496,1.205 z m 14.588,5.53 c -0.1,-0.428 0.146,-0.484 0.394,-0.518 l 2.095,-0.282 -0.327,-1.746 c -0.01,-0.068 -0.203,-0.158 -0.304,-0.146 l -1.307,0.158 c -0.124,-0.35 0.045,-0.45 0.27,-0.484 l 1.42,-0.18 c 0.113,-0.01 0.304,0.158 0.327,0.27 l 0.406,2.23 c 0.01,0.1 -0.1,0.293 -0.17,0.304 l -2.805,0.394 z m -15.05,-4.496 2.106,0.766 -3.962,10.015 c -0.135,0.35 -0.282,0.417 -0.608,0.248 C 10.273,26.949 9.821,26.78 9.371,26.623 9.056,26.51 8.988,26.375 9.123,26.037 l 3.492,-8.55 0.54,-1.34 z" />
      <path
         id="path14"
         d="m 14.27,22.547 0.755,-1.994 c 0.056,-0.135 0.304,-0.237 0.473,-0.27 l 4,-0.698 1.16,-0.18 c 0.124,-0.01 0.315,0.034 0.394,0.124 l 1.34,1.678 -8.133,1.34 z m -4.39,-1.442 -0.924,2.06 c -0.056,0.113 -0.27,0.2 -0.417,0.214 l -2.287,0.315 c -0.1,0.01 -0.293,-0.113 -0.304,-0.203 -0.1,-0.473 -0.2,-0.957 -0.225,-1.453 -0.01,-0.1 0.2,-0.304 0.327,-0.327 l 3.83,-0.608 z m -1.58,9.855 0.383,-3.436 1.86,0.732 -2.14,2.726 a 0.27,0.27 0 0 1 -0.1,-0.023 z m 5.33,-15.86 0.496,-1.194 c 0.17,-0.383 0.484,-0.563 0.88,-0.473 0.36,0.08 0.7,0.225 1.025,0.417 0.27,0.17 0.338,0.462 0.2,0.777 l -0.44,1.003 c -0.045,0.08 -0.203,0.2 -0.27,0.17 l -1.88,-0.698 z m 31.244,-4.477 h 1.84 l 4.656,6.876 4.82,-6.876 h 1.733 l -5.63,8.013 5.956,8.446 h -1.895 l -4.98,-7.255 -5.1,7.255 h -1.787 l 5.9,-8.446 z m 22.902,8.284 c -0.38,-1.787 -1.462,-2.87 -3.357,-2.87 -2.76,0 -4.17,2.545 -4.17,5.1 0,2.555 1.408,5.035 4.17,5.035 1.787,0 3.25,-1.408 3.465,-3.357 h 1.462 c -0.38,2.87 -2.274,4.602 -4.927,4.602 -3.628,0 -5.63,-2.87 -5.63,-6.28 0,-3.41 2.003,-6.28 5.63,-6.28 2.545,0 4.494,1.354 4.82,4.06 z m 14.185,2.22 c 0,3.4 -2.003,6.28 -5.63,6.28 -3.627,0 -5.63,-2.87 -5.63,-6.28 0,-3.41 2.003,-6.28 5.63,-6.28 3.627,0 5.63,2.87 5.63,6.28 z m -9.8,0 c 0,2.545 1.354,5.035 4.17,5.035 2.76,0 4.17,-2.545 4.17,-5.035 0,-2.545 -1.408,-5.1 -4.17,-5.1 -2.76,0.054 -4.17,2.545 -4.17,5.1 z m 22.415,5.956 H 93.22 V 24.8 h -0.054 c -0.596,1.516 -2.5,2.6 -4.223,2.6 -3.628,0 -5.36,-2.924 -5.36,-6.28 0,-3.356 1.733,-6.28 5.36,-6.28 1.787,0 3.52,0.92 4.115,2.6 h 0.054 v -6.822 h 1.462 z m -5.63,-0.866 c 3.086,0 4.17,-2.6 4.17,-5.035 0,-2.435 -1.083,-5.1 -4.17,-5.1 -2.76,0 -3.898,2.6 -3.898,5.1 0,2.436 1.137,5.035 3.898,5.035 z m 9.204,-4.7 c 0,2.112 1.137,4.656 3.898,4.656 2.112,0 3.25,-1.245 3.736,-3.032 h 1.462 c -0.596,2.707 -2.166,4.277 -5.198,4.277 -3.8,0 -5.36,-2.924 -5.36,-6.28 0,-3.14 1.57,-6.28 5.36,-6.28 3.844,0 5.36,3.357 5.198,6.66 z m 7.688,-1.2 c -0.054,-2.166 -1.408,-4.223 -3.8,-4.223 -2.392,0 -3.682,2.057 -3.898,4.223 z" />
    </g>
  </symbol>
</svg>
