<?xml version="1.0" encoding="UTF-8" standalone="no"?>
<svg
   xmlns:dc="http://purl.org/dc/elements/1.1/"
   xmlns:cc="http://creativecommons.org/ns#"
   xmlns:rdf="http://www.w3.org/1999/02/22-rdf-syntax-ns#"
   xmlns:svg="http://www.w3.org/2000/svg"
   xmlns="http://www.w3.org/2000/svg"
   xmlns:sodipodi="http://sodipodi.sourceforge.net/DTD/sodipodi-0.dtd"
   xmlns:inkscape="http://www.inkscape.org/namespaces/inkscape"
   viewBox="-0.12979373 0 7.5254959 6.6117837"
   width="585.14282"
   height="512"
   version="1.1"
   id="svg22"
   sodipodi:docname="ms-powerpoint.svg"
   inkscape:version="0.92.4 (unknown)">
  <metadata
     id="metadata28">
    <rdf:RDF>
      <cc:Work
         rdf:about="">
        <dc:format>image/svg+xml</dc:format>
        <dc:type
           rdf:resource="http://purl.org/dc/dcmitype/StillImage" />
        <dc:title></dc:title>
      </cc:Work>
    </rdf:RDF>
  </metadata>
  <defs
     id="defs26" />
  <sodipodi:namedview
     pagecolor="#ffffff"
     bordercolor="#666666"
     borderopacity="1"
     objecttolerance="10"
     gridtolerance="10"
     guidetolerance="10"
     inkscape:pageopacity="0"
     inkscape:pageshadow="2"
     inkscape:window-width="1600"
     inkscape:window-height="851"
     id="namedview24"
     showgrid="false"
     inkscape:showpageshadow="false"
     fit-margin-top="0"
     fit-margin-left="0"
     fit-margin-right="0"
     fit-margin-bottom="0"
     inkscape:zoom="1.2597656"
     inkscape:cx="292.57141"
     inkscape:cy="256"
     inkscape:window-x="0"
     inkscape:window-y="24"
     inkscape:window-maximized="1"
     inkscape:current-layer="svg22" />
  <g
     id="g39"
     transform="matrix(0.23613513,0,0,0.23613513,-0.19564912,-0.47227026)">
    <path
       id="path2"
       d="M 18,2 A 14.041,14.041 0 0 0 4,16 l 17.737,3.737 z"
       inkscape:connector-curvature="0"
       style="fill:#ed6c47" />
    <path
       id="path4"
       d="M 18,2 A 14.041,14.041 0 0 1 32,16 L 25,20.758 18,16 Z"
       inkscape:connector-curvature="0"
       style="fill:#ff8f6b" />
    <path
       id="path6"
       d="M 18,30 A 14.041,14.041 0 0 0 32,16 H 4 a 14.041,14.041 0 0 0 14,14 z"
       inkscape:connector-curvature="0"
       style="fill:#d35230" />
    <path
       id="path8"
       d="m 16.666,7 h -9.36 a 13.914,13.914 0 0 0 0.93,19 h 8.43 A 1.337,1.337 0 0 0 18,24.667 V 8.333 A 1.337,1.337 0 0 0 16.666,7 Z"
       inkscape:connector-curvature="0"
       style="opacity:0.1" />
    <path
       id="path10"
       d="M 15.666,8 H 6.54 a 13.906,13.906 0 0 0 2.845,19 h 6.282 A 1.337,1.337 0 0 0 17,25.667 V 9.333 A 1.337,1.337 0 0 0 15.666,8 Z"
       inkscape:connector-curvature="0"
       style="opacity:0.2" />
    <path
       id="path12"
       d="M 15.666,8 H 6.54 a 13.89,13.89 0 0 0 0.766,17 h 8.361 A 1.337,1.337 0 0 0 17,23.667 V 9.333 A 1.337,1.337 0 0 0 15.666,8 Z"
       inkscape:connector-curvature="0"
       style="opacity:0.2" />
    <path
       id="path14"
       d="M 14.666,8 H 6.54 a 13.89,13.89 0 0 0 0.766,17 h 7.361 A 1.337,1.337 0 0 0 16,23.667 V 9.333 A 1.337,1.337 0 0 0 14.666,8 Z"
       inkscape:connector-curvature="0"
       style="opacity:0.2" />
    <path
       id="path16"
       d="M 1.333,8 H 14.667 A 1.333,1.333 0 0 1 16,9.333 V 22.667 A 1.333,1.333 0 0 1 14.667,24 H 1.333 A 1.333,1.333 0 0 1 0,22.667 V 9.333 A 1.333,1.333 0 0 1 1.333,8 Z"
       inkscape:connector-curvature="0"
       style="fill:#c43e1c" />
    <path
       id="path18"
       d="m 7.997,11 a 4.168,4.168 0 0 1 2.755,0.805 2.878,2.878 0 0 1 0.956,2.331 2.726,2.726 0 0 1 -0.473,1.588 3.164,3.164 0 0 1 -1.344,1.186 4.57,4.57 0 0 1 -2.02,0.424 H 5.961 V 21 H 4 V 11 Z M 5.96,15.683 h 1.687 a 2.194,2.194 0 0 0 1.492,-0.444 1.107,1.107 0 0 0 0.504,-1.026 q 0,-1.659 -1.933,-1.659 H 5.96 Z"
       inkscape:connector-curvature="0"
       style="fill:#f9f7f7" />
  </g>
</svg>
