<?xml version="1.0" encoding="UTF-8" standalone="no"?>
<svg
   xmlns:dc="http://purl.org/dc/elements/1.1/"
   xmlns:cc="http://creativecommons.org/ns#"
   xmlns:rdf="http://www.w3.org/1999/02/22-rdf-syntax-ns#"
   xmlns:svg="http://www.w3.org/2000/svg"
   xmlns="http://www.w3.org/2000/svg"
   xmlns:sodipodi="http://sodipodi.sourceforge.net/DTD/sodipodi-0.dtd"
   xmlns:inkscape="http://www.inkscape.org/namespaces/inkscape"
   viewBox="-0.12979373 0 7.520208 6.6064516"
   width="585.14288"
   height="512"
   version="1.1"
   id="svg26"
   sodipodi:docname="ms-onenote.svg"
   inkscape:version="0.92.4 (unknown)">
  <metadata
     id="metadata32">
    <rdf:RDF>
      <cc:Work
         rdf:about="">
        <dc:format>image/svg+xml</dc:format>
        <dc:type
           rdf:resource="http://purl.org/dc/dcmitype/StillImage" />
        <dc:title></dc:title>
      </cc:Work>
    </rdf:RDF>
  </metadata>
  <defs
     id="defs30" />
  <sodipodi:namedview
     pagecolor="#ffffff"
     bordercolor="#666666"
     borderopacity="1"
     objecttolerance="10"
     gridtolerance="10"
     guidetolerance="10"
     inkscape:pageopacity="0"
     inkscape:pageshadow="2"
     inkscape:window-width="1600"
     inkscape:window-height="851"
     id="namedview28"
     showgrid="false"
     inkscape:showpageshadow="false"
     fit-margin-top="0"
     fit-margin-left="0"
     fit-margin-right="0"
     fit-margin-bottom="0"
     inkscape:zoom="1.2597656"
     inkscape:cx="292.57144"
     inkscape:cy="256"
     inkscape:window-x="0"
     inkscape:window-y="24"
     inkscape:window-maximized="1"
     inkscape:current-layer="svg26" />
  <g
     id="g45"
     transform="matrix(0.2359447,0,0,0.2359447,-0.19341623,-0.4718894)">
    <path
       id="path2"
       d="M 9.333,2 H 30.667 A 1.333,1.333 0 0 1 32,3.333 V 28.667 A 1.333,1.333 0 0 1 30.667,30 H 9.333 A 1.333,1.333 0 0 1 8,28.667 V 3.333 A 1.333,1.333 0 0 1 9.333,2 Z"
       inkscape:connector-curvature="0"
       style="fill:#ca64ea" />
    <path
       id="path4"
       d="M 32,3.333 A 1.333,1.333 0 0 0 30.667,2 H 9.332 A 1.333,1.333 0 0 0 8,3.333 V 28.667 A 1.333,1.333 0 0 0 9.333,30 H 25 L 32,9 Z"
       inkscape:connector-curvature="0"
       style="fill:#ca64ea" />
    <path
       id="path6"
       d="m 32,9 h -7 v 7 L 28.5,19.195 32,16 Z"
       inkscape:connector-curvature="0"
       style="fill:#ae4bd5" />
    <path
       id="path8"
       d="m 32,16 h -7 v 7 L 28.5,26.395 32,23 Z"
       inkscape:connector-curvature="0"
       style="fill:#9332bf" />
    <path
       id="path10"
       d="m 25,23 h 7 v 5.667 A 1.333,1.333 0 0 1 30.667,30 H 25 Z"
       inkscape:connector-curvature="0"
       style="fill:#7719aa" />
    <path
       id="path12"
       d="M 16.667,7 H 8 v 19 h 8.667 A 1.337,1.337 0 0 0 18,24.667 V 8.333 A 1.337,1.337 0 0 0 16.667,7 Z"
       inkscape:connector-curvature="0"
       style="opacity:0.1" />
    <path
       id="path14"
       d="M 15.667,8 H 8 v 19 h 7.667 A 1.337,1.337 0 0 0 17,25.667 V 9.333 A 1.337,1.337 0 0 0 15.667,8 Z"
       inkscape:connector-curvature="0"
       style="opacity:0.2" />
    <path
       id="path16"
       d="M 15.667,8 H 8 v 17 h 7.667 A 1.337,1.337 0 0 0 17,23.667 V 9.333 A 1.337,1.337 0 0 0 15.667,8 Z"
       inkscape:connector-curvature="0"
       style="opacity:0.3" />
    <path
       id="path18"
       d="M 14.667,8 H 8 v 17 h 6.667 A 1.337,1.337 0 0 0 16,23.667 V 9.333 A 1.337,1.337 0 0 0 14.667,8 Z"
       inkscape:connector-curvature="0"
       style="opacity:0.2" />
    <path
       id="path20"
       d="M 1.333,8 H 14.667 A 1.333,1.333 0 0 1 16,9.333 V 22.667 A 1.333,1.333 0 0 1 14.667,24 H 1.333 A 1.333,1.333 0 0 1 0,22.667 V 9.333 A 1.333,1.333 0 0 1 1.333,8 Z"
       inkscape:connector-curvature="0"
       style="fill:#7719aa" />
    <path
       id="path22"
       d="m 4.001,11 h 2.13 l 3.656,6.732 q 0.286,0.435 0.43,0.7 h 0.026 a 9.493,9.493 0 0 1 -0.06,-1.326 V 11 h 1.816 V 21 H 10.005 L 6.192,14.37 A 5.133,5.133 0 0 1 5.804,13.684 H 5.77 A 13.628,13.628 0 0 1 5.825,15.14 V 21 H 4 Z"
       inkscape:connector-curvature="0"
       style="fill:#ffffff" />
  </g>
</svg>
