<?xml version="1.0" encoding="UTF-8" standalone="no"?>
<!-- Generator: Adobe Illustrator 19.0.0, SVG Export Plug-In . SVG Version: 6.00 Build 0)  -->

<svg
   version="1.1"
   id="Layer_1"
   x="0px"
   y="0px"
   viewBox="0 0 511.99999 385.15109"
   xml:space="preserve"
   sodipodi:docname="concept-folder.svg"
   width="512"
   height="385.15109"
   inkscape:version="1.1 (1:1.1+202105261517+ce6663b3b7)"
   xmlns:inkscape="http://www.inkscape.org/namespaces/inkscape"
   xmlns:sodipodi="http://sodipodi.sourceforge.net/DTD/sodipodi-0.dtd"
   xmlns="http://www.w3.org/2000/svg"
   xmlns:svg="http://www.w3.org/2000/svg"><defs
   id="defs45" /><sodipodi:namedview
   id="namedview43"
   pagecolor="#ffffff"
   bordercolor="#666666"
   borderopacity="1.0"
   inkscape:pageshadow="2"
   inkscape:pageopacity="0.0"
   inkscape:pagecheckerboard="0"
   showgrid="false"
   inkscape:showpageshadow="false"
   fit-margin-top="0"
   fit-margin-left="0"
   fit-margin-right="0"
   fit-margin-bottom="0"
   inkscape:zoom="2.0537395"
   inkscape:cx="255.87471"
   inkscape:cy="192.57555"
   inkscape:current-layer="Layer_1" />




<g
   id="g946"
   transform="matrix(1.4847768,0,0,1.4847768,-101.97797,-165.40414)"><path
     style="fill:#f9b54c"
     d="m 330.2,122.9 v 0 c 0,-6.4 -5.2,-11.5 -11.5,-11.5 h -56.6 c -4.2,0 -8.1,2.3 -10.1,6 l -6.2,11.2 c -2,3.7 -5.9,6 -10.1,6 H 100 c -6.4,0 -11.5,5.2 -11.5,11.5 v 213.2 c 0,6.4 5.2,11.5 11.5,11.5 h 271.3 c 6.4,0 11.5,-5.2 11.5,-11.5 V 146 c 0,-6.4 -5.2,-11.5 -11.5,-11.5 h -29.6 c -6.3,0 -11.5,-5.2 -11.5,-11.6 z"
     id="path4" /><rect
     x="106.1"
     y="166.7"
     style="fill:#e6e9ee"
     width="262.39999"
     height="125.3"
     id="rect6" /><rect
     x="106.1"
     y="183.60001"
     style="fill:#ffffff"
     width="262.39999"
     height="108.4"
     id="rect8" /><path
     style="fill:#ffd05b"
     d="m 241,201.8 -29.1,45.3 c -2.4,3.8 -6.1,6 -10.1,6 H 79.3 C 72,253.1 67.4,260.3 69,269 l 17.1,89.4 c 1.3,6.9 7.5,12.4 13.9,12.4 h 271.3 c 6.4,0 12.6,-5.5 13.9,-12.4 l 27.9,-145.3 c 1.9,-9.9 -2.9,-18 -10.7,-18 H 252 c -4.3,0 -8.3,2.4 -11,6.7 z"
     id="path10" /></g>
<g
   id="g12"
   transform="translate(-68.682358,-111.40001)">
</g>
<g
   id="g14"
   transform="translate(-68.682358,-111.40001)">
</g>
<g
   id="g16"
   transform="translate(-68.682358,-111.40001)">
</g>
<g
   id="g18"
   transform="translate(-68.682358,-111.40001)">
</g>
<g
   id="g20"
   transform="translate(-68.682358,-111.40001)">
</g>
<g
   id="g22"
   transform="translate(-68.682358,-111.40001)">
</g>
<g
   id="g24"
   transform="translate(-68.682358,-111.40001)">
</g>
<g
   id="g26"
   transform="translate(-68.682358,-111.40001)">
</g>
<g
   id="g28"
   transform="translate(-68.682358,-111.40001)">
</g>
<g
   id="g30"
   transform="translate(-68.682358,-111.40001)">
</g>
<g
   id="g32"
   transform="translate(-68.682358,-111.40001)">
</g>
<g
   id="g34"
   transform="translate(-68.682358,-111.40001)">
</g>
<g
   id="g36"
   transform="translate(-68.682358,-111.40001)">
</g>
<g
   id="g38"
   transform="translate(-68.682358,-111.40001)">
</g>
<g
   id="g40"
   transform="translate(-68.682358,-111.40001)">
</g>
</svg>
