<?xml version="1.0" encoding="UTF-8" standalone="no"?>
<svg
   xmlns:dc="http://purl.org/dc/elements/1.1/"
   xmlns:cc="http://creativecommons.org/ns#"
   xmlns:rdf="http://www.w3.org/1999/02/22-rdf-syntax-ns#"
   xmlns:svg="http://www.w3.org/2000/svg"
   xmlns="http://www.w3.org/2000/svg"
   xmlns:sodipodi="http://sodipodi.sourceforge.net/DTD/sodipodi-0.dtd"
   xmlns:inkscape="http://www.inkscape.org/namespaces/inkscape"
   preserveAspectRatio="xMidYMid meet"
   width="512"
   version="1.0"
   height="512"
   inkscape:version="0.92.4 (unknown)"
   sodipodi:docname="ansible.svg">
  <defs
     id="defs16" />
  <sodipodi:namedview
     pagecolor="#ffffff"
     bordercolor="#666666"
     borderopacity="1"
     objecttolerance="10"
     gridtolerance="10"
     guidetolerance="10"
     inkscape:pageopacity="0"
     inkscape:pageshadow="2"
     inkscape:window-width="1600"
     inkscape:window-height="851"
     id="namedview14"
     showgrid="false"
     inkscape:zoom="1.2597656"
     inkscape:cx="256"
     inkscape:cy="256"
     inkscape:window-x="0"
     inkscape:window-y="24"
     inkscape:window-maximized="1"
     showborder="true"
     fit-margin-top="0"
     fit-margin-left="0"
     fit-margin-right="0"
     fit-margin-bottom="0"
     inkscape:showpageshadow="false" />
  <g
     transform="matrix(0.29615974,0,0,-0.2969585,-38.479961,554.9105)"
     id="g6"
     style="fill:#000000;stroke:none"
     inkscape:export-xdpi="96"
     inkscape:export-ydpi="96">
    <path
       d="M 805,1853 C 491,1786 226,1525 150,1208 125,1104 123,932 146,822 210,510 458,253 780,164 c 93,-26 328,-26 425,0 408,108 678,479 652,895 -8,121 -29,203 -78,309 -116,250 -341,431 -609,487 -90,19 -272,18 -365,-2 z m 249,-345 c 14,-23 348,-823 361,-865 8,-27 -33,-73 -65,-73 -11,0 -118,78 -248,183 -125,101 -232,186 -239,190 -7,5 -35,-54 -85,-178 L 705,580 h -68 -67 l 16,37 c 8,21 94,228 191,461 97,233 182,430 190,438 23,22 70,18 87,-8 z"
       id="path10"
       inkscape:connector-curvature="0" />
    <path
       d="m 952,1200 c -29,-72 -52,-134 -52,-139 0,-10 310,-255 316,-249 4,5 -193,498 -205,511 -4,4 -31,-51 -59,-123 z"
       id="path12"
       inkscape:connector-curvature="0" />
  </g>
  <metadata
     id="metadata9">
    <rdf:RDF>
      <cc:Work
         rdf:about="">
        <dc:title></dc:title>
      </cc:Work>
    </rdf:RDF>
  </metadata>
</svg>
