<?xml version="1.0" encoding="UTF-8" standalone="no"?>
<svg
   xmlns:dc="http://purl.org/dc/elements/1.1/"
   xmlns:cc="http://creativecommons.org/ns#"
   xmlns:rdf="http://www.w3.org/1999/02/22-rdf-syntax-ns#"
   xmlns:svg="http://www.w3.org/2000/svg"
   xmlns="http://www.w3.org/2000/svg"
   xmlns:sodipodi="http://sodipodi.sourceforge.net/DTD/sodipodi-0.dtd"
   xmlns:inkscape="http://www.inkscape.org/namespaces/inkscape"
   width="773.75732"
   height="512"
   viewBox="35.188 31.512 108.7779 71.970626"
   version="1.1"
   id="svg8"
   sodipodi:docname="nvidia.svg"
   inkscape:version="0.92.4 (unknown)">
  <metadata
     id="metadata14">
    <rdf:RDF>
      <cc:Work
         rdf:about="">
        <dc:format>image/svg+xml</dc:format>
        <dc:type
           rdf:resource="http://purl.org/dc/dcmitype/StillImage" />
        <dc:title>generated by pstoedit version:3.44 from NVBadge_2D.eps</dc:title>
      </cc:Work>
    </rdf:RDF>
  </metadata>
  <defs
     id="defs12" />
  <sodipodi:namedview
     pagecolor="#ffffff"
     bordercolor="#666666"
     borderopacity="1"
     objecttolerance="10"
     gridtolerance="10"
     guidetolerance="10"
     inkscape:pageopacity="0"
     inkscape:pageshadow="2"
     inkscape:window-width="1600"
     inkscape:window-height="851"
     id="namedview10"
     showgrid="false"
     inkscape:showpageshadow="false"
     fit-margin-top="0"
     fit-margin-left="0"
     fit-margin-right="0"
     fit-margin-bottom="0"
     inkscape:zoom="1.2597656"
     inkscape:cx="386.87866"
     inkscape:cy="256"
     inkscape:window-x="0"
     inkscape:window-y="24"
     inkscape:window-maximized="1"
     inkscape:current-layer="svg8" />
  <title
     id="title2">generated by pstoedit version:3.44 from NVBadge_2D.eps</title>
  <path
     d="m 46.301834,62.489098 c 0,0 9.835065,-14.51092 29.472418,-16.01214 v -5.26454 C 54.023391,42.959258 35.188,61.381208 35.188,61.381208 c 0,0 10.668057,30.83904 40.586252,33.66316 v -5.59581 C 53.818858,86.686488 46.301834,62.489098 46.301834,62.489098 Z m 29.472418,15.83077 v 5.12512 c -16.593395,-2.95873 -21.199321,-20.20725 -21.199321,-20.20725 0,0 7.967173,-8.82595 21.199321,-10.25724 v 5.62335 c -0.01005,0 -0.01704,-0.003 -0.02535,-0.003 -6.944944,-0.83343 -12.370313,5.65437 -12.370313,5.65437 0,0 3.040899,10.92154 12.395661,14.06471 m 0,-46.81752 v 9.71007 c 0.63851,-0.0489 1.27702,-0.0905 1.919027,-0.11231 24.728393,-0.83343 40.840613,20.2811 40.840613,20.2811 0,0 -18.50543,22.50213 -37.784855,22.50213 -1.766938,0 -3.421121,-0.16389 -4.974785,-0.43922 v 6.00444 a 32.795206,32.795206 0 0 0 4.143542,0.26747 c 17.940778,0 30.915078,-9.16247 43.478128,-20.00665 2.08291,1.66817 10.61036,5.72649 12.36332,7.5026 -11.94508,10.00114 -39.78386,18.06271 -55.566552,18.06271 -1.521324,0 -2.982336,-0.0922 -4.418438,-0.23075 v 8.437422 H 143.9659 V 31.502408 Z m 0,21.47771 v -6.50266 c 0.631955,-0.0441 1.268717,-0.0782 1.919027,-0.0988 17.782134,-0.55853 29.448383,15.28098 29.448383,15.28098 0,0 -12.600633,17.4998 -26.111174,17.4998 -1.944374,0 -3.687712,-0.31248 -5.256673,-0.83998 v -19.71602 c 6.922656,0.83649 8.315927,3.89443 12.477824,10.83238 l 9.256867,-7.80503 c 0,0 -6.757019,-8.86178 -18.147497,-8.86178 -1.238561,-4.4e-4 -2.423366,0.0865 -3.586757,0.21108"
     id="path6"
     inkscape:connector-curvature="0"
     style="fill:#77b900;stroke-width:0.43703634" />
</svg>
