<?xml version="1.0" encoding="UTF-8" standalone="no"?>
<svg
   xmlns:dc="http://purl.org/dc/elements/1.1/"
   xmlns:cc="http://creativecommons.org/ns#"
   xmlns:rdf="http://www.w3.org/1999/02/22-rdf-syntax-ns#"
   xmlns:svg="http://www.w3.org/2000/svg"
   xmlns="http://www.w3.org/2000/svg"
   xmlns:sodipodi="http://sodipodi.sourceforge.net/DTD/sodipodi-0.dtd"
   xmlns:inkscape="http://www.inkscape.org/namespaces/inkscape"
   width="512"
   height="512"
   viewBox="0 0 512 512"
   version="1.1"
   id="svg6"
   sodipodi:docname="vault.svg"
   inkscape:version="0.92.4 (unknown)">
  <metadata
     id="metadata12">
    <rdf:RDF>
      <cc:Work
         rdf:about="">
        <dc:format>image/svg+xml</dc:format>
        <dc:type
           rdf:resource="http://purl.org/dc/dcmitype/StillImage" />
        <dc:title>Vault Logo</dc:title>
      </cc:Work>
    </rdf:RDF>
  </metadata>
  <defs
     id="defs10" />
  <sodipodi:namedview
     pagecolor="#ffffff"
     bordercolor="#666666"
     borderopacity="1"
     objecttolerance="10"
     gridtolerance="10"
     guidetolerance="10"
     inkscape:pageopacity="0"
     inkscape:pageshadow="2"
     inkscape:window-width="1920"
     inkscape:window-height="1032"
     id="namedview8"
     showgrid="false"
     inkscape:showpageshadow="false"
     fit-margin-top="0"
     fit-margin-left="0"
     fit-margin-right="0"
     fit-margin-bottom="0"
     inkscape:zoom="1.6132812"
     inkscape:cx="256.00001"
     inkscape:cy="256.00001"
     inkscape:window-x="0"
     inkscape:window-y="23"
     inkscape:window-maximized="1"
     inkscape:current-layer="svg6" />
  <title
     id="title2">Vault Logo</title>
  <circle
     style="opacity:1;fill:none;fill-opacity:1;stroke:none;stroke-width:13.42622757;stroke-linecap:round;stroke-linejoin:round;stroke-miterlimit:4;stroke-dasharray:none;stroke-dashoffset:0;stroke-opacity:1;paint-order:stroke fill markers"
     id="path816"
     cx="256"
     cy="256"
     r="256"
     inkscape:export-filename="/home/paulo.bagatini/git/vault-dbeaver/logo.png"
     inkscape:export-xdpi="96"
     inkscape:export-ydpi="96" />
  <path
     d="M 51.447939,102.8959 255.2566,512 460.55206,102.8959 Z M 279.50319,208.68882 h 23.71287 v -23.67474 h -23.71287 v 23.71287 z m -35.35961,0 h 23.6938 v -23.67474 h -23.67474 v 23.71287 z m -35.5693,0 h 23.71286 v -23.67474 h -23.71286 v 23.71287 z m 70.92891,35.58836 h 23.71287 v -23.6938 h -23.71287 z m -35.35961,0 h 23.6938 v -23.6938 h -23.67474 v 23.6938 z m -35.5693,0 h 23.71286 v -23.6938 h -23.71286 z m 71.1386,35.58837 h 23.6938 v -23.71287 h -23.6938 z m -35.5693,0 h 23.6938 v -23.71287 h -23.67474 v 23.71287 z m -35.5693,0 h 23.71286 v -23.71287 h -23.71286 z m 35.5693,35.56928 h 23.6938 v -23.71286 h -23.67474 v 23.71286 z"
     id="path4"
     inkscape:connector-curvature="0"
     style="fill:#000000;fill-rule:evenodd;stroke-width:19.06178856" />
</svg>
