<?xml version="1.0" encoding="UTF-8" standalone="no"?>
<svg
   xmlns:dc="http://purl.org/dc/elements/1.1/"
   xmlns:cc="http://creativecommons.org/ns#"
   xmlns:rdf="http://www.w3.org/1999/02/22-rdf-syntax-ns#"
   xmlns:svg="http://www.w3.org/2000/svg"
   xmlns="http://www.w3.org/2000/svg"
   xmlns:xlink="http://www.w3.org/1999/xlink"
   xmlns:sodipodi="http://sodipodi.sourceforge.net/DTD/sodipodi-0.dtd"
   xmlns:inkscape="http://www.inkscape.org/namespaces/inkscape"
   inkscape:version="1.0 (1.0+r73+1)"
   sodipodi:docname="telecom-telefonica.svg"
   id="svg2985"
   height="264.47684"
   width="512"
   version="1.1">
  <sodipodi:namedview
     inkscape:current-layer="svg2985"
     inkscape:window-maximized="1"
     inkscape:window-y="24"
     inkscape:window-x="0"
     inkscape:cy="132.23842"
     inkscape:cx="256"
     inkscape:zoom="3.1723005"
     fit-margin-bottom="0"
     fit-margin-right="0"
     fit-margin-left="0"
     fit-margin-top="0"
     inkscape:showpageshadow="false"
     showgrid="false"
     id="namedview18"
     inkscape:window-height="1033"
     inkscape:window-width="1920"
     inkscape:pageshadow="2"
     inkscape:pageopacity="0"
     guidetolerance="10"
     gridtolerance="10"
     objecttolerance="10"
     borderopacity="1"
     bordercolor="#666666"
     pagecolor="#ffffff" />
  <metadata
     id="metadata2991">
    <rdf:RDF>
      <cc:Work
         rdf:about="">
        <dc:format>image/svg+xml</dc:format>
        <dc:type
           rdf:resource="http://purl.org/dc/dcmitype/StillImage" />
        <dc:title></dc:title>
      </cc:Work>
    </rdf:RDF>
  </metadata>
  <defs
     id="defs2989">
    <linearGradient
       id="linearGradient4461">
      <stop
         offset="0"
         style="stop-color:#01212e;stop-opacity:1"
         id="stop4463" />
      <stop
         offset="1"
         style="stop-color:#087ea2;stop-opacity:1"
         id="stop4465" />
    </linearGradient>
    <linearGradient
       gradientUnits="userSpaceOnUse"
       xlink:href="#linearGradient4461"
       id="linearGradient4467"
       y2="590.57648"
       x2="1363.0013"
       y1="197.6019"
       x1="159.25812" />
  </defs>
  <g
     transform="matrix(0.32787791,0,0,0.32787791,0.67814574,0.31270217)"
     id="g22">
    <rect
       width="1561.5569"
       height="806.63208"
       x="-2.0682874"
       y="-0.95371526"
       id="rect4459"
       style="fill:url(#linearGradient4467);fill-opacity:1;fill-rule:nonzero;stroke:none" />
    <path
       d="m 513.31387,545.42604 c -127.46308,-1.33118 -238.13954,-3.82288 -246.41784,-5.5477 -11.46758,-2.38931 21.6551,-3.8288 127.91784,-5.55922 98.78545,-1.60865 546.04637,-1.61421 665.49993,-0.008 185.4652,2.4934 244.5724,4.44575 229.3488,7.57555 -5.2225,1.07369 -68.9783,2.62307 -148.8488,3.61727 -89.3046,1.11165 -518.71128,1.05852 -627.49993,-0.0776 z M 375.47701,482.19961 c -0.82254,-0.9911 0.11167,-2.588 3.89881,-6.66438 7.00763,-7.54283 14.58938,-23.6631 27.99944,-59.53219 14.92003,-39.90793 31.933,-82.54433 36.79882,-92.22197 7.57295,-15.06185 19.27777,-28.65898 31.9249,-37.08617 3.37389,-2.24814 4.93821,-3.86854 4.32581,-4.48094 -1.55452,-1.55452 -48.09403,-0.22623 -58.28186,1.66343 -28.31767,5.25244 -47.24373,16.60247 -54.8741,32.9082 -3.68512,7.87492 -4.84036,17.85821 -2.96913,25.65839 1.65181,6.88552 0.72882,7.78931 -5.75532,5.63562 -6.78952,-2.25511 -12.4741,-7.39074 -15.20344,-13.73527 -1.893,-4.4004 -2.18812,-6.54257 -1.83139,-13.2935 0.36641,-6.93408 0.95315,-9.05142 4.23991,-15.30018 11.26701,-21.42072 38.45278,-34.23763 81.06441,-38.21834 6.23701,-0.58265 40.44395,-1.03698 79,-1.04927 54.06131,-0.0172 69.33237,-0.30548 74.5,-1.40618 3.575,-0.76147 6.87919,-1.02541 7.34264,-0.58651 2.73615,2.59111 -8.74764,11.21216 -19.01502,14.27483 -5.95856,1.77739 -10.67224,2.11308 -37.03209,2.63724 l -30.20446,0.60062 -4.17273,4 c -12.24194,11.73519 -22.80193,34.97657 -50.43414,111 -19.51676,53.6957 -23.2813,62.00292 -32.62309,71.98932 -3.14738,3.36456 -7.93019,7.31896 -10.62845,8.78753 -8.81335,4.79683 -25.5672,7.43483 -28.06952,4.41972 z m 291.83686,-0.29312 c 0,-0.8781 1.7443,-3.57818 3.87622,-6.00017 5.35794,-6.08694 10.12367,-15.53821 18.74547,-37.17558 6.99114,-17.545 8.16771,-21.2277 6.78199,-21.2277 -0.32797,0 -3.36547,2.41124 -6.75,5.35832 -19.12353,16.65181 -37.47228,24.23883 -56.65368,23.42573 -13.83259,-0.58636 -20.28326,-4.50637 -25.15104,-15.28405 -3.01831,-6.68279 -3.00308,-20.49254 0.0352,-31.88441 10.89729,-40.85922 46.69562,-75.68765 77.95233,-75.84033 13.04459,-0.0637 18.63605,4.90058 17.85232,15.84991 -0.63141,8.82119 -5.19987,16.82309 -16.02585,28.07015 -10.08161,10.47372 -21.50256,18.90079 -38.43204,28.35747 l -11.73089,6.55279 -1.15357,5.44721 c -2.37761,11.22714 -1.07776,18.9207 3.77044,22.31652 3.20836,2.24722 11.22368,2.07817 19.26765,-0.40636 8.83446,-2.72868 22.37254,-11.93065 32.75463,-22.26364 14.22833,-14.16105 15.74209,-16.65967 25.40186,-41.92851 4.9777,-13.02107 8.42134,-23.42653 8.06244,-24.36182 -0.50271,-1.31004 -1.46394,-1.50253 -4.86497,-0.97424 -7.51287,1.16699 -8.1506,1.1196 -8.51345,-0.63262 -0.49179,-2.37483 6.52065,-7.22165 14.09533,-9.74234 5.6005,-1.86373 6.41661,-2.50245 8.68065,-6.7939 11.26146,-21.34584 26.62645,-37.33095 44.49903,-46.29493 11.9073,-5.97211 21.8816,-8.64089 37.4691,-10.02547 18.1802,-1.61488 33.8624,0.65927 42.5532,6.17084 8.2041,5.20286 10.4063,14.34427 5.4132,22.47021 -4.7293,7.69651 -20.8512,19.89781 -23.1949,17.55416 -0.8359,-0.83594 -0.6006,-1.83888 0.9113,-3.88382 12.4089,-16.78421 5.0932,-31.64184 -16.7016,-33.91985 -14.0798,-1.47163 -29.7107,4.38723 -41.1603,15.42796 -10.62586,10.24646 -23.98475,31.67926 -22.36931,35.88903 0.53728,1.40014 4.4129,1.53209 35.09161,1.19472 30.5777,-0.33626 34.4877,-0.20435 34.4877,1.1635 0,2.75478 -2.9214,5.80705 -6.7531,7.0558 -21.4989,7.0063 -46.247,51.46184 -46.247,83.07427 0,7.52153 0.1788,8.19033 2.9231,10.93462 5.1742,5.17422 12.6328,3.20934 21.5082,-5.66609 15.7518,-15.75175 29.5687,-50.00306 29.5687,-73.29879 0,-8.7563 1.3562,-10.63617 8.7583,-12.14078 3.1579,-0.64191 15.5889,-3.59804 27.6243,-6.56918 24.9954,-6.17051 31.0222,-6.68004 35.3117,-2.98538 2.4668,2.12475 2.7909,3.06586 2.6828,7.79042 -0.075,3.29598 -1.5511,9.55329 -3.8165,16.18345 -2.0315,5.94535 -3.4929,11.01041 -3.2476,11.25569 0.2452,0.24528 1.9627,-1.47336 3.8165,-3.8192 11.5344,-14.59588 21.6323,-23.88333 31.7031,-29.15868 14.1751,-7.42523 28.1034,-6.7415 33.2079,1.63017 4.38,7.18339 1.9068,16.50572 -12.2572,46.20145 -12.1304,25.4322 -17.8939,39.31021 -21.3964,51.52053 -2.3018,8.02452 -2.581,10.50098 -2.1628,19.18483 0.5535,11.49599 0.1998,11.99203 -6.6791,9.36498 -6.8261,-2.60693 -13.0858,-8.72714 -15.4852,-15.14027 -5.1613,-13.7946 -1.4518,-27.71816 18.2307,-68.43007 9.4293,-19.50375 12.0529,-26.34287 11.1712,-29.12065 -1.4323,-4.51287 -9.633,-0.62823 -18.5409,8.78276 -15.3509,16.21778 -25.0915,31.12718 -41.0265,62.79719 l -13.6058,27.0407 -12.1442,0.28078 c -11.3747,0.26299 -12.1443,0.16005 -12.1443,-1.62457 0,-1.04794 2.5102,-7.92429 5.5781,-15.28078 18.9785,-45.50794 31.6581,-79.07546 31.2249,-82.66367 -0.505,-4.18348 -2.6906,-4.77214 -12.4955,-3.36544 -4.8441,0.69499 -9.3037,1.80137 -9.9102,2.45864 -0.6065,0.65727 -1.6768,4.57004 -2.3784,8.69504 -1.6658,9.79381 -6.9319,25.01197 -12.9764,37.5 -11.64,24.04836 -32.4338,45.97889 -49.8069,52.52984 -11.0849,4.17982 -23.60443,4.41637 -31.01165,0.58595 -15.07978,-7.79805 -16.04687,-33.4687 -2.34173,-62.15918 7.80567,-16.34046 16.87637,-28.38047 28.14138,-37.35345 2.4879,-1.98174 4.7379,-4.01788 5,-4.52477 0.745,-1.44115 -35.27711,-0.71759 -36.61826,0.73553 -1.2,1.30018 -7.77736,18.7993 -23.74966,63.18608 -16.18769,44.98537 -19.88137,53.28048 -28.68323,64.41568 -7.3682,9.32147 -19.28125,15.08432 -31.18252,15.08432 -3.71976,0 -4.7899,-0.35669 -4.7899,-1.59655 z m -13.11176,-99.91667 c 5.48564,-4.13227 12.95264,-10.76977 16.59334,-14.75 10.6277,-11.61881 16.1097,-25.21597 11.99811,-29.75922 -6.16775,-6.81529 -20.39344,4.92864 -31.20822,25.76377 -4.54922,8.76428 -10.27147,22.8691 -10.27147,25.31827 0,2.26557 3.57655,0.44158 12.88824,-6.57282 z m 523.61169,76.85833 c -5.3697,-2.81874 -10.3862,-8.48651 -12.113,-13.6854 -1.3228,-3.98245 -1.5141,-6.96604 -0.9612,-14.99283 l 0.6902,-10.02097 -7.808,8.05661 c -14.8871,15.36113 -29.9446,22.06999 -43.169,19.23387 -8.9455,-1.91847 -15.1143,-9.73929 -15.1334,-19.18639 0,-1.5125 -0.502,-2.75 -1.1087,-2.75 -0.6067,0 -3.4111,2.07514 -6.2321,4.61142 -6.9633,6.26069 -18.6957,12.99988 -27.1648,15.60376 -8.1601,2.50889 -20.9087,2.92381 -26.8807,0.87487 -5.2174,-1.79002 -11.5189,-7.64207 -13.8263,-12.84005 -1.0376,-2.3375 -2.0667,-4.25 -2.2868,-4.25 -0.2202,0 -3.3909,2.2636 -7.0461,5.03023 -11.8878,8.99786 -22.12536,12.96977 -33.42966,12.96977 -9.0126,0 -14.6806,-2.85662 -17.8573,-9 -4.6959,-9.08122 -1.056,-23.78177 14.2372,-57.5 13.2213,-29.15025 21.7818,-45.75514 24.58966,-47.69694 2.6751,-1.84994 27.5216,-6.6148 28.6434,-5.493 0.3665,0.36645 -2.1731,6.6341 -5.6434,13.92811 -24.5495,51.59849 -33.99996,74.61791 -33.99996,82.81682 0,5.26276 3.1839,7.54048 8.4917,6.07493 4.91016,-1.35577 12.09056,-6.09191 17.30336,-11.41315 3.7972,-3.87614 4.5674,-5.48391 6.6435,-13.86784 9.7794,-39.49388 36.9504,-71.25752 67.0614,-78.39678 7.0275,-1.66621 21.3986,-1.88574 26.7189,-0.40814 12.1452,3.37304 14.0711,14.88927 4.1093,24.57111 -4.7338,4.60065 -13.1141,9.80525 -17.5782,10.91689 -3.7656,0.93772 -3.6002,-0.87786 0.7363,-8.07923 5.6644,-9.40672 5.6251,-15.31935 -0.1165,-17.50228 -11.4916,-4.36911 -32.5042,18.43765 -44.5167,48.31796 -5.3179,13.22764 -8.7835,30.9588 -7.4452,38.09209 2.2369,11.92404 16.4149,11.61187 32.3827,-0.713 11.306,-8.72657 16.3906,-15.15273 23.4598,-29.64933 8.5319,-17.49628 15.1933,-27.4346 25.7028,-38.34679 14.179,-14.72236 28.4736,-22.59361 47.5714,-26.19503 15.2252,-2.87113 40.404,-0.41199 42.1415,4.11583 0.3089,0.80506 -2.3955,8.09315 -6.0097,16.19576 -3.6143,8.10261 -9.4656,22.15701 -13.0029,31.23201 -13.1724,33.79408 -17.6535,51.53916 -17.6535,69.90708 v 11.09292 l -3.25,-0.04 c -1.7875,-0.022 -4.6,-0.7487 -6.25,-1.61485 z m -36.7746,-31.02448 c 11.7055,-5.53503 25.5829,-25.23476 39.2769,-55.75555 3.8789,-8.6452 8.8402,-19.27403 11.0251,-23.61962 5.2907,-10.52268 5.2369,-10.94546 -1.393,-10.94546 -15.3687,0 -35.2988,19.23128 -49.5875,47.84868 -5.3442,10.70357 -10.8783,27.24466 -11.6794,34.9096 -0.5552,5.31149 -0.3765,6.2327 1.5902,8.1994 2.3978,2.39787 4.6285,2.26589 10.7677,-0.63705 z m -571.22533,30.55474 c -13.08846,-7.27278 -18.29504,-17.39282 -16.89871,-32.84606 l 0.67505,-7.47069 -4.88817,4.24429 c -19.67245,17.08116 -37.9746,25.06423 -54.96322,23.97397 -13.56692,-0.87067 -21.83643,-7.80845 -24.47898,-20.53684 -5.17982,-24.94967 14.84308,-67.62992 41.02674,-87.45147 22.43698,-16.98524 50.02659,-20.60783 55.58747,-7.29879 1.93951,4.64191 1.81246,8.49996 -0.49623,15.06859 -5.65819,16.09856 -27.99311,36.38945 -55.9475,50.82732 -9.89172,5.10888 -9.80045,4.96735 -10.76364,16.69075 -1.13423,13.80525 2.58989,18.72532 13.3343,17.6164 13.68378,-1.41229 32.13909,-15.2286 48.2689,-36.13582 2.92345,-3.78934 8.49819,-15.02638 17.51628,-35.30768 21.51584,-48.38821 31.59403,-69.56757 34.57236,-72.6539 2.44784,-2.53659 4.36447,-3.19258 15.12914,-5.1781 6.77941,-1.25045 12.69752,-1.9121 13.15133,-1.47032 1.06821,1.03986 -2.95244,10.6523 -20.3085,48.55298 -18.05742,39.43225 -26.80647,59.88979 -33.63648,78.65081 -7.29251,20.03145 -9.6643,30.1606 -9.79919,41.84919 -0.10794,9.35364 -0.14792,9.50375 -2.59529,9.74335 -1.36711,0.13384 -3.38566,-0.25675 -4.48566,-0.86798 z M 510.7211,386.25304 c 23.01344,-14.71644 40.96981,-39.42085 35.13054,-48.33269 -4.72692,-7.2142 -19.32002,3.10867 -29.31309,20.73552 -6.9062,12.1819 -13.97801,30.84717 -11.68723,30.84717 0.4331,0 3.0745,-1.4625 5.86978,-3.25 z m 514.5158,-81.67308 c -6.1694,-6.16942 -2.3331,-18.64553 7.2772,-23.6662 9.1308,-4.7701 18.221,2.69785 15.8385,13.01189 -2.6864,11.63034 -16.0023,17.76775 -23.1157,10.65431 z"
       id="path3189"
       style="fill:#ffffff" />
  </g>
</svg>
