<?xml version="1.0" encoding="UTF-8" standalone="no"?>
<svg
   xmlns:dc="http://purl.org/dc/elements/1.1/"
   xmlns:cc="http://creativecommons.org/ns#"
   xmlns:rdf="http://www.w3.org/1999/02/22-rdf-syntax-ns#"
   xmlns:svg="http://www.w3.org/2000/svg"
   xmlns="http://www.w3.org/2000/svg"
   xmlns:sodipodi="http://sodipodi.sourceforge.net/DTD/sodipodi-0.dtd"
   xmlns:inkscape="http://www.inkscape.org/namespaces/inkscape"
   width="56"
   height="57"
   version="1"
   id="svg12"
   sodipodi:docname="system-logout.svg"
   inkscape:version="0.92.5 (2060ec1f9f, 2020-04-08)">
  <metadata
     id="metadata18">
    <rdf:RDF>
      <cc:Work
         rdf:about="">
        <dc:format>image/svg+xml</dc:format>
        <dc:type
           rdf:resource="http://purl.org/dc/dcmitype/StillImage" />
        <dc:title></dc:title>
      </cc:Work>
    </rdf:RDF>
  </metadata>
  <defs
     id="defs16" />
  <sodipodi:namedview
     pagecolor="#ffffff"
     bordercolor="#666666"
     borderopacity="1"
     objecttolerance="10"
     gridtolerance="10"
     guidetolerance="10"
     inkscape:pageopacity="0"
     inkscape:pageshadow="2"
     inkscape:window-width="1366"
     inkscape:window-height="719"
     id="namedview14"
     showgrid="false"
     fit-margin-top="0"
     fit-margin-left="0"
     fit-margin-right="0"
     fit-margin-bottom="0"
     inkscape:zoom="8.7192982"
     inkscape:cx="28"
     inkscape:cy="28.5"
     inkscape:window-x="0"
     inkscape:window-y="25"
     inkscape:window-maximized="1"
     inkscape:current-layer="svg12"
     inkscape:showpageshadow="false" />
  <path
     style="opacity:0.2"
     d="M 55.958,27.828 A 28,28 0 0 1 28,55 28,28 0 0 1 0.044,28.172 28,28 0 0 0 0,29 28,28 0 0 0 28,57 28,28 0 0 0 56,29 28,28 0 0 0 55.958,27.828 Z"
     id="path2"
     inkscape:connector-curvature="0" />
  <circle
     style="fill:#7bbb36"
     cx="28"
     cy="28"
     r="28"
     id="circle4" />
  <path
     style="opacity:0.2"
     d="M 28,11 A 18,18 0 0 1 46,29 18,18 0 0 1 28,47 18,18 0 0 1 10,29 18,18 0 0 1 28,11 Z m 0,4 A 14,14 0 0 0 14,29 14,14 0 0 0 28,43 14,14 0 0 0 42,29 14,14 0 0 0 28,15 Z m 0,8 3.9648,3.0782 4.036,2.922 -4.034,2.922 -3.966,3.078 0.048,-4 h -6.048 c -1.108,0 -2,-0.892 -2,-2 0,-1.108 0.892,-2 2,-2 h 6.0468 l -0.04688,-4 z"
     id="path6"
     inkscape:connector-curvature="0" />
  <path
     style="fill:#ffffff"
     d="M 28,10 A 18,18 0 0 1 46,28 18,18 0 0 1 28,46 18,18 0 0 1 10,28 18,18 0 0 1 28,10 Z m 0,4 A 14,14 0 0 0 14,28 14,14 0 0 0 28,42 14,14 0 0 0 42,28 14,14 0 0 0 28,14 Z m 0,8 3.9648,3.0782 4.036,2.922 -4.034,2.922 -3.966,3.078 0.048,-4 h -6.048 c -1.108,0 -2,-0.892 -2,-2 0,-1.108 0.892,-2 2,-2 h 6.0468 l -0.04688,-4 z"
     id="path8"
     inkscape:connector-curvature="0" />
  <path
     style="opacity:0.2;fill:#ffffff"
     d="M 27.998047,0 A 28,28 0 0 0 0,28 28,28 0 0 0 0.0175781,28.492188 28,28 0 0 1 27.998047,1 H 28 A 28,28 0 0 1 55.972656,28.5 28,28 0 0 0 55.998047,28 28,28 0 0 0 28,0 Z"
     id="path10"
     inkscape:connector-curvature="0" />
</svg>
