<svg xmlns="http://www.w3.org/2000/svg" width="338.004" height="37.584" viewBox="0 0 338.004 37.584">
  <g id="Group_6" data-name="Group 6" transform="translate(-784.921 -1698)">
    <path id="Path_19" data-name="Path 19" d="M-298.079,0V-14.316h5.4a13.039,13.039,0,0,1,2.178.137,4.314,4.314,0,0,1,1.768.669,3.51,3.51,0,0,1,1.147,1.382,4.386,4.386,0,0,1,.435,1.953,4.4,4.4,0,0,1-1.162,3.091q-1.162,1.265-4.2,1.265h-3.672V0Zm1.895-7.51h3.7a3.925,3.925,0,0,0,2.607-.684,2.436,2.436,0,0,0,.771-1.924,2.588,2.588,0,0,0-.454-1.538,2.123,2.123,0,0,0-1.2-.845,8.1,8.1,0,0,0-1.768-.127h-3.662Zm10.8,7.51V-10.371h1.582V-8.8a4.291,4.291,0,0,1,1.118-1.455,1.952,1.952,0,0,1,1.128-.352,3.429,3.429,0,0,1,1.807.566l-.605,1.631a2.515,2.515,0,0,0-1.289-.381,1.674,1.674,0,0,0-1.035.347,1.878,1.878,0,0,0-.654.962,6.847,6.847,0,0,0-.293,2.051V0Zm5.625-5.186a5.346,5.346,0,0,1,1.6-4.268,4.826,4.826,0,0,1,3.262-1.152,4.653,4.653,0,0,1,3.5,1.4,5.331,5.331,0,0,1,1.357,3.872,6.861,6.861,0,0,1-.6,3.149A4.251,4.251,0,0,1-272.39-.4a5.089,5.089,0,0,1-2.5.635,4.662,4.662,0,0,1-3.521-1.4A5.578,5.578,0,0,1-279.758-5.186Zm1.807,0a4.417,4.417,0,0,0,.869,2.983,2.786,2.786,0,0,0,2.188.991,2.77,2.77,0,0,0,2.178-1,4.522,4.522,0,0,0,.869-3.037,4.285,4.285,0,0,0-.874-2.915,2.78,2.78,0,0,0-2.173-.991,2.792,2.792,0,0,0-2.187.986A4.4,4.4,0,0,0-277.951-5.186Zm9.58-7.109v-2.021h1.758v2.021Zm0,12.295V-10.371h1.758V0Zm5.655,0h-1.631V-14.316h1.758v5.107a3.478,3.478,0,0,1,2.842-1.4,4.352,4.352,0,0,1,1.812.386,3.7,3.7,0,0,1,1.406,1.084,5.24,5.24,0,0,1,.864,1.685,6.945,6.945,0,0,1,.313,2.109,5.924,5.924,0,0,1-1.318,4.121A4.123,4.123,0,0,1-259.835.234,3.3,3.3,0,0,1-262.716-1.3Zm-.02-5.264a5.383,5.383,0,0,0,.508,2.7,2.531,2.531,0,0,0,2.246,1.357,2.528,2.528,0,0,0,1.992-1,4.548,4.548,0,0,0,.84-2.983,4.627,4.627,0,0,0-.806-3A2.454,2.454,0,0,0-259.9-9.16a2.528,2.528,0,0,0-1.992,1A4.394,4.394,0,0,0-262.736-5.264Zm9.131-7.031v-2.021h1.758v2.021ZM-253.6,0V-10.371h1.758V0Zm10.762,0V-1.309a3.226,3.226,0,0,1-2.9,1.543,4.067,4.067,0,0,1-2.28-.684,4.5,4.5,0,0,1-1.611-1.909,6.6,6.6,0,0,1-.571-2.817,7.374,7.374,0,0,1,.518-2.817,4.082,4.082,0,0,1,1.553-1.938,4.151,4.151,0,0,1,2.314-.674,3.458,3.458,0,0,1,1.67.4,3.491,3.491,0,0,1,1.191,1.03v-5.137h1.748V0ZM-248.4-5.176a4.5,4.5,0,0,0,.84,2.979,2.532,2.532,0,0,0,1.982.986,2.486,2.486,0,0,0,1.958-.942,4.345,4.345,0,0,0,.806-2.876,4.877,4.877,0,0,0-.82-3.125,2.523,2.523,0,0,0-2.021-1,2.436,2.436,0,0,0-1.958.957A4.724,4.724,0,0,0-248.4-5.176Zm8.9-.01a5.346,5.346,0,0,1,1.6-4.268,4.826,4.826,0,0,1,3.262-1.152,4.653,4.653,0,0,1,3.5,1.4,5.331,5.331,0,0,1,1.357,3.872,6.861,6.861,0,0,1-.6,3.149A4.251,4.251,0,0,1-232.134-.4a5.089,5.089,0,0,1-2.5.635,4.662,4.662,0,0,1-3.521-1.4A5.578,5.578,0,0,1-239.5-5.186Zm1.807,0a4.417,4.417,0,0,0,.869,2.983,2.786,2.786,0,0,0,2.188.991,2.77,2.77,0,0,0,2.178-1,4.522,4.522,0,0,0,.869-3.037,4.285,4.285,0,0,0-.874-2.915,2.78,2.78,0,0,0-2.173-.991,2.792,2.792,0,0,0-2.187.986A4.4,4.4,0,0,0-237.7-5.186Zm14.727,9.16V-10.371h1.6v1.348a3.948,3.948,0,0,1,1.279-1.187,3.515,3.515,0,0,1,1.729-.4,4.1,4.1,0,0,1,2.344.684,4.2,4.2,0,0,1,1.533,1.929,7.042,7.042,0,0,1,.518,2.729,6.933,6.933,0,0,1-.571,2.866A4.307,4.307,0,0,1-216.2-.444a4.263,4.263,0,0,1-2.29.679,3.308,3.308,0,0,1-1.577-.371,3.592,3.592,0,0,1-1.147-.937V3.975Zm1.592-9.1a4.511,4.511,0,0,0,.811,2.959,2.486,2.486,0,0,0,1.963.957A2.541,2.541,0,0,0-216.6-2.2a4.7,4.7,0,0,0,.835-3.071,4.582,4.582,0,0,0-.815-2.969,2.455,2.455,0,0,0-1.948-.986,2.531,2.531,0,0,0-1.987,1.05A4.7,4.7,0,0,0-221.376-5.127Zm15.9,3.848a6.546,6.546,0,0,1-1.88,1.172A5.432,5.432,0,0,1-209.3.234,3.771,3.771,0,0,1-211.923-.6a2.756,2.756,0,0,1-.918-2.134,2.838,2.838,0,0,1,.347-1.392,2.87,2.87,0,0,1,.908-1.011,4.271,4.271,0,0,1,1.265-.576,12.561,12.561,0,0,1,1.563-.264,16.067,16.067,0,0,0,3.135-.605q.01-.361.01-.459a1.941,1.941,0,0,0-.5-1.514,2.942,2.942,0,0,0-2-.6,3.1,3.1,0,0,0-1.831.435,2.655,2.655,0,0,0-.874,1.538l-1.719-.234a4.259,4.259,0,0,1,.771-1.782,3.382,3.382,0,0,1,1.553-1.045,6.926,6.926,0,0,1,2.354-.366,6.229,6.229,0,0,1,2.158.313,2.844,2.844,0,0,1,1.221.786,2.765,2.765,0,0,1,.547,1.2,9.9,9.9,0,0,1,.088,1.621v2.344a24.876,24.876,0,0,0,.112,3.1A3.912,3.912,0,0,0-203.29,0h-1.836A3.727,3.727,0,0,1-205.477-1.279Zm-.146-3.926a12.9,12.9,0,0,1-2.871.664,6.641,6.641,0,0,0-1.533.352,1.528,1.528,0,0,0-.693.571,1.5,1.5,0,0,0-.244.835,1.5,1.5,0,0,0,.532,1.172,2.29,2.29,0,0,0,1.558.469,3.625,3.625,0,0,0,1.807-.444A2.736,2.736,0,0,0-205.907-2.8a4.246,4.246,0,0,0,.283-1.758ZM-201.541,0V-10.371h1.582V-8.8a4.29,4.29,0,0,1,1.118-1.455,1.952,1.952,0,0,1,1.128-.352,3.429,3.429,0,0,1,1.807.566l-.605,1.631a2.515,2.515,0,0,0-1.289-.381,1.674,1.674,0,0,0-1.035.347,1.878,1.878,0,0,0-.654.962,6.847,6.847,0,0,0-.293,2.051V0Zm13.047-1.279a6.546,6.546,0,0,1-1.88,1.172,5.432,5.432,0,0,1-1.938.342A3.771,3.771,0,0,1-194.939-.6a2.756,2.756,0,0,1-.918-2.134,2.838,2.838,0,0,1,.347-1.392,2.87,2.87,0,0,1,.908-1.011,4.271,4.271,0,0,1,1.265-.576,12.561,12.561,0,0,1,1.563-.264,16.067,16.067,0,0,0,3.135-.605q.01-.361.01-.459a1.941,1.941,0,0,0-.5-1.514,2.942,2.942,0,0,0-2-.6,3.1,3.1,0,0,0-1.831.435,2.655,2.655,0,0,0-.874,1.538l-1.719-.234a4.259,4.259,0,0,1,.771-1.782,3.382,3.382,0,0,1,1.553-1.045,6.926,6.926,0,0,1,2.354-.366,6.229,6.229,0,0,1,2.158.313,2.844,2.844,0,0,1,1.221.786,2.765,2.765,0,0,1,.547,1.2,9.9,9.9,0,0,1,.088,1.621v2.344a24.876,24.876,0,0,0,.112,3.1A3.912,3.912,0,0,0-186.307,0h-1.836A3.727,3.727,0,0,1-188.494-1.279Zm-.146-3.926a12.9,12.9,0,0,1-2.871.664,6.641,6.641,0,0,0-1.533.352,1.528,1.528,0,0,0-.693.571,1.5,1.5,0,0,0-.244.835,1.5,1.5,0,0,0,.532,1.172,2.29,2.29,0,0,0,1.558.469,3.625,3.625,0,0,0,1.807-.444A2.736,2.736,0,0,0-188.924-2.8a4.246,4.246,0,0,0,.283-1.758ZM-179.382,0V-10.371h1.572v1.455a3.7,3.7,0,0,1,1.3-1.226,3.649,3.649,0,0,1,1.846-.464,3.412,3.412,0,0,1,1.89.479,2.561,2.561,0,0,1,1.04,1.338,3.723,3.723,0,0,1,3.2-1.816,3.157,3.157,0,0,1,2.373.854,3.652,3.652,0,0,1,.83,2.632V0h-1.748V-6.533a4.81,4.81,0,0,0-.171-1.519,1.471,1.471,0,0,0-.62-.747,1.936,1.936,0,0,0-1.055-.283,2.454,2.454,0,0,0-1.816.728,3.2,3.2,0,0,0-.723,2.329V0h-1.758V-6.738a2.965,2.965,0,0,0-.43-1.758,1.627,1.627,0,0,0-1.406-.586,2.554,2.554,0,0,0-1.372.391,2.216,2.216,0,0,0-.913,1.143,6.432,6.432,0,0,0-.283,2.168V0Zm23.36-3.34,1.816.225A4.432,4.432,0,0,1-155.8-.645a4.785,4.785,0,0,1-2.969.879,4.744,4.744,0,0,1-3.608-1.4A5.476,5.476,0,0,1-163.708-5.1,5.731,5.731,0,0,1-162.36-9.16a4.562,4.562,0,0,1,3.5-1.445,4.434,4.434,0,0,1,3.4,1.416,5.626,5.626,0,0,1,1.318,3.984q0,.156-.01.469h-7.734a3.985,3.985,0,0,0,.967,2.617,2.878,2.878,0,0,0,2.168.908,2.69,2.69,0,0,0,1.65-.508A3.371,3.371,0,0,0-156.022-3.34Zm-5.771-2.842H-156a3.513,3.513,0,0,0-.664-1.963,2.694,2.694,0,0,0-2.178-1.016,2.792,2.792,0,0,0-2.036.811A3.208,3.208,0,0,0-161.794-6.182ZM-152.4,0V-10.371h1.582V-8.9a3.728,3.728,0,0,1,3.3-1.709,4.33,4.33,0,0,1,1.724.337,2.711,2.711,0,0,1,1.177.884,3.392,3.392,0,0,1,.547,1.3,10.065,10.065,0,0,1,.1,1.709V0h-1.758V-6.309a4.736,4.736,0,0,0-.205-1.606,1.69,1.69,0,0,0-.728-.85,2.314,2.314,0,0,0-1.226-.317,2.848,2.848,0,0,0-1.938.713,3.517,3.517,0,0,0-.815,2.705V0Zm10.069-5.186a5.346,5.346,0,0,1,1.6-4.268,4.826,4.826,0,0,1,3.262-1.152,4.653,4.653,0,0,1,3.5,1.4,5.331,5.331,0,0,1,1.357,3.872,6.861,6.861,0,0,1-.6,3.149A4.251,4.251,0,0,1-134.962-.4a5.089,5.089,0,0,1-2.5.635,4.662,4.662,0,0,1-3.521-1.4A5.578,5.578,0,0,1-142.33-5.186Zm1.807,0a4.417,4.417,0,0,0,.869,2.983,2.786,2.786,0,0,0,2.188.991,2.77,2.77,0,0,0,2.178-1,4.522,4.522,0,0,0,.869-3.037,4.285,4.285,0,0,0-.874-2.915,2.78,2.78,0,0,0-2.173-.991,2.792,2.792,0,0,0-2.187.986A4.4,4.4,0,0,0-140.523-5.186ZM-130.972,0V-10.371h1.582V-8.8a4.29,4.29,0,0,1,1.118-1.455,1.952,1.952,0,0,1,1.128-.352,3.429,3.429,0,0,1,1.807.566l-.605,1.631a2.515,2.515,0,0,0-1.289-.381,1.674,1.674,0,0,0-1.035.347,1.878,1.878,0,0,0-.654.962,6.847,6.847,0,0,0-.293,2.051V0Zm13.379-3.34,1.816.225a4.432,4.432,0,0,1-1.592,2.471,4.785,4.785,0,0,1-2.969.879,4.744,4.744,0,0,1-3.608-1.4A5.476,5.476,0,0,1-125.279-5.1a5.731,5.731,0,0,1,1.348-4.062,4.562,4.562,0,0,1,3.5-1.445,4.434,4.434,0,0,1,3.4,1.416,5.626,5.626,0,0,1,1.318,3.984q0,.156-.01.469h-7.734a3.985,3.985,0,0,0,.967,2.617,2.878,2.878,0,0,0,2.168.908,2.69,2.69,0,0,0,1.65-.508A3.371,3.371,0,0,0-117.593-3.34Zm-5.771-2.842h5.791a3.513,3.513,0,0,0-.664-1.963,2.694,2.694,0,0,0-2.178-1.016,2.792,2.792,0,0,0-2.036.811A3.208,3.208,0,0,0-123.364-6.182Zm8.692,3.086,1.738-.273a2.43,2.43,0,0,0,.815,1.6,2.842,2.842,0,0,0,1.87.557,2.747,2.747,0,0,0,1.8-.493,1.475,1.475,0,0,0,.586-1.157,1.068,1.068,0,0,0-.518-.937,7.624,7.624,0,0,0-1.8-.6,16.4,16.4,0,0,1-2.681-.845,2.6,2.6,0,0,1-1.133-.986,2.613,2.613,0,0,1-.386-1.392,2.671,2.671,0,0,1,.317-1.284,2.846,2.846,0,0,1,.864-.981,3.623,3.623,0,0,1,1.118-.513,5.317,5.317,0,0,1,1.519-.21,6,6,0,0,1,2.144.352,2.915,2.915,0,0,1,1.362.952A3.721,3.721,0,0,1-106.45-7.7l-1.719.234a1.88,1.88,0,0,0-.679-1.25,2.482,2.482,0,0,0-1.587-.449,2.874,2.874,0,0,0-1.729.4,1.166,1.166,0,0,0-.518.938.97.97,0,0,0,.215.615,1.55,1.55,0,0,0,.674.469q.264.1,1.553.449a21.616,21.616,0,0,1,2.6.815,2.64,2.64,0,0,1,1.157.923,2.576,2.576,0,0,1,.42,1.5,2.951,2.951,0,0,1-.513,1.655,3.314,3.314,0,0,1-1.479,1.2,5.385,5.385,0,0,1-2.187.425,4.873,4.873,0,0,1-3.081-.84A3.906,3.906,0,0,1-114.673-3.1ZM-92.484,0V-1.309a3.226,3.226,0,0,1-2.9,1.543,4.067,4.067,0,0,1-2.28-.684,4.5,4.5,0,0,1-1.611-1.909,6.6,6.6,0,0,1-.571-2.817,7.374,7.374,0,0,1,.518-2.817,4.082,4.082,0,0,1,1.553-1.938,4.151,4.151,0,0,1,2.314-.674,3.458,3.458,0,0,1,1.67.4A3.491,3.491,0,0,1-92.6-9.18v-5.137h1.748V0Zm-5.557-5.176A4.5,4.5,0,0,0-97.2-2.2a2.532,2.532,0,0,0,1.982.986,2.486,2.486,0,0,0,1.958-.942,4.345,4.345,0,0,0,.806-2.876,4.877,4.877,0,0,0-.82-3.125,2.523,2.523,0,0,0-2.021-1,2.436,2.436,0,0,0-1.958.957A4.724,4.724,0,0,0-98.041-5.176ZM-81.39-3.34l1.816.225A4.432,4.432,0,0,1-81.166-.645a4.785,4.785,0,0,1-2.969.879,4.744,4.744,0,0,1-3.608-1.4A5.476,5.476,0,0,1-89.076-5.1,5.731,5.731,0,0,1-87.728-9.16a4.562,4.562,0,0,1,3.5-1.445,4.434,4.434,0,0,1,3.4,1.416,5.626,5.626,0,0,1,1.318,3.984q0,.156-.01.469h-7.734a3.985,3.985,0,0,0,.967,2.617,2.878,2.878,0,0,0,2.168.908,2.69,2.69,0,0,0,1.65-.508A3.371,3.371,0,0,0-81.39-3.34Zm-5.771-2.842h5.791a3.513,3.513,0,0,0-.664-1.963A2.694,2.694,0,0,0-84.213-9.16a2.792,2.792,0,0,0-2.036.811A3.208,3.208,0,0,0-87.162-6.182ZM-66.477,0h-1.758V-11.2A9.085,9.085,0,0,1-69.9-9.99a11.8,11.8,0,0,1-1.851.908v-1.7a10.616,10.616,0,0,0,2.578-1.68,6.607,6.607,0,0,0,1.563-1.914h1.133Zm6.807-7.764a3.309,3.309,0,0,1-1.621-1.143,2.988,2.988,0,0,1-.527-1.777A3.476,3.476,0,0,1-60.7-13.311a4.165,4.165,0,0,1,2.988-1.064,4.193,4.193,0,0,1,3.018,1.089,3.524,3.524,0,0,1,1.143,2.651A2.92,2.92,0,0,1-54.07-8.9a3.3,3.3,0,0,1-1.587,1.138A3.849,3.849,0,0,1-53.65-6.377a3.809,3.809,0,0,1,.688,2.285,4.113,4.113,0,0,1-1.3,3.086A4.722,4.722,0,0,1-57.678.244,4.712,4.712,0,0,1-61.1-1.011a4.174,4.174,0,0,1-1.3-3.13,3.783,3.783,0,0,1,.708-2.339A3.545,3.545,0,0,1-59.67-7.764Zm-.352-2.979a2.229,2.229,0,0,0,.654,1.66,2.318,2.318,0,0,0,1.7.645A2.273,2.273,0,0,0-56-9.077a2.115,2.115,0,0,0,.649-1.567,2.193,2.193,0,0,0-.669-1.626,2.278,2.278,0,0,0-1.665-.659,2.3,2.3,0,0,0-1.67.645A2.075,2.075,0,0,0-60.022-10.742Zm-.566,6.611a3.18,3.18,0,0,0,.356,1.455,2.515,2.515,0,0,0,1.06,1.089,3.1,3.1,0,0,0,1.514.386,2.837,2.837,0,0,0,2.08-.811,2.774,2.774,0,0,0,.82-2.061,2.82,2.82,0,0,0-.845-2.1A2.9,2.9,0,0,0-57.717-7a2.778,2.778,0,0,0-2.056.82A2.791,2.791,0,0,0-60.588-4.131ZM-39.24-1.279A6.546,6.546,0,0,1-41.12-.107a5.432,5.432,0,0,1-1.938.342A3.771,3.771,0,0,1-45.685-.6,2.756,2.756,0,0,1-46.6-2.734a2.838,2.838,0,0,1,.347-1.392,2.87,2.87,0,0,1,.908-1.011,4.271,4.271,0,0,1,1.265-.576,12.561,12.561,0,0,1,1.563-.264,16.067,16.067,0,0,0,3.135-.605q.01-.361.01-.459a1.941,1.941,0,0,0-.5-1.514,2.942,2.942,0,0,0-2-.6,3.1,3.1,0,0,0-1.831.435,2.655,2.655,0,0,0-.874,1.538L-46.3-7.412a4.259,4.259,0,0,1,.771-1.782,3.382,3.382,0,0,1,1.553-1.045,6.926,6.926,0,0,1,2.354-.366,6.229,6.229,0,0,1,2.158.313,2.844,2.844,0,0,1,1.221.786,2.765,2.765,0,0,1,.547,1.2,9.9,9.9,0,0,1,.088,1.621v2.344a24.876,24.876,0,0,0,.112,3.1A3.912,3.912,0,0,0-37.052,0h-1.836A3.727,3.727,0,0,1-39.24-1.279Zm-.146-3.926a12.9,12.9,0,0,1-2.871.664,6.641,6.641,0,0,0-1.533.352,1.528,1.528,0,0,0-.693.571,1.5,1.5,0,0,0-.244.835A1.5,1.5,0,0,0-44.2-1.611a2.29,2.29,0,0,0,1.558.469,3.625,3.625,0,0,0,1.807-.444A2.736,2.736,0,0,0-39.67-2.8a4.246,4.246,0,0,0,.283-1.758ZM-35.284,0V-10.371H-33.7V-8.9a3.728,3.728,0,0,1,3.3-1.709,4.33,4.33,0,0,1,1.724.337,2.711,2.711,0,0,1,1.177.884,3.392,3.392,0,0,1,.547,1.3,10.065,10.065,0,0,1,.1,1.709V0h-1.758V-6.309a4.736,4.736,0,0,0-.205-1.606,1.69,1.69,0,0,0-.728-.85,2.314,2.314,0,0,0-1.226-.317,2.848,2.848,0,0,0-1.938.713,3.517,3.517,0,0,0-.815,2.705V0Zm10.069-5.186a5.346,5.346,0,0,1,1.6-4.268,4.826,4.826,0,0,1,3.262-1.152,4.653,4.653,0,0,1,3.5,1.4A5.331,5.331,0,0,1-15.5-5.332a6.861,6.861,0,0,1-.6,3.149A4.251,4.251,0,0,1-17.847-.4a5.089,5.089,0,0,1-2.5.635,4.662,4.662,0,0,1-3.521-1.4A5.578,5.578,0,0,1-25.216-5.186Zm1.807,0A4.417,4.417,0,0,0-22.54-2.2a2.786,2.786,0,0,0,2.188.991,2.77,2.77,0,0,0,2.178-1,4.522,4.522,0,0,0,.869-3.037,4.285,4.285,0,0,0-.874-2.915,2.78,2.78,0,0,0-2.173-.991,2.792,2.792,0,0,0-2.187.986A4.4,4.4,0,0,0-23.409-5.186Zm8.868,2.09,1.738-.273a2.43,2.43,0,0,0,.815,1.6,2.842,2.842,0,0,0,1.87.557,2.747,2.747,0,0,0,1.8-.493,1.475,1.475,0,0,0,.586-1.157A1.068,1.068,0,0,0-8.252-3.8a7.624,7.624,0,0,0-1.8-.6,16.4,16.4,0,0,1-2.681-.845,2.6,2.6,0,0,1-1.133-.986,2.613,2.613,0,0,1-.386-1.392A2.671,2.671,0,0,1-13.931-8.9a2.846,2.846,0,0,1,.864-.981,3.623,3.623,0,0,1,1.118-.513,5.317,5.317,0,0,1,1.519-.21,6,6,0,0,1,2.144.352A2.915,2.915,0,0,1-6.924-9.3,3.721,3.721,0,0,1-6.319-7.7l-1.719.234a1.88,1.88,0,0,0-.679-1.25A2.482,2.482,0,0,0-10.3-9.16a2.874,2.874,0,0,0-1.729.4,1.166,1.166,0,0,0-.518.938.97.97,0,0,0,.215.615,1.55,1.55,0,0,0,.674.469q.264.1,1.553.449a21.616,21.616,0,0,1,2.6.815,2.64,2.64,0,0,1,1.157.923,2.576,2.576,0,0,1,.42,1.5,2.951,2.951,0,0,1-.513,1.655A3.314,3.314,0,0,1-7.92-.19a5.385,5.385,0,0,1-2.187.425,4.873,4.873,0,0,1-3.081-.84A3.906,3.906,0,0,1-14.541-3.1ZM-3.74,0V-2h2V0ZM-249.19,14.938l1.709-.234a3.659,3.659,0,0,0,.615,2.246,1.936,1.936,0,0,0,1.514.605,2.255,2.255,0,0,0,1.23-.327,1.68,1.68,0,0,0,.713-.889,5.934,5.934,0,0,0,.2-1.792V4.684h1.895v9.756a7.106,7.106,0,0,1-.435,2.783,3.1,3.1,0,0,1-1.377,1.5,4.524,4.524,0,0,1-2.212.518,3.733,3.733,0,0,1-2.886-1.084A4.473,4.473,0,0,1-249.19,14.938Zm9.688-1.123a5.346,5.346,0,0,1,1.6-4.268,4.826,4.826,0,0,1,3.262-1.152,4.653,4.653,0,0,1,3.5,1.4,5.331,5.331,0,0,1,1.357,3.872,6.861,6.861,0,0,1-.6,3.149,4.251,4.251,0,0,1-1.748,1.782,5.089,5.089,0,0,1-2.5.635,4.662,4.662,0,0,1-3.521-1.4A5.578,5.578,0,0,1-239.5,13.814Zm1.807,0a4.417,4.417,0,0,0,.869,2.983,2.786,2.786,0,0,0,2.188.991,2.77,2.77,0,0,0,2.178-1,4.522,4.522,0,0,0,.869-3.037,4.285,4.285,0,0,0-.874-2.915,2.78,2.78,0,0,0-2.173-.991,2.792,2.792,0,0,0-2.187.986A4.4,4.4,0,0,0-237.7,13.814Zm9.248,6.045,1.709.254a1.629,1.629,0,0,0,.6,1.152,2.927,2.927,0,0,0,1.787.488,3.138,3.138,0,0,0,1.885-.488,2.4,2.4,0,0,0,.9-1.367,11.227,11.227,0,0,0,.127-2.256A3.616,3.616,0,0,1-224.316,19a3.914,3.914,0,0,1-3.311-1.543,5.942,5.942,0,0,1-1.172-3.7,6.889,6.889,0,0,1,.537-2.739A4.3,4.3,0,0,1-226.7,9.078a4.206,4.206,0,0,1,2.4-.684,3.718,3.718,0,0,1,3.027,1.484V8.629h1.621v8.965a8.5,8.5,0,0,1-.493,3.433,3.607,3.607,0,0,1-1.562,1.6,5.415,5.415,0,0,1-2.632.586,4.963,4.963,0,0,1-3-.835A2.823,2.823,0,0,1-228.447,19.859Zm1.455-6.23a4.5,4.5,0,0,0,.811,2.979,2.574,2.574,0,0,0,2.031.938,2.6,2.6,0,0,0,2.031-.933,4.353,4.353,0,0,0,.82-2.925,4.253,4.253,0,0,0-.845-2.871,2.612,2.612,0,0,0-2.036-.967,2.537,2.537,0,0,0-1.992.952A4.228,4.228,0,0,0-226.992,13.629ZM-210.6,19V17.477a3.8,3.8,0,0,1-3.291,1.758,4.194,4.194,0,0,1-1.714-.352A2.823,2.823,0,0,1-216.791,18a3.312,3.312,0,0,1-.542-1.3,8.926,8.926,0,0,1-.107-1.641V8.629h1.758v5.752a10.251,10.251,0,0,0,.107,1.855,1.833,1.833,0,0,0,.7,1.089,2.178,2.178,0,0,0,1.328.4,2.893,2.893,0,0,0,1.484-.405,2.253,2.253,0,0,0,.981-1.1,5.537,5.537,0,0,0,.288-2.026V8.629h1.758V19Zm11.026-3.34,1.816.225a4.432,4.432,0,0,1-1.592,2.471,4.785,4.785,0,0,1-2.969.879,4.744,4.744,0,0,1-3.608-1.4,5.476,5.476,0,0,1-1.333-3.931,5.731,5.731,0,0,1,1.348-4.062,4.562,4.562,0,0,1,3.5-1.445,4.434,4.434,0,0,1,3.4,1.416,5.626,5.626,0,0,1,1.318,3.984q0,.156-.01.469h-7.734a3.985,3.985,0,0,0,.967,2.617,2.878,2.878,0,0,0,2.168.908,2.69,2.69,0,0,0,1.65-.508A3.371,3.371,0,0,0-199.579,15.66Zm-5.771-2.842h5.791a3.513,3.513,0,0,0-.664-1.963A2.694,2.694,0,0,0-202.4,9.84a2.792,2.792,0,0,0-2.036.811A3.208,3.208,0,0,0-205.35,12.818Zm21.319,2.383,1.729.225a4.483,4.483,0,0,1-1.45,2.8,4.225,4.225,0,0,1-2.866,1.011,4.453,4.453,0,0,1-3.423-1.392,5.646,5.646,0,0,1-1.294-3.989,7.219,7.219,0,0,1,.557-2.939,3.881,3.881,0,0,1,1.694-1.89,5.027,5.027,0,0,1,2.476-.63,4.3,4.3,0,0,1,2.764.854,3.918,3.918,0,0,1,1.377,2.427l-1.709.264a2.838,2.838,0,0,0-.864-1.572,2.236,2.236,0,0,0-1.5-.527,2.728,2.728,0,0,0-2.158.952,4.52,4.52,0,0,0-.83,3.013,4.672,4.672,0,0,0,.8,3.037,2.606,2.606,0,0,0,2.09.947,2.463,2.463,0,0,0,1.729-.635A3.15,3.15,0,0,0-184.031,15.2Zm2.178-1.387a5.346,5.346,0,0,1,1.6-4.268,4.826,4.826,0,0,1,3.262-1.152,4.653,4.653,0,0,1,3.5,1.4,5.331,5.331,0,0,1,1.357,3.872,6.861,6.861,0,0,1-.6,3.149,4.251,4.251,0,0,1-1.748,1.782,5.089,5.089,0,0,1-2.5.635,4.662,4.662,0,0,1-3.521-1.4A5.578,5.578,0,0,1-181.853,13.814Zm1.807,0a4.417,4.417,0,0,0,.869,2.983,2.786,2.786,0,0,0,2.188.991,2.77,2.77,0,0,0,2.178-1,4.522,4.522,0,0,0,.869-3.037,4.285,4.285,0,0,0-.874-2.915,2.78,2.78,0,0,0-2.173-.991,2.792,2.792,0,0,0-2.187.986A4.4,4.4,0,0,0-180.046,13.814ZM-170.476,19V8.629h1.572v1.455a3.7,3.7,0,0,1,1.3-1.226,3.649,3.649,0,0,1,1.846-.464,3.412,3.412,0,0,1,1.89.479,2.561,2.561,0,0,1,1.04,1.338,3.723,3.723,0,0,1,3.2-1.816,3.157,3.157,0,0,1,2.373.854,3.652,3.652,0,0,1,.83,2.632V19h-1.748V12.467a4.81,4.81,0,0,0-.171-1.519,1.471,1.471,0,0,0-.62-.747,1.936,1.936,0,0,0-1.055-.283,2.454,2.454,0,0,0-1.816.728,3.2,3.2,0,0,0-.723,2.329V19h-1.758V12.262a2.965,2.965,0,0,0-.43-1.758,1.627,1.627,0,0,0-1.406-.586,2.554,2.554,0,0,0-1.372.391,2.216,2.216,0,0,0-.913,1.143,6.432,6.432,0,0,0-.283,2.168V19Zm21.4,0V8.629h1.582V10.2a4.29,4.29,0,0,1,1.118-1.455,1.952,1.952,0,0,1,1.128-.352,3.429,3.429,0,0,1,1.807.566l-.605,1.631a2.515,2.515,0,0,0-1.289-.381,1.674,1.674,0,0,0-1.035.347,1.878,1.878,0,0,0-.654.962,6.847,6.847,0,0,0-.293,2.051V19Zm13.379-3.34,1.816.225a4.432,4.432,0,0,1-1.592,2.471,4.785,4.785,0,0,1-2.969.879,4.744,4.744,0,0,1-3.608-1.4,5.476,5.476,0,0,1-1.333-3.931,5.731,5.731,0,0,1,1.348-4.062,4.562,4.562,0,0,1,3.5-1.445,4.434,4.434,0,0,1,3.4,1.416,5.626,5.626,0,0,1,1.318,3.984q0,.156-.01.469h-7.734a3.985,3.985,0,0,0,.967,2.617,2.878,2.878,0,0,0,2.168.908,2.69,2.69,0,0,0,1.65-.508A3.371,3.371,0,0,0-135.7,15.66Zm-5.771-2.842h5.791a3.513,3.513,0,0,0-.664-1.963,2.694,2.694,0,0,0-2.178-1.016,2.792,2.792,0,0,0-2.036.811A3.208,3.208,0,0,0-141.471,12.818Zm8.692,3.086,1.738-.273a2.43,2.43,0,0,0,.815,1.6,2.842,2.842,0,0,0,1.87.557,2.747,2.747,0,0,0,1.8-.493,1.475,1.475,0,0,0,.586-1.157,1.068,1.068,0,0,0-.518-.937,7.624,7.624,0,0,0-1.8-.6,16.4,16.4,0,0,1-2.681-.845,2.6,2.6,0,0,1-1.133-.986,2.613,2.613,0,0,1-.386-1.392,2.671,2.671,0,0,1,.317-1.284,2.846,2.846,0,0,1,.864-.981,3.623,3.623,0,0,1,1.118-.513,5.317,5.317,0,0,1,1.519-.21,6,6,0,0,1,2.144.352,2.915,2.915,0,0,1,1.362.952,3.721,3.721,0,0,1,.605,1.606l-1.719.234a1.88,1.88,0,0,0-.679-1.25,2.482,2.482,0,0,0-1.587-.449,2.874,2.874,0,0,0-1.729.4,1.166,1.166,0,0,0-.518.938.97.97,0,0,0,.215.615,1.55,1.55,0,0,0,.674.469q.264.1,1.553.449a21.615,21.615,0,0,1,2.6.815,2.64,2.64,0,0,1,1.157.923,2.576,2.576,0,0,1,.42,1.5,2.951,2.951,0,0,1-.513,1.655,3.314,3.314,0,0,1-1.479,1.2,5.385,5.385,0,0,1-2.188.425,4.873,4.873,0,0,1-3.081-.84A3.906,3.906,0,0,1-132.779,15.9Zm10.3,7.07V8.629h1.6V9.977a3.948,3.948,0,0,1,1.279-1.187,3.515,3.515,0,0,1,1.729-.4,4.1,4.1,0,0,1,2.344.684,4.2,4.2,0,0,1,1.533,1.929,7.042,7.042,0,0,1,.518,2.729,6.933,6.933,0,0,1-.571,2.866,4.307,4.307,0,0,1-1.66,1.953,4.263,4.263,0,0,1-2.29.679,3.308,3.308,0,0,1-1.577-.371,3.592,3.592,0,0,1-1.147-.937v5.049Zm1.592-9.1a4.511,4.511,0,0,0,.811,2.959,2.486,2.486,0,0,0,1.963.957A2.541,2.541,0,0,0-116.1,16.8a4.7,4.7,0,0,0,.835-3.071,4.582,4.582,0,0,0-.815-2.969,2.455,2.455,0,0,0-1.948-.986,2.531,2.531,0,0,0-1.987,1.05A4.7,4.7,0,0,0-120.884,13.873Zm8.477-.059a5.346,5.346,0,0,1,1.6-4.268,4.826,4.826,0,0,1,3.262-1.152,4.653,4.653,0,0,1,3.5,1.4,5.331,5.331,0,0,1,1.357,3.872,6.861,6.861,0,0,1-.6,3.149,4.251,4.251,0,0,1-1.748,1.782,5.089,5.089,0,0,1-2.5.635,4.662,4.662,0,0,1-3.521-1.4A5.578,5.578,0,0,1-112.407,13.814Zm1.807,0a4.417,4.417,0,0,0,.869,2.983,2.786,2.786,0,0,0,2.188.991,2.77,2.77,0,0,0,2.178-1,4.522,4.522,0,0,0,.869-3.037,4.285,4.285,0,0,0-.874-2.915,2.78,2.78,0,0,0-2.173-.991,2.792,2.792,0,0,0-2.187.986A4.4,4.4,0,0,0-110.6,13.814ZM-101.03,19V8.629h1.582V10.1a3.728,3.728,0,0,1,3.3-1.709,4.33,4.33,0,0,1,1.724.337,2.711,2.711,0,0,1,1.177.884,3.392,3.392,0,0,1,.547,1.3,10.066,10.066,0,0,1,.1,1.709V19H-94.36V12.691a4.736,4.736,0,0,0-.205-1.606,1.69,1.69,0,0,0-.728-.85,2.314,2.314,0,0,0-1.226-.317,2.848,2.848,0,0,0-1.938.713,3.517,3.517,0,0,0-.815,2.705V19Zm10.02-3.1,1.738-.273a2.43,2.43,0,0,0,.815,1.6,2.842,2.842,0,0,0,1.87.557,2.747,2.747,0,0,0,1.8-.493,1.475,1.475,0,0,0,.586-1.157,1.068,1.068,0,0,0-.518-.937,7.624,7.624,0,0,0-1.8-.6,16.4,16.4,0,0,1-2.681-.845,2.6,2.6,0,0,1-1.133-.986,2.613,2.613,0,0,1-.386-1.392A2.671,2.671,0,0,1-90.4,10.1a2.846,2.846,0,0,1,.864-.981A3.623,3.623,0,0,1-88.417,8.6a5.317,5.317,0,0,1,1.519-.21,6,6,0,0,1,2.144.352,2.915,2.915,0,0,1,1.362.952,3.721,3.721,0,0,1,.605,1.606l-1.719.234a1.88,1.88,0,0,0-.679-1.25,2.482,2.482,0,0,0-1.587-.449,2.874,2.874,0,0,0-1.729.4,1.166,1.166,0,0,0-.518.938.97.97,0,0,0,.215.615,1.55,1.55,0,0,0,.674.469q.264.1,1.553.449a21.615,21.615,0,0,1,2.6.815,2.64,2.64,0,0,1,1.157.923,2.576,2.576,0,0,1,.42,1.5,2.951,2.951,0,0,1-.513,1.655,3.314,3.314,0,0,1-1.479,1.2,5.385,5.385,0,0,1-2.187.425,4.873,4.873,0,0,1-3.081-.84A3.906,3.906,0,0,1-91.01,15.9Zm17.071,1.816a6.546,6.546,0,0,1-1.88,1.172,5.432,5.432,0,0,1-1.938.342,3.771,3.771,0,0,1-2.627-.835,2.756,2.756,0,0,1-.918-2.134,2.838,2.838,0,0,1,.347-1.392,2.87,2.87,0,0,1,.908-1.011,4.271,4.271,0,0,1,1.265-.576,12.561,12.561,0,0,1,1.563-.264,16.067,16.067,0,0,0,3.135-.605q.01-.361.01-.459a1.941,1.941,0,0,0-.5-1.514,2.942,2.942,0,0,0-2-.6,3.1,3.1,0,0,0-1.831.435,2.655,2.655,0,0,0-.874,1.538L-81,11.588a4.259,4.259,0,0,1,.771-1.782,3.382,3.382,0,0,1,1.553-1.045,6.926,6.926,0,0,1,2.354-.366,6.229,6.229,0,0,1,2.158.313,2.844,2.844,0,0,1,1.221.786,2.765,2.765,0,0,1,.547,1.2,9.9,9.9,0,0,1,.088,1.621v2.344a24.877,24.877,0,0,0,.112,3.1A3.912,3.912,0,0,0-71.752,19h-1.836A3.727,3.727,0,0,1-73.939,17.721Zm-.146-3.926a12.9,12.9,0,0,1-2.871.664,6.641,6.641,0,0,0-1.533.352,1.528,1.528,0,0,0-.693.571,1.5,1.5,0,0,0-.244.835,1.5,1.5,0,0,0,.532,1.172,2.29,2.29,0,0,0,1.558.469,3.625,3.625,0,0,0,1.807-.444A2.736,2.736,0,0,0-74.369,16.2a4.246,4.246,0,0,0,.283-1.758ZM-68.363,19h-1.631V4.684h1.758V9.791a3.478,3.478,0,0,1,2.842-1.4,4.352,4.352,0,0,1,1.812.386,3.7,3.7,0,0,1,1.406,1.084,5.24,5.24,0,0,1,.864,1.685A6.945,6.945,0,0,1-61,13.658a5.924,5.924,0,0,1-1.318,4.121,4.123,4.123,0,0,1-3.164,1.455A3.3,3.3,0,0,1-68.363,17.7Zm-.02-5.264a5.383,5.383,0,0,0,.508,2.7,2.531,2.531,0,0,0,2.246,1.357,2.528,2.528,0,0,0,1.992-1A4.549,4.549,0,0,0-62.8,13.8a4.627,4.627,0,0,0-.806-3A2.454,2.454,0,0,0-65.55,9.84a2.528,2.528,0,0,0-1.992,1A4.394,4.394,0,0,0-68.382,13.736Zm9.131-7.031V4.684h1.758V6.705Zm0,12.295V8.629h1.758V19Zm3.995,0V4.684H-53.5V19Zm4.092-12.295V4.684h1.758V6.705Zm0,12.295V8.629h1.758V19ZM-40.4,19V17.691a3.226,3.226,0,0,1-2.9,1.543,4.067,4.067,0,0,1-2.28-.684,4.5,4.5,0,0,1-1.611-1.909,6.6,6.6,0,0,1-.571-2.817,7.374,7.374,0,0,1,.518-2.817,4.082,4.082,0,0,1,1.553-1.938,4.151,4.151,0,0,1,2.314-.674,3.458,3.458,0,0,1,1.67.4,3.491,3.491,0,0,1,1.191,1.03V4.684h1.748V19Zm-5.557-5.176a4.5,4.5,0,0,0,.84,2.979,2.532,2.532,0,0,0,1.982.986,2.486,2.486,0,0,0,1.958-.942,4.345,4.345,0,0,0,.806-2.876,4.877,4.877,0,0,0-.82-3.125,2.523,2.523,0,0,0-2.021-1,2.436,2.436,0,0,0-1.958.957A4.724,4.724,0,0,0-45.959,13.824Zm16.319,3.9a6.546,6.546,0,0,1-1.88,1.172,5.432,5.432,0,0,1-1.938.342,3.771,3.771,0,0,1-2.627-.835A2.756,2.756,0,0,1-37,16.266a2.838,2.838,0,0,1,.347-1.392,2.87,2.87,0,0,1,.908-1.011,4.271,4.271,0,0,1,1.265-.576,12.561,12.561,0,0,1,1.563-.264,16.067,16.067,0,0,0,3.135-.605q.01-.361.01-.459a1.941,1.941,0,0,0-.5-1.514,2.942,2.942,0,0,0-2-.6,3.1,3.1,0,0,0-1.831.435,2.655,2.655,0,0,0-.874,1.538l-1.719-.234a4.259,4.259,0,0,1,.771-1.782,3.382,3.382,0,0,1,1.553-1.045,6.926,6.926,0,0,1,2.354-.366,6.229,6.229,0,0,1,2.158.313,2.844,2.844,0,0,1,1.221.786,2.765,2.765,0,0,1,.547,1.2,9.9,9.9,0,0,1,.088,1.621v2.344a24.877,24.877,0,0,0,.112,3.1A3.912,3.912,0,0,0-27.452,19h-1.836A3.727,3.727,0,0,1-29.64,17.721Zm-.146-3.926a12.9,12.9,0,0,1-2.871.664,6.641,6.641,0,0,0-1.533.352,1.528,1.528,0,0,0-.693.571,1.5,1.5,0,0,0-.244.835,1.5,1.5,0,0,0,.532,1.172,2.29,2.29,0,0,0,1.558.469,3.625,3.625,0,0,0,1.807-.444A2.736,2.736,0,0,0-30.07,16.2a4.246,4.246,0,0,0,.283-1.758ZM-18.956,19V17.691a3.226,3.226,0,0,1-2.9,1.543,4.067,4.067,0,0,1-2.28-.684,4.5,4.5,0,0,1-1.611-1.909,6.6,6.6,0,0,1-.571-2.817,7.374,7.374,0,0,1,.518-2.817,4.082,4.082,0,0,1,1.553-1.938,4.151,4.151,0,0,1,2.314-.674,3.458,3.458,0,0,1,1.67.4,3.491,3.491,0,0,1,1.191,1.03V4.684h1.748V19Zm-5.557-5.176a4.5,4.5,0,0,0,.84,2.979,2.532,2.532,0,0,0,1.982.986,2.486,2.486,0,0,0,1.958-.942,4.345,4.345,0,0,0,.806-2.876,4.877,4.877,0,0,0-.82-3.125,2.523,2.523,0,0,0-2.021-1,2.436,2.436,0,0,0-1.958.957A4.724,4.724,0,0,0-24.513,13.824ZM-7.862,15.66l1.816.225a4.432,4.432,0,0,1-1.592,2.471,4.785,4.785,0,0,1-2.969.879,4.744,4.744,0,0,1-3.608-1.4A5.476,5.476,0,0,1-15.547,13.9,5.731,5.731,0,0,1-14.2,9.84a4.562,4.562,0,0,1,3.5-1.445,4.434,4.434,0,0,1,3.4,1.416,5.626,5.626,0,0,1,1.318,3.984q0,.156-.01.469h-7.734a3.985,3.985,0,0,0,.967,2.617,2.878,2.878,0,0,0,2.168.908,2.69,2.69,0,0,0,1.65-.508A3.371,3.371,0,0,0-7.862,15.66Zm-5.771-2.842h5.791a3.513,3.513,0,0,0-.664-1.963A2.694,2.694,0,0,0-10.684,9.84a2.792,2.792,0,0,0-2.036.811A3.208,3.208,0,0,0-13.633,12.818ZM-3.74,19V17h2v2Z" transform="translate(1083 1712.375)" fill="#fff"/>
    <g id="_-18" data-name="-18" transform="translate(1086.745 1699)">
      <path id="Path_3171" data-name="Path 3171" d="M30.882,5.3C19.514-6.043.02,2.033,0,18.086a18.171,18.171,0,0,0,18.09,18.087C34.148,36.157,42.224,16.659,30.882,5.3Zm-1.5,24.08C19.35,39.391,2.136,32.261,2.123,18.088a16.048,16.048,0,0,1,15.97-15.97C32.264,2.135,39.394,19.348,29.382,29.379Z" transform="translate(0 -0.001)" fill="#fff"/>
      <path id="Path_3172" data-name="Path 3172" d="M196.548,159.12h1.838V171.2h2.12V157h-3.957Z" transform="translate(-182.661 -145.908)" fill="#fff"/>
      <path id="Path_3173" data-name="Path 3173" d="M289.925,163a3.611,3.611,0,1,0-5.417,0,4.56,4.56,0,1,0,5.417,0Zm-4.2-2.387a1.493,1.493,0,1,1,1.493,1.493,1.493,1.493,0,0,1-1.493-1.493Zm1.493,8.5a2.444,2.444,0,1,1,2.444-2.444,2.444,2.444,0,0,1-2.444,2.444Z" transform="translate(-262.693 -145.907)" fill="#fff"/>
      <path id="Path_3174" data-name="Path 3174" d="M99.182,203h-2.12v2.014H95.049v2.12h2.014v2.014h2.12v-2.014H101.2v-2.12H99.182Z" transform="translate(-88.333 -188.657)" fill="#fff"/>
    </g>
  </g>
</svg>
