<?xml version="1.0" encoding="UTF-8" standalone="no" ?>

<!DOCTYPE
  svg
  PUBLIC
  "-//W3C//DTD SVG 1.1//EN"
  "http://www.w3.org/Graphics/SVG/1.1/DTD/svg11.dtd"
>

<svg
 xmlns="http://www.w3.org/2000/svg"
 xmlns:xlink="http://www.w3.org/1999/xlink"
 viewBox="0 0 571 370"
>

<defs>

  <linearGradient id="gradiente"
   gradientUnits="userSpaceOnUse"
   x1="0"
   y1="0"
   x2="0"
   y2="370"
  >
    <stop style="stop-color:#f8f800" offset="0" />
    <stop style="stop-color:#fcb539" offset="1" />
  </linearGradient>

  <filter id="blur" color-interpolation-filters="sRGB">
    <feGaussianBlur stdDeviation="4.5" />
  </filter>

  <path id="balao"
    d="m  165 ,   43
       c -300 ,  125
         -152 ,  402
          219 ,  282
       l  100 ,   13
            0 ,  -70
       c  191 , -162
          -40 , -342
         -319 , -225 z" />

</defs>

<g>
  <use xlink:href="#balao" style="fill:#666666;filter:url(#blur)" x="6" y="7" />
  <use xlink:href="#balao" style="fill:url(#gradiente)" />
  <path d="m 255.80,144.18 0,8.25 45.03,0 c 2.57,0 4.79,0.89 6.62,2.71 1.91,1.82 2.84,4.04 2.84,6.62 l 0,2.21 -44.93,0 c -28.36,-0.00 -28.36,42.53 0,42.53 l 30.75,0 0,-8.21 -30.75,0 c -17.39,-0.00 -17.39,-26.09 0,-26.09 l 44.93,0 0,34.31 8.25,0 0,-44.75 c 0,-4.82 -1.75,-8.93 -5.25,-12.34 -3.40,-3.49 -7.56,-5.24 -12.46,-5.25 z m 93.22,0 c -28.36,0 -28.36,35.28 0,35.28 l 25.40,0 c 17.39,-0.00 17.39,18.84 0,18.84 l -44.68,0 0,8.21 44.68,0 c 28.36,0 28.36,-35.28 0,-35.28 l -25.40,0 c -17.39,0.00 -17.39,-18.81 0,-18.81 l 44.68,0 0,-8.25 z M 160.45,129.24 c 0,2.27 -1.84,4.11 -4.11,4.11 -2.27,0 -4.11,-1.84 -4.11,-4.11 0,-2.27 1.84,-4.11 4.11,-4.11 2.27,0 4.11,1.84 4.11,4.11 z m 81.87,77.27 -50.49,0 c -4.90,0 -9.10,-1.70 -12.59,-5.11 -3.40,-3.49 -5.11,-7.68 -5.11,-12.59 l 0,-27.05 c 0,-4.90 1.70,-9.05 5.11,-12.46 3.49,-3.40 7.68,-5.11 12.59,-5.11 l 50.49,0 0,8.22 -50.49,0 c -2.65,0 -4.90,0.91 -6.73,2.74 -1.82,1.82 -2.74,4.03 -2.74,6.60 l 0,27.05 c 0,2.65 0.91,4.90 2.74,6.73 1.82,1.82 4.07,2.74 6.73,2.74 l 50.49,0 0,8.22 m 202.79,-29.05 -35.52,0 0,-8.22 35.52,0 0,8.22 m 44.45,29.05 -12.84,0 c -4.90,0 -9.10,-1.70 -12.59,-5.11 -3.40,-3.49 -5.11,-7.68 -5.11,-12.59 l 0,-69.68 8.22,0 0,69.68 c 0,2.65 0.91,4.90 2.74,6.73 1.82,1.82 4.07,2.74 6.73,2.74 l 12.84,0 0,8.22 m -337.35,0 0,-62.33 8.22,0 0,62.33 m -76.90,-54.12 47.99,0 0,36.40 c 0,2.65 -0.92,4.92 -2.75,6.75 -1.82,1.82 -4.05,2.75 -6.71,2.75 l -38.53,0 c -2.65,0 -4.89,-0.92 -6.71,-2.75 -1.82,-1.82 -2.75,-4.09 -2.75,-6.75 l 0,-27.03 c 0,-2.57 0.92,-4.79 2.75,-6.62 1.82,-1.82 4.05,-2.74 6.71,-2.75 z m 47.99,-33.28 0,25.06 -47.99,0 c -4.90,0 -9.10,1.75 -12.59,5.25 -3.40,3.40 -5.12,7.52 -5.12,12.34 l 0,27.03 c 0,4.90 1.71,9.10 5.12,12.59 3.49,3.40 7.68,5.12 12.59,5.12 l 38.53,0 c 4.90,0 9.10,-1.71 12.59,-5.12 3.40,-3.49 5.09,-7.68 5.09,-12.59 l 0,-69.68 z" />
  <path d="m 478.20,228.29 c 0.28,0 0.60,0.02 0.96,0.07 0.38,0.02 0.74,0.07 1.10,0.14 0.35,0.04 0.67,0.10 0.96,0.17 0.30,0.04 0.53,0.09 0.67,0.14 l -0.57,2.88 c -0.26,-0.09 -0.70,-0.20 -1.31,-0.32 -0.59,-0.14 -1.36,-0.21 -2.31,-0.21 -0.61,0 -1.23,0.07 -1.85,0.21 -0.59,0.11 -0.98,0.20 -1.17,0.24 l 0,15.57 -3.31,0 0,-17.75 c 0.78,-0.28 1.75,-0.54 2.92,-0.78 1.16,-0.26 2.47,-0.39 3.92,-0.39 m -24.55,1.21 c 0.40,-0.26 1.00,-0.53 1.81,-0.81 0.83,-0.28 1.78,-0.42 2.85,-0.42 1.33,0 2.50,0.23 3.52,0.71 1.04,0.47 1.92,1.14 2.63,1.99 0.71,0.85 1.24,1.87 1.60,3.06 0.38,1.18 0.57,2.49 0.57,3.92 0,1.49 -0.22,2.85 -0.67,4.06 -0.42,1.18 -1.04,2.19 -1.85,3.02 -0.80,0.83 -1.78,1.47 -2.92,1.92 -1.14,0.45 -2.42,0.67 -3.84,0.67 -1.54,0 -2.91,-0.10 -4.09,-0.32 -1.18,-0.21 -2.16,-0.42 -2.92,-0.64 l 0,-26.55 3.31,-0.57 0,9.94 m 0,14.82 c 0.33,0.09 0.79,0.19 1.39,0.28 0.61,0.07 1.37,0.10 2.28,0.10 1.78,0 3.20,-0.58 4.27,-1.74 1.06,-1.18 1.60,-2.86 1.60,-5.02 0,-0.95 -0.09,-1.84 -0.28,-2.67 -0.19,-0.83 -0.49,-1.54 -0.92,-2.13 -0.42,-0.61 -0.98,-1.09 -1.67,-1.42 -0.66,-0.35 -1.47,-0.53 -2.42,-0.53 -0.90,0 -1.73,0.15 -2.49,0.46 -0.76,0.30 -1.34,0.62 -1.74,0.96 l 0,11.72 m -8.16,0.96 c 0,0.64 -0.21,1.2 -0.64,1.67 -0.42,0.47 -1.00,0.71 -1.74,0.71 -0.73,0 -1.31,-0.23 -1.74,-0.71 -0.42,-0.47 -0.64,-1.03 -0.64,-1.67 0,-0.64 0.21,-1.19 0.64,-1.67 0.42,-0.47 1.00,-0.71 1.74,-0.71 0.73,0 1.31,0.23 1.74,0.71 0.42,0.47 0.64,1.03 0.64,1.67 M 410.86,229.22 c 0.76,-0.19 1.75,-0.39 2.99,-0.60 1.25,-0.21 2.70,-0.32 4.34,-0.32 1.18,0 2.18,0.16 2.99,0.49 0.80,0.30 1.48,0.77 2.03,1.39 0.16,-0.11 0.42,-0.28 0.78,-0.49 0.35,-0.21 0.79,-0.41 1.31,-0.60 0.52,-0.21 1.10,-0.39 1.74,-0.53 0.64,-0.16 1.33,-0.24 2.06,-0.24 1.42,0 2.59,0.21 3.49,0.64 0.90,0.40 1.60,0.98 2.10,1.74 0.52,0.76 0.86,1.66 1.03,2.70 0.19,1.04 0.28,2.18 0.28,3.42 l 0,10.40 -3.31,0 0,-9.69 c 0,-1.09 -0.05,-2.03 -0.17,-2.81 -0.09,-0.78 -0.29,-1.43 -0.60,-1.96 -0.28,-0.52 -0.68,-0.90 -1.21,-1.14 -0.49,-0.26 -1.15,-0.39 -1.96,-0.39 -1.11,0 -2.04,0.15 -2.78,0.46 -0.71,0.28 -1.20,0.54 -1.46,0.78 0.19,0.61 0.33,1.29 0.42,2.03 0.09,0.73 0.14,1.50 0.14,2.31 l 0,10.40 -3.31,0 0,-9.69 c 0,-1.09 -0.05,-2.03 -0.17,-2.81 -0.11,-0.78 -0.33,-1.43 -0.64,-1.96 -0.28,-0.52 -0.68,-0.90 -1.21,-1.14 -0.49,-0.26 -1.14,-0.39 -1.92,-0.39 -0.33,0 -0.68,0.01 -1.06,0.03 -0.38,0.02 -0.74,0.05 -1.10,0.10 -0.33,0.02 -0.64,0.05 -0.92,0.10 -0.28,0.04 -0.47,0.08 -0.57,0.10 l 0,15.64 -3.31,0 0,-17.99 m -4.66,8.73 c 0,1.47 -0.21,2.80 -0.64,3.99 -0.42,1.18 -1.03,2.20 -1.81,3.06 -0.76,0.85 -1.67,1.52 -2.74,1.99 -1.06,0.45 -2.23,0.67 -3.49,0.67 -1.25,0 -2.42,-0.22 -3.49,-0.67 -1.06,-0.47 -1.99,-1.14 -2.78,-1.99 -0.76,-0.85 -1.35,-1.87 -1.78,-3.06 -0.42,-1.18 -0.64,-2.51 -0.64,-3.99 0,-1.44 0.21,-2.76 0.64,-3.95 0.42,-1.21 1.02,-2.24 1.78,-3.10 0.78,-0.85 1.71,-1.50 2.78,-1.96 1.06,-0.47 2.23,-0.71 3.49,-0.71 1.25,0 2.42,0.23 3.49,0.71 1.06,0.45 1.98,1.10 2.74,1.96 0.78,0.85 1.39,1.88 1.81,3.10 0.42,1.18 0.64,2.50 0.64,3.95 m -3.45,0 c 0,-2.09 -0.47,-3.74 -1.42,-4.95 -0.92,-1.23 -2.19,-1.85 -3.81,-1.85 -1.61,0 -2.89,0.61 -3.84,1.85 -0.92,1.21 -1.39,2.86 -1.39,4.95 0,2.09 0.46,3.75 1.39,4.99 0.95,1.21 2.23,1.81 3.84,1.81 1.61,0 2.88,-0.60 3.81,-1.81 0.95,-1.23 1.42,-2.89 1.42,-4.99 m -20.92,9.69 c -1.49,0 -2.81,-0.23 -3.95,-0.71 -1.11,-0.47 -2.06,-1.14 -2.85,-1.99 -0.76,-0.85 -1.33,-1.86 -1.71,-3.02 -0.38,-1.18 -0.57,-2.49 -0.57,-3.92 0,-1.42 0.20,-2.73 0.60,-3.92 0.42,-1.18 1.02,-2.20 1.78,-3.06 0.76,-0.87 1.68,-1.55 2.78,-2.03 1.11,-0.49 2.35,-0.74 3.70,-0.74 0.83,0 1.66,0.07 2.49,0.21 0.83,0.14 1.62,0.36 2.38,0.67 l -0.74,2.81 c -0.49,-0.23 -1.08,-0.42 -1.74,-0.57 -0.64,-0.14 -1.33,-0.21 -2.06,-0.21 -1.85,0 -3.27,0.58 -4.27,1.74 -0.97,1.16 -1.46,2.86 -1.46,5.09 0,0.99 0.10,1.91 0.32,2.74 0.23,0.83 0.59,1.54 1.06,2.13 0.49,0.59 1.12,1.05 1.88,1.39 0.76,0.30 1.68,0.46 2.78,0.46 0.87,0 1.67,-0.08 2.38,-0.24 0.71,-0.16 1.27,-0.34 1.67,-0.53 l 0.46,2.78 c -0.19,0.11 -0.46,0.23 -0.81,0.35 -0.35,0.09 -0.76,0.17 -1.21,0.24 -0.45,0.09 -0.93,0.16 -1.46,0.21 -0.49,0.07 -0.98,0.10 -1.46,0.10 m -12.90,-2.35 c 0,0.64 -0.21,1.2 -0.64,1.67 -0.42,0.47 -1.00,0.71 -1.74,0.71 -0.73,0 -1.31,-0.23 -1.74,-0.71 -0.42,-0.47 -0.64,-1.03 -0.64,-1.67 0,-0.64 0.21,-1.19 0.64,-1.67 0.42,-0.47 1.00,-0.71 1.74,-0.71 0.73,0 1.31,0.23 1.74,0.71 0.42,0.47 0.64,1.03 0.64,1.67 m -8.10,2.28 c -2.04,-0.04 -3.49,-0.48 -4.34,-1.31 -0.85,-0.83 -1.28,-2.12 -1.28,-3.88 l 0,-22.24 3.31,-0.57 0,22.27 c 0,0.54 0.04,0.99 0.14,1.35 0.09,0.35 0.24,0.64 0.46,0.85 0.21,0.21 0.49,0.38 0.85,0.49 0.35,0.09 0.79,0.17 1.31,0.24 l -0.46,2.78 m -18.13,-12.58 8.80,0 0,3.10 -8.80,0 0,-3.10 m -9.63,9.83 c 1.35,0 2.35,-0.17 2.99,-0.53 0.66,-0.35 0.99,-0.92 0.99,-1.71 0,-0.80 -0.32,-1.44 -0.96,-1.92 -0.64,-0.47 -1.69,-1.00 -3.17,-1.60 -0.71,-0.28 -1.40,-0.57 -2.06,-0.85 -0.64,-0.30 -1.20,-0.66 -1.67,-1.06 -0.47,-0.40 -0.85,-0.89 -1.14,-1.46 -0.28,-0.57 -0.42,-1.27 -0.42,-2.10 0,-1.63 0.60,-2.93 1.81,-3.88 1.21,-0.97 2.86,-1.46 4.95,-1.46 0.52,0 1.04,0.03 1.56,0.10 0.52,0.04 1.00,0.11 1.46,0.21 0.45,0.07 0.84,0.15 1.17,0.24 0.35,0.09 0.62,0.17 0.81,0.24 l -0.60,2.85 c -0.35,-0.19 -0.91,-0.38 -1.67,-0.57 -0.76,-0.21 -1.67,-0.32 -2.74,-0.32 -0.92,0 -1.73,0.19 -2.42,0.57 -0.68,0.35 -1.03,0.92 -1.03,1.71 0,0.40 0.07,0.76 0.21,1.06 0.16,0.30 0.40,0.59 0.71,0.85 0.33,0.23 0.73,0.46 1.21,0.67 0.47,0.21 1.04,0.43 1.71,0.67 0.87,0.33 1.66,0.66 2.35,0.99 0.68,0.30 1.27,0.67 1.74,1.10 0.49,0.42 0.87,0.95 1.14,1.56 0.26,0.59 0.39,1.33 0.39,2.20 0,1.71 -0.64,3.00 -1.92,3.88 -1.25,0.87 -3.06,1.31 -5.41,1.31 -1.63,0 -2.92,-0.14 -3.84,-0.42 -0.92,-0.26 -1.55,-0.46 -1.88,-0.60 l 0.60,-2.85 c 0.38,0.14 0.98,0.35 1.81,0.64 0.83,0.28 1.93,0.42 3.31,0.42 m -16.62,0 c 0.78,0 1.47,-0.01 2.06,-0.03 0.61,-0.04 1.12,-0.11 1.53,-0.21 l 0,-5.52 c -0.23,-0.11 -0.62,-0.21 -1.17,-0.28 -0.52,-0.09 -1.16,-0.14 -1.92,-0.14 -0.49,0 -1.03,0.03 -1.60,0.10 -0.54,0.07 -1.05,0.22 -1.53,0.46 -0.45,0.21 -0.83,0.52 -1.14,0.92 -0.30,0.38 -0.46,0.89 -0.46,1.53 0,1.18 0.38,2.01 1.14,2.49 0.76,0.45 1.79,0.67 3.10,0.67 m -0.28,-16.60 c 1.33,0 2.44,0.17 3.35,0.53 0.92,0.33 1.66,0.81 2.20,1.46 0.57,0.61 0.97,1.36 1.21,2.24 0.23,0.85 0.35,1.80 0.35,2.85 l 0,11.58 c -0.28,0.04 -0.68,0.11 -1.21,0.21 -0.49,0.07 -1.06,0.14 -1.71,0.21 -0.64,0.07 -1.34,0.13 -2.10,0.17 -0.73,0.07 -1.47,0.10 -2.20,0.10 -1.04,0 -2.00,-0.10 -2.88,-0.32 -0.87,-0.21 -1.63,-0.54 -2.28,-0.99 -0.64,-0.47 -1.14,-1.09 -1.49,-1.85 -0.35,-0.76 -0.53,-1.67 -0.53,-2.74 0,-1.02 0.20,-1.90 0.60,-2.63 0.42,-0.73 0.99,-1.33 1.71,-1.78 0.71,-0.45 1.54,-0.78 2.49,-0.99 0.95,-0.21 1.94,-0.32 2.99,-0.32 0.33,0 0.67,0.02 1.03,0.07 0.35,0.02 0.68,0.07 0.99,0.14 0.33,0.04 0.61,0.09 0.85,0.14 0.23,0.04 0.40,0.08 0.49,0.10 l 0,-0.92 c 0,-0.54 -0.05,-1.08 -0.17,-1.60 -0.11,-0.54 -0.33,-1.02 -0.64,-1.42 -0.30,-0.42 -0.73,-0.76 -1.28,-0.99 -0.52,-0.26 -1.21,-0.39 -2.06,-0.39 -1.09,0 -2.05,0.08 -2.88,0.24 -0.80,0.14 -1.41,0.29 -1.81,0.46 l -0.39,-2.74 c 0.42,-0.19 1.14,-0.36 2.13,-0.53 0.99,-0.19 2.07,-0.28 3.24,-0.28 m -14.50,19.42 c -1.49,0 -2.81,-0.23 -3.95,-0.71 -1.11,-0.47 -2.06,-1.14 -2.85,-1.99 -0.76,-0.85 -1.33,-1.86 -1.71,-3.02 -0.38,-1.18 -0.57,-2.49 -0.57,-3.92 0,-1.42 0.20,-2.73 0.60,-3.92 0.42,-1.18 1.02,-2.20 1.78,-3.06 0.76,-0.87 1.68,-1.55 2.78,-2.03 1.11,-0.49 2.35,-0.74 3.70,-0.74 0.83,0 1.66,0.07 2.49,0.21 0.83,0.14 1.62,0.36 2.38,0.67 l -0.74,2.81 c -0.49,-0.23 -1.08,-0.42 -1.74,-0.57 -0.64,-0.14 -1.33,-0.21 -2.06,-0.21 -1.85,0 -3.27,0.58 -4.27,1.74 -0.97,1.16 -1.46,2.86 -1.46,5.09 0,0.99 0.10,1.91 0.32,2.74 0.23,0.83 0.59,1.54 1.06,2.13 0.49,0.59 1.12,1.05 1.88,1.39 0.76,0.30 1.68,0.46 2.78,0.46 0.87,0 1.67,-0.08 2.38,-0.24 0.71,-0.16 1.27,-0.34 1.67,-0.53 l 0.46,2.78 c -0.19,0.11 -0.46,0.23 -0.81,0.35 -0.35,0.09 -0.76,0.17 -1.21,0.24 -0.45,0.09 -0.93,0.16 -1.46,0.21 -0.49,0.07 -0.98,0.10 -1.46,0.10 m -13.79,-0.42 -3.31,0 0,-18.53 3.31,0 0,18.53 m -1.67,-21.88 c -0.59,0 -1.10,-0.19 -1.53,-0.57 -0.40,-0.40 -0.60,-0.93 -0.60,-1.60 0,-0.66 0.20,-1.18 0.60,-1.56 0.42,-0.40 0.93,-0.60 1.53,-0.60 0.59,0 1.09,0.20 1.49,0.60 0.42,0.38 0.64,0.90 0.64,1.56 0,0.66 -0.21,1.20 -0.64,1.60 -0.40,0.38 -0.90,0.57 -1.49,0.57 m -10.68,7.27 c -0.40,-0.33 -0.98,-0.65 -1.74,-0.96 -0.76,-0.30 -1.59,-0.46 -2.49,-0.46 -0.95,0 -1.77,0.17 -2.45,0.53 -0.66,0.33 -1.21,0.80 -1.63,1.42 -0.42,0.59 -0.73,1.30 -0.92,2.13 -0.19,0.83 -0.28,1.72 -0.28,2.67 0,2.16 0.53,3.83 1.60,5.02 1.06,1.16 2.49,1.74 4.27,1.74 0.90,0 1.65,-0.03 2.24,-0.10 0.61,-0.09 1.09,-0.19 1.42,-0.28 l 0,-11.72 m 0,-12.47 3.31,-0.57 0,27.12 c -0.76,0.21 -1.73,0.42 -2.92,0.64 -1.18,0.21 -2.55,0.32 -4.09,0.32 -1.42,0 -2.70,-0.22 -3.84,-0.67 -1.14,-0.45 -2.11,-1.09 -2.92,-1.92 -0.80,-0.83 -1.43,-1.84 -1.88,-3.02 -0.42,-1.21 -0.64,-2.56 -0.64,-4.06 0,-1.42 0.17,-2.73 0.53,-3.92 0.38,-1.18 0.92,-2.20 1.63,-3.06 0.71,-0.85 1.58,-1.52 2.60,-1.99 1.04,-0.47 2.23,-0.71 3.56,-0.71 1.06,0 2.00,0.14 2.81,0.42 0.83,0.28 1.44,0.55 1.85,0.81 l 0,-9.37 m -16.82,25.16 c 0,0.64 -0.21,1.2 -0.64,1.67 -0.42,0.47 -1.00,0.71 -1.74,0.71 -0.73,0 -1.31,-0.23 -1.74,-0.71 -0.42,-0.47 -0.64,-1.03 -0.64,-1.67 0,-0.64 0.21,-1.19 0.64,-1.67 0.42,-0.47 1.00,-0.71 1.74,-0.71 0.73,0 1.31,0.23 1.74,0.71 0.42,0.47 0.64,1.03 0.64,1.67 m -15.36,1.92 c -0.66,-1.71 -1.37,-3.65 -2.13,-5.84 -0.73,-2.20 -1.41,-4.50 -2.03,-6.87 -0.61,2.37 -1.29,4.66 -2.03,6.87 -0.73,2.18 -1.43,4.13 -2.10,5.84 l -2.88,0 c -1.09,-2.44 -2.16,-5.23 -3.20,-8.37 -1.04,-3.13 -2.03,-6.52 -2.95,-10.15 l 3.56,0 c 0.23,1.11 0.52,2.32 0.85,3.63 0.33,1.30 0.67,2.61 1.03,3.92 0.38,1.30 0.77,2.56 1.17,3.77 0.40,1.21 0.78,2.26 1.14,3.17 0.40,-1.11 0.79,-2.29 1.17,-3.52 0.40,-1.25 0.78,-2.51 1.14,-3.77 0.35,-1.28 0.68,-2.53 0.99,-3.74 0.33,-1.23 0.61,-2.38 0.85,-3.45 l 2.74,0 c 0.21,1.06 0.47,2.22 0.78,3.45 0.30,1.21 0.64,2.45 0.99,3.74 0.35,1.25 0.72,2.51 1.10,3.77 0.40,1.23 0.80,2.41 1.21,3.52 0.35,-0.90 0.72,-1.96 1.10,-3.17 0.40,-1.21 0.79,-2.47 1.17,-3.77 0.38,-1.30 0.73,-2.61 1.06,-3.92 0.33,-1.30 0.61,-2.51 0.85,-3.63 l 3.42,0 c -0.92,3.63 -1.91,7.02 -2.95,10.15 -1.04,3.13 -2.11,5.92 -3.20,8.37 l -2.88,0 m -28.33,0 c -0.66,-1.71 -1.37,-3.65 -2.13,-5.84 -0.73,-2.20 -1.41,-4.50 -2.03,-6.87 -0.61,2.37 -1.29,4.66 -2.03,6.87 -0.73,2.18 -1.43,4.13 -2.10,5.84 l -2.88,0 c -1.09,-2.44 -2.16,-5.23 -3.20,-8.37 -1.04,-3.13 -2.03,-6.52 -2.95,-10.15 l 3.56,0 c 0.23,1.11 0.52,2.32 0.85,3.63 0.33,1.30 0.67,2.61 1.03,3.92 0.38,1.30 0.77,2.56 1.17,3.77 0.40,1.21 0.78,2.26 1.14,3.17 0.40,-1.11 0.79,-2.29 1.17,-3.52 0.40,-1.25 0.78,-2.51 1.14,-3.77 0.35,-1.28 0.68,-2.53 0.99,-3.74 0.33,-1.23 0.61,-2.38 0.85,-3.45 l 2.74,0 c 0.21,1.06 0.47,2.22 0.78,3.45 0.30,1.21 0.64,2.45 0.99,3.74 0.35,1.25 0.72,2.51 1.10,3.77 0.40,1.23 0.80,2.41 1.21,3.52 0.35,-0.90 0.72,-1.96 1.10,-3.17 0.40,-1.21 0.79,-2.47 1.17,-3.77 0.38,-1.30 0.73,-2.61 1.06,-3.92 0.33,-1.30 0.61,-2.51 0.85,-3.63 l 3.42,0 c -0.92,3.63 -1.91,7.02 -2.95,10.15 -1.04,3.13 -2.11,5.92 -3.20,8.37 l -2.88,0 m -28.33,0 c -0.66,-1.71 -1.37,-3.65 -2.13,-5.84 -0.73,-2.20 -1.41,-4.50 -2.03,-6.87 -0.61,2.37 -1.29,4.66 -2.03,6.87 -0.73,2.18 -1.43,4.13 -2.10,5.84 l -2.88,0 c -1.09,-2.44 -2.16,-5.23 -3.20,-8.37 -1.04,-3.13 -2.03,-6.52 -2.95,-10.15 l 3.56,0 c 0.23,1.11 0.52,2.32 0.85,3.63 0.33,1.30 0.67,2.61 1.03,3.92 0.38,1.30 0.77,2.56 1.17,3.77 0.40,1.21 0.78,2.26 1.14,3.17 0.40,-1.11 0.79,-2.29 1.17,-3.52 0.40,-1.25 0.78,-2.51 1.14,-3.77 0.35,-1.28 0.68,-2.53 0.99,-3.74 0.33,-1.23 0.61,-2.38 0.85,-3.45 l 2.74,0 c 0.21,1.06 0.47,2.22 0.78,3.45 0.30,1.21 0.64,2.45 0.99,3.74 0.35,1.25 0.72,2.51 1.10,3.77 0.40,1.23 0.80,2.41 1.21,3.52 0.35,-0.90 0.72,-1.96 1.10,-3.17 0.40,-1.21 0.79,-2.47 1.17,-3.77 0.38,-1.30 0.73,-2.61 1.06,-3.92 0.33,-1.30 0.61,-2.51 0.85,-3.63 l 3.42,0 c -0.92,3.63 -1.91,7.02 -2.95,10.15 -1.04,3.13 -2.11,5.92 -3.20,8.37 l -2.88,0" />
</g>

</svg>
