<svg
 xmlns="http://www.w3.org/2000/svg"
 width="269.99442"
 height="189.87917"
>
  <path
   id="fig"
   d="m 269.79975,10.685152 v 0 c -1.78,-5.7439999 -11.059,-9.3949999 -20.997,-10.38299995 -12.215,-1.223 -27.83999,1.32100005 -41.43199,6.95900005 -10.324,4.2829999 -19.889,9.6139999 -29.721,17.3469999 -15.463,12.154 -23.654,21.936 -27.796,27.4 -3.347,4.413 -4.059,9.449 -7.13,11.768 -0.155,-1.163 0.258,-4.226 -1.739,-5.387 -0.588,-0.341 -1.249,-0.736 -1.913,-1.123 0.748,-3.086 4.615,-17.909 10.821,-26.413 7.539,-10.349 15.965,-16.273 17.062,-16.954 1.333,-0.841 2.749,-0.906 3.678,-1.487 0.705,-0.437 1.175,-2.367 0.789,-2.5789999 -1.432,-0.783 -3.023,0.9099999 -4.014,1.9869999 -1.045,1.142 -11.975,8.63 -18.662,18.378 -6.25,9.104 -10.191,23.66 -10.9,26.399 -1.17,-0.627 -2.244,-1.112 -2.847,-1.112 -0.544,0 -1.467,0.395 -2.486,0.917 -0.816,-3.171 -4.734,-17.417 -10.845,-26.339 -6.688,-9.745 -17.621,-17.101 -18.667,-18.243 -0.979,-1.077 -2.575,-2.7699999 -4.003004,-1.9869999 -0.402,0.2109999 0.073,2.1419999 0.778,2.5789999 0.936004,0.581 2.340004,0.646 3.683004,1.487 1.091,0.68 9.514,6.475 17.057,16.816 6.077,8.331 9.904,22.818 10.782,26.341 -0.794,0.453 -1.6,0.929 -2.301,1.332 -1.979,1.161 -1.572,4.225 -1.734,5.387 -2.77,-1.487 -5.003,-7.965 -9.059,-13.975 -4.31,-6.413 -10.397,-13.039 -25.848004,-25.193 -9.851,-7.732 -19.408,-13.064 -29.727,-17.3469999 -13.592,-5.639 -29.222,-8.18300005 -41.437,-6.95900005 C 11.240756,1.2901521 1.9517562,4.9411521 0.19375617,10.684152 c -1.36499997,4.454 4.73400003,18.271 10.38699983,26.297 4.203,5.967 5.081,12.863 6.631,19.667 2.211,9.724 6.223,24.234 17.248,27.843 10.095,3.318 29.826,-2.649 29.826,-2.649 0,0 0.433,3.533 -6.193,6.185 -6.896,2.763 -10.617,7.07 -14.585,14.583998 -3.563,6.74 -6.402,15.777 -6.402,19.768 0,6.187 1.545,8.397 1.316,11.268 -0.268,3.554 0.996,7.071 3.436,9.721 2.737,3 1.65,5.635 2.872,8.951 1.102,2.996 5.411,5.416 5.411,5.416 0,0 -0.487,6.78 4.422,11.271 3.966,3.642 8.461,6.021 11.382,8.611 2.971,2.658 5.192,4.76 11.594,5.973 3.69,0.701 5.972,6.706 13.7,6.266 8.388,-0.48 8.366,-0.14 13.710004,-2.327 8.607,-3.531 12.457,-20.199 16.123,-36.296 2.881,-12.602 5.086,-20.421 8.896,-23.067 -1.081,7.376 0.533,19.634 0.533,19.634 0,0 -1.169,6.293 -0.09,7.375 -0.499,3.233 0.504,7.656 1.051,7.547 0.224,2.642 1.602,7.447 3.539,7.447 1.935,0 3.318,-4.806 3.529,-7.447 0.561,0.109 1.551,-4.313 1.057,-7.547 1.076,-1.082 -0.088,-7.375 -0.088,-7.375 0,0 1.489,-11.51 0.498,-19.797 3.402,1.734 6.049,10.629 8.921,23.23 3.676,16.097 7.521,32.765 16.138,36.296 5.332,2.188 5.317,-0.034 13.699,0.444 7.734,0.441 10.012,-6.875 13.699,-7.568 6.413,-1.217 8.623,-3.315 11.6,-5.969 2.934,-2.596 7.404,-4.973 11.389,-8.617 4.891,-4.492 4.41,-11.274 4.41,-11.274 0,0 4.33199,-2.429 5.42799,-5.415 1.197,-3.313 0.117,-5.951 2.86,-8.949 2.433,-2.648 3.704,-6.167 3.424,-9.72 -0.218,-2.874 1.337,-5.085 1.337,-11.268 0,-3.99 -2.848,-9.841 -6.424,-16.581 -3.972,-7.513998 -7.67799,-11.820998 -14.57699,-14.583998 -6.626,-2.652 -6.185,-6.185 -6.185,-6.185 0,0 19.71099,5.967 29.83799,2.649 11.009,-3.609 15.027,-18.119 17.232,-27.843 1.549,-6.804 2.433,-13.701 6.629,-19.667 5.64,-8.027 11.755,-21.843 10.385,-26.297 z"
  />
</svg>
