<?xml version="1.0" encoding="iso-8859-1"?>
<!-- Generator: Adobe Illustrator 18.0.0, SVG Export Plug-In . SVG Version: 6.00 Build 0)  -->
<!DOCTYPE svg PUBLIC "-//W3C//DTD SVG 1.1//EN" "http://www.w3.org/Graphics/SVG/1.1/DTD/svg11.dtd">
<svg version="1.1" id="Capa_1" xmlns="http://www.w3.org/2000/svg" xmlns:xlink="http://www.w3.org/1999/xlink" x="0px" y="0px"
	 viewBox="0 0 493.249 493.249" style="enable-background:new 0 0 493.249 493.249;" xml:space="preserve">
<path d="M463.007,168.49c0-28.703-33.46-51.188-76.174-51.188c-18.346,0-35.576,4.216-49.249,11.953
	c-13.401-9.919-28.469-17.705-44.7-22.856c6.058-13.7,9.44-29.27,9.44-44.106C302.323,19.261,274.349,0,246.625,0
	s-55.699,19.261-55.699,62.292c0,14.836,3.383,30.406,9.44,44.106c-16.231,5.152-31.299,12.938-44.7,22.857
	c-13.674-7.737-30.904-11.954-49.249-11.954c-42.715,0-76.175,22.484-76.175,51.188c0,13.253,10.782,22.164,32.047,26.485
	c12.216,2.482,27.183,3.384,40.87,3.714c-6.298,16.744-9.754,34.868-9.754,53.787c0,24.754,5.938,52.82,16.436,80.015
	c-8.104,2.426-16.193,5.903-23.818,10.306c-17.027,9.83-30.687,23.381-38.463,38.157c-8.446,16.049-9.126,31.767-1.913,44.26
	c2.842,4.922,7.37,8.331,13.094,9.856c2.395,0.638,4.977,0.941,7.73,0.941c19.806,0,48.526-15.642,80.912-34.457
	c0.346-0.201,0.679-0.394,1.021-0.593c26.628,33.774,57.808,53.408,89.722,56.382v27.408c0,4.694,3.806,8.5,8.5,8.5
	c4.694,0,8.5-3.806,8.5-8.5v-27.408c31.914-2.974,63.094-22.607,89.721-56.382c0.343,0.199,0.677,0.393,1.023,0.594
	c32.387,18.815,61.104,34.456,80.91,34.456c2.752,0,5.336-0.302,7.73-0.94c5.724-1.525,10.252-4.934,13.094-9.856
	c14.351-24.858-3.385-61.06-40.376-82.416c-7.626-4.403-15.715-7.88-23.818-10.307c10.497-27.194,16.435-55.26,16.435-80.015
	c0-18.919-3.456-37.042-9.754-53.787c13.688-0.331,28.653-1.232,40.87-3.714C452.225,190.654,463.007,181.743,463.007,168.49z
	 M382.844,252.476c0,3.003-0.11,6.077-0.306,9.2h-63.661l-29.605-51.278l53.91-53.91
	C367.681,181.13,382.844,215.064,382.844,252.476z M341.784,376.22l-50.758-50.758l27.012-46.786h62.58
	C375.449,310.854,361.534,346.538,341.784,376.22z M112.518,277.981h62.293l27.413,47.479l-50.759,50.759
	C131.574,346.325,117.597,310.34,112.518,277.981z M110.405,252.476c0-36.355,14.316-69.428,37.606-93.881l54.442,54.442
	l-27.681,47.944h-64.103C110.501,258.098,110.405,255.256,110.405,252.476z M246.625,116.256c31.587,0,60.696,10.81,83.827,28.92
	l-57.812,57.813h-56.193l-55.958-55.959C183.976,127.807,213.976,116.256,246.625,116.256z M218.07,318.907l-28.556-49.459
	l28.556-49.459h57.11l28.555,49.459l-28.555,49.459H218.07z M207.926,62.292c0-27.938,14.829-45.292,38.699-45.292
	s38.698,17.355,38.698,45.292c0,13.275-3.384,27.74-9.191,39.826c-9.552-1.871-19.415-2.862-29.507-2.862
	c-10.092,0-19.955,0.991-29.507,2.862C211.31,90.031,207.926,75.567,207.926,62.292z M65.674,178.315
	c-11.542-2.345-18.432-6.018-18.432-9.825c0-18.532,27.099-34.188,59.175-34.188c12.666,0,24.903,2.444,35.035,6.858
	c-12.375,11.699-22.804,25.432-30.752,40.66C96.007,181.647,78.785,180.979,65.674,178.315z M66.876,419.08
	c-1.383,0-2.644-0.141-3.758-0.438c-1.699-0.453-2.325-1.195-2.749-1.929c-4.19-7.256-3.397-17.145,2.234-27.842
	c6.301-11.972,17.636-23.105,31.92-31.352c7.061-4.077,14.547-7.218,21.969-9.265c5.949,12.995,12.908,25.592,20.732,37.305
	c0.361,0.541,0.729,1.065,1.092,1.6C117.117,399.474,83.236,419.082,66.876,419.08z M246.625,440.753
	c-32.18,0-61.76-20.875-85.077-50.575l54.271-54.271h61.611l54.272,54.271C308.385,419.878,278.805,440.753,246.625,440.753z
	 M398.727,357.519c27.779,16.038,43.419,43.145,34.154,59.194c-0.424,0.734-1.051,1.477-2.749,1.929
	c-14.29,3.806-52.207-18.127-75.199-31.483c0.363-0.536,0.731-1.059,1.092-1.6c7.824-11.712,14.783-24.31,20.732-37.305
	C384.179,350.3,391.666,353.442,398.727,357.519z M382.549,181.82c-7.948-15.228-18.376-28.962-30.752-40.66
	c10.132-4.414,22.37-6.858,35.036-6.858c32.076,0,59.174,15.656,59.174,34.188c0,3.808-6.89,7.48-18.432,9.825
	C414.464,180.979,397.242,181.647,382.549,181.82z"/>
<g>
</g>
<g>
</g>
<g>
</g>
<g>
</g>
<g>
</g>
<g>
</g>
<g>
</g>
<g>
</g>
<g>
</g>
<g>
</g>
<g>
</g>
<g>
</g>
<g>
</g>
<g>
</g>
<g>
</g>
</svg>
