<?xml version="1.0" encoding="UTF-8" standalone="no"?>
<!-- Generator: Adobe Illustrator 18.0.0, SVG Export Plug-In . SVG Version: 6.00 Build 0)  -->

<svg
   xmlns:dc="http://purl.org/dc/elements/1.1/"
   xmlns:cc="http://creativecommons.org/ns#"
   xmlns:rdf="http://www.w3.org/1999/02/22-rdf-syntax-ns#"
   xmlns:svg="http://www.w3.org/2000/svg"
   xmlns="http://www.w3.org/2000/svg"
   xmlns:sodipodi="http://sodipodi.sourceforge.net/DTD/sodipodi-0.dtd"
   xmlns:inkscape="http://www.inkscape.org/namespaces/inkscape"
   version="1.1"
   id="Capa_1"
   x="0px"
   y="0px"
   viewBox="0 0 166.05499 330.43601"
   xml:space="preserve"
   sodipodi:docname="snake3.svg"
   width="166.05499"
   height="330.436"
   inkscape:version="0.92.4 (unknown)"><metadata
   id="metadata39"><rdf:RDF><cc:Work
       rdf:about=""><dc:format>image/svg+xml</dc:format><dc:type
         rdf:resource="http://purl.org/dc/dcmitype/StillImage" /><dc:title /></cc:Work></rdf:RDF></metadata><defs
   id="defs37" /><sodipodi:namedview
   pagecolor="#ffffff"
   bordercolor="#666666"
   borderopacity="1"
   objecttolerance="10"
   gridtolerance="10"
   guidetolerance="10"
   inkscape:pageopacity="0"
   inkscape:pageshadow="2"
   inkscape:window-width="1600"
   inkscape:window-height="851"
   id="namedview35"
   showgrid="false"
   showborder="false"
   fit-margin-top="0"
   fit-margin-left="0"
   fit-margin-right="0"
   fit-margin-bottom="0"
   inkscape:zoom="1.9519665"
   inkscape:cx="-5.8572262"
   inkscape:cy="165.218"
   inkscape:window-x="0"
   inkscape:window-y="24"
   inkscape:window-maximized="1"
   inkscape:current-layer="Capa_1" />
<path
   d="m 32.594,42.31 c 0,23.619 11.185,29.959 11.185,34.123 0,4.164 0,8.184 0,8.184 0,0.556 0.029,1.103 0.083,1.645 0.861,26.36 22.107,47.604 48.469,48.466 0.539,0.054 1.088,0.082 1.642,0.082 h 21.89 c 9.973,0 18.088,8.113 18.088,18.086 0,9.974 -8.115,18.088 -18.088,18.088 h -65.67 c -0.553,0 -1.103,0.028 -1.642,0.084 C 21.639,171.946 0,194.055 0,221.177 c 0,27.122 21.639,49.231 48.551,50.109 0.538,0.054 1.089,0.082 1.642,0.082 h 21.89 c 9.973,0 18.084,8.115 18.084,18.087 v 22.01 c -0.001,8.866 7.188,18.971 16.052,18.971 8.865,0 16.053,-10.105 16.053,-18.972 v -22.01 c 0,-0.555 -0.028,-1.102 -0.082,-1.645 -0.861,-26.36 -22.104,-47.604 -48.466,-48.465 -0.539,-0.055 -1.088,-0.083 -1.642,-0.083 h -21.89 c -9.973,0 -18.088,-8.113 -18.088,-18.086 0,-9.973 8.115,-18.087 18.088,-18.087 h 65.67 c 0.553,0 1.104,-0.028 1.642,-0.084 26.912,-0.877 48.551,-22.987 48.551,-50.109 0,-27.122 -21.639,-49.231 -48.551,-50.109 -0.538,-0.054 -1.088,-0.083 -1.642,-0.083 h -21.89 c -9.973,0 -18.087,-8.115 -18.087,-18.087 0,0 0,-4.02 0,-8.184 0,-4.164 11.185,-10.504 11.185,-34.123 C 87.07,18.943 74.876,0 59.833,0 44.788,0.001 32.594,18.943 32.594,42.31 Z"
   id="path2"
   inkscape:connector-curvature="0" />















</svg>