<?xml version="1.0" encoding="UTF-8" standalone="no"?>
<svg
   xmlns:dc="http://purl.org/dc/elements/1.1/"
   xmlns:cc="http://creativecommons.org/ns#"
   xmlns:rdf="http://www.w3.org/1999/02/22-rdf-syntax-ns#"
   xmlns:svg="http://www.w3.org/2000/svg"
   xmlns="http://www.w3.org/2000/svg"
   xmlns:sodipodi="http://sodipodi.sourceforge.net/DTD/sodipodi-0.dtd"
   xmlns:inkscape="http://www.inkscape.org/namespaces/inkscape"
   id="Layer_1"
   height="485.12131"
   viewBox="0 0 241.84538 485.12131"
   width="241.84538"
   data-name="Layer 1"
   version="1.1"
   sodipodi:docname="snake2.svg"
   inkscape:version="0.92.4 (unknown)">
  <metadata
     id="metadata15">
    <rdf:RDF>
      <cc:Work
         rdf:about="">
        <dc:format>image/svg+xml</dc:format>
        <dc:type
           rdf:resource="http://purl.org/dc/dcmitype/StillImage" />
        <dc:title></dc:title>
      </cc:Work>
    </rdf:RDF>
  </metadata>
  <defs
     id="defs13" />
  <sodipodi:namedview
     pagecolor="#ffffff"
     bordercolor="#666666"
     borderopacity="1"
     objecttolerance="10"
     gridtolerance="10"
     guidetolerance="10"
     inkscape:pageopacity="0"
     inkscape:pageshadow="2"
     inkscape:window-width="1600"
     inkscape:window-height="851"
     id="namedview11"
     showgrid="false"
     showborder="false"
     fit-margin-top="0"
     fit-margin-left="0"
     fit-margin-right="0"
     fit-margin-bottom="0"
     inkscape:zoom="1.3295644"
     inkscape:cx="120.92269"
     inkscape:cy="242.56065"
     inkscape:window-x="0"
     inkscape:window-y="24"
     inkscape:window-maximized="1"
     inkscape:current-layer="Layer_1" />
  <g
     id="g21"
     transform="translate(-135.07683,-13.438693)">
    <path
       id="path2"
       d="m 361.09,172.04 c 10.77,9.38 16.38,23.01 15.79,38.39 -0.57,14.6 -8.71,28.2 -22.35,37.32 -6.89,4.61 -18.23,9.95 -35.05,11.61 a 53.263,53.263 0 0 1 10.68,5.48 c 17.64,11.73 23.19,30.55 22.58,43.1 -0.78,15.88 -7.71,29.82 -19.52,39.24 -16.48,13.17 -41.35,16.91 -73.89,11.16 -17.54,-3.09 -25.61,0.13 -26.56,1.65 a 5.23,5.23 0 0 0 1.94,4.11 c 3.87,3.24 8.02,5.3 12.83,7.67 20.29,10.04 43.07,29.49 36.46,65.19 -1.78,9.56 -3.46,16.65 -5.59,25.63 l -1.98,8.47 c -3.52,15.37 -6.3,27.5 -15.32,27.5 -9.79,0 -12.29,-14.02 -14.77,-33.83 -0.92,-7.44 -2.05,-23.75 -2.05,-27.33 0,-18.78 -4.78,-21.14 -15.25,-26.31 -6.8,-3.36 -14.34,-7.08 -22.21,-13.66 -16.43,-13.76 -22.08,-37.23 -13.43,-55.8 a 45.99,45.99 0 0 1 22.31,-21.97 c -18.8,-0.02 -36.62,-5.31 -51.55,-15.8 -19.76,-13.89 -30.82,-34.57 -28.86,-53.97 1.91,-18.97 11.62,-34.84 27.36,-44.67 22.1,-13.8 52.89,-14.27 91.65,-1.4 q 4.005,1.335 8.13,2.85 c 46.25,17.06 64.7,7.14 67.94,4.97 2.65,-1.77 3.12,-3.16 3.13,-3.17 0.04,-1.74 -0.27,-3.08 -0.96,-3.68 -0.28,-0.25 -7.51,-6.2 -35.21,-1.29 -16.62,2.97 -30.8,2.45 -42.38,-1.53 a 48.812,48.812 0 0 1 -15.59,-8.7 c -7.73,-6.48 -16.93,-18.56 -16.93,-39.37 v -20 c -9.31,-8.16 -22.47,-20.59 -22.47,-48.05 a 76.155,76.155 0 0 1 1.7,-15.69 l 0.1,-0.13 a 8.844,8.844 0 1 0 5.4,-15.85 c -0.2,0 -0.39,0.01 -0.58,0.02 v -0.02 c 7.32,-18.04 19.1,-32.42 26.9,-37.55 a 19.433,19.433 0 0 1 21.34,0 c 7.84,5.16 19.72,19.68 27.03,37.87 a 8.732,8.732 0 0 0 -2.36,-0.32 8.845,8.845 0 1 0 6.82,14.47 77.266,77.266 0 0 1 2.03,17.2 c 0,27.45 -13.15,39.88 -22.47,48.05 v 20 c 0,4.56 1.06,5.79 1.38,6.07 0.05,0.04 4.89,3.89 22.46,0.77 a 153.53,153.53 0 0 1 26.83,-2.6 c 19,0 33.92,4.65 44.54,13.9 z m -52.32,134.84 c -0.01,-0.01 0.26,-3.93 -2.67,-5.88 -1.84,-1.21 -12.43,-6.61 -40.74,6.91 a 127.216,127.216 0 0 1 -14.3,5.81 125.863,125.863 0 0 1 15.82,1.84 c 26.84,4.73 36.38,-0.04 39.23,-2.33 2.01,-1.61 2.5,-2.97 2.66,-6.35 z m -27.89,-49.87 a 218.008,218.008 0 0 1 -33.47,-9.59 c -19.59,-7.22 -33.54,-9.44 -43.3,-9.44 -10.14,0 -15.74,2.39 -18.42,4.07 -4.22,2.64 -7.79,5.52 -7.17,12.18 0.15,1.6 2.2,8.16 10.63,14.09 7.09,4.98 26.89,15 57.48,0.39 12.89,-6.15 24.26,-9.83 34.25,-11.7 z"
       inkscape:connector-curvature="0"
       style="fill:#00acea" />
    <g
       id="g8"
       style="fill:#00efd1">
      <path
         id="path4"
         d="m 281.86,54.5 a 8.843,8.843 0 1 1 -2.36,-0.32 8.732,8.732 0 0 1 2.36,0.32 z"
         inkscape:connector-curvature="0" />
      <path
         id="path6"
         d="m 207.17,54.18 a 8.855,8.855 0 1 1 -0.58,0.02 c 0.19,-0.01 0.38,-0.02 0.58,-0.02 z"
         inkscape:connector-curvature="0" />
    </g>
  </g>
</svg>
