<?xml version="1.0" encoding="UTF-8" standalone="no"?>
<!-- Generator: Adobe Illustrator 17.1.0, SVG Export Plug-In . SVG Version: 6.00 Build 0)  -->

<svg
   xmlns:dc="http://purl.org/dc/elements/1.1/"
   xmlns:cc="http://creativecommons.org/ns#"
   xmlns:rdf="http://www.w3.org/1999/02/22-rdf-syntax-ns#"
   xmlns:svg="http://www.w3.org/2000/svg"
   xmlns="http://www.w3.org/2000/svg"
   xmlns:sodipodi="http://sodipodi.sourceforge.net/DTD/sodipodi-0.dtd"
   xmlns:inkscape="http://www.inkscape.org/namespaces/inkscape"
   version="1.1"
   id="Capa_1"
   x="0px"
   y="0px"
   viewBox="0 0 510.9995 511.00076"
   xml:space="preserve"
   sodipodi:docname="drone1.svg"
   width="510.99951"
   height="511.00076"
   inkscape:version="0.92.4 (unknown)"><metadata
   id="metadata51"><rdf:RDF><cc:Work
       rdf:about=""><dc:format>image/svg+xml</dc:format><dc:type
         rdf:resource="http://purl.org/dc/dcmitype/StillImage" /><dc:title /></cc:Work></rdf:RDF></metadata><defs
   id="defs49" /><sodipodi:namedview
   pagecolor="#ffffff"
   bordercolor="#666666"
   borderopacity="1"
   objecttolerance="10"
   gridtolerance="10"
   guidetolerance="10"
   inkscape:pageopacity="0"
   inkscape:pageshadow="2"
   inkscape:window-width="1600"
   inkscape:window-height="851"
   id="namedview47"
   showgrid="false"
   showborder="false"
   fit-margin-top="0"
   fit-margin-left="0"
   fit-margin-right="0"
   fit-margin-bottom="0"
   inkscape:zoom="1.262229"
   inkscape:cx="118.04451"
   inkscape:cy="255.50038"
   inkscape:window-x="0"
   inkscape:window-y="24"
   inkscape:window-maximized="1"
   inkscape:current-layer="Capa_1" />
<g
   id="g25"><path
     d="m 87.49975,415.99975 c -1.97,0 -3.91,0.8 -5.3,2.2 -1.4,1.39 -2.2,3.33 -2.2,5.3 0,1.97 0.8,3.91 2.2,5.3 1.39,1.4 3.33,2.2 5.3,2.2 1.97,0 3.91,-0.8 5.3,-2.2 1.4,-1.39 2.2,-3.33 2.2,-5.3 0,-1.97 -0.8,-3.91 -2.2,-5.3 -1.39,-1.4 -3.33,-2.2 -5.3,-2.2 z"
     id="path2"
     inkscape:connector-curvature="0" /><path
     d="m 498.19675,338.19675 -58.372,58.372 c -4.764,-2.898 -10.353,-4.569 -16.325,-4.569 -5.972,0 -11.561,1.671 -16.324,4.569 l -66.372,-66.372 c -0.083,-0.083 -0.171,-0.154 -0.257,-0.232 1.601,-3.211 2.453,-6.771 2.453,-10.465 0,-6.278 -2.445,-12.18 -6.884,-16.615 l -17.116,-17.116 v -60.537 l 17.114,-17.114 c 4.44,-4.438 6.886,-10.339 6.886,-16.618 0,-3.694 -0.853,-7.254 -2.453,-10.465 0.085,-0.078 0.174,-0.149 0.256,-0.231 l 66.372,-66.372 c 4.764,2.898 10.353,4.568 16.325,4.568 5.972,0 11.561,-1.67 16.325,-4.569 l 58.372,58.372 c 1.464,1.464 3.384,2.197 5.303,2.197 1.919,0 3.839,-0.732 5.303,-2.197 2.929,-2.929 2.929,-7.677 0,-10.606 l -58.372,-58.372 c 2.899,-4.764 4.569,-10.353 4.569,-16.325 0,-17.369 -14.131,-31.5 -31.5,-31.5 -5.972,0 -11.561,1.671 -16.324,4.569 l -58.372,-58.372 c -2.929,-2.929 -7.678,-2.929 -10.606,0 -2.929,2.929 -2.929,7.677 0,10.606 l 58.372,58.372 c -2.899,4.764 -4.57,10.353 -4.57,16.325 0,5.972 1.671,11.562 4.569,16.325 l -66.372,66.372 c -0.082,0.082 -0.154,0.171 -0.231,0.256 -3.211,-1.601 -6.771,-2.453 -10.465,-2.453 -6.281,0 -12.183,2.446 -16.616,6.885 l -17.116,17.115 h -60.537 l -17.112,-17.112 c -4.437,-4.442 -10.338,-6.888 -16.62,-6.888 -3.695,0 -7.255,0.853 -10.466,2.453 -0.078,-0.085 -0.149,-0.173 -0.231,-0.255 l -66.372,-66.372 c 2.899,-4.764 4.569,-10.354 4.569,-16.326 0,-5.972 -1.671,-11.561 -4.569,-16.325 l 58.372,-58.372 c 2.929,-2.929 2.929,-7.677 0,-10.606 -2.929,-2.929 -7.678,-2.929 -10.606,0 l -58.372,58.372 c -4.764,-2.898 -10.353,-4.569 -16.325,-4.569 -17.369,0 -31.5,14.131 -31.5,31.5 0,5.972 1.671,11.561 4.569,16.325 l -58.372,58.372 c -2.929,2.929 -2.929,7.677 0,10.606 1.464,1.465 3.384,2.197 5.303,2.197 1.919,0 3.839,-0.732 5.303,-2.197 l 58.372,-58.372 c 4.764,2.899 10.353,4.569 16.325,4.569 5.972,0 11.561,-1.67 16.324,-4.568 l 66.372,66.372 c 0.083,0.082 0.171,0.154 0.257,0.231 -1.601,3.211 -2.453,6.771 -2.453,10.465 0,6.278 2.445,12.18 6.884,16.616 l 17.116,17.116 v 60.537 l -17.114,17.114 c -4.44,4.437 -6.886,10.339 -6.886,16.617 0,3.694 0.853,7.255 2.453,10.465 -0.085,0.078 -0.174,0.149 -0.256,0.232 l -66.372,66.372 c -4.764,-2.898 -10.353,-4.569 -16.325,-4.569 -5.972,0 -11.561,1.671 -16.325,4.569 l -58.372,-58.372 c -2.929,-2.929 -7.678,-2.929 -10.606,0 -2.929,2.929 -2.929,7.678 0,10.606 l 58.372,58.372 c -2.898,4.764 -4.569,10.353 -4.569,16.325 0,17.369 14.131,31.5 31.5,31.5 5.972,0 11.561,-1.67 16.325,-4.568 l 58.372,58.372 c 1.464,1.465 3.384,2.197 5.303,2.197 1.919,0 3.839,-0.732 5.303,-2.197 2.929,-2.929 2.929,-7.678 0,-10.606 l -58.372,-58.372 c 2.899,-4.764 4.569,-10.354 4.569,-16.326 0,-5.972 -1.671,-11.561 -4.569,-16.325 l 66.372,-66.372 c 0.082,-0.083 0.154,-0.171 0.231,-0.256 3.211,1.601 6.771,2.453 10.465,2.453 6.281,0 12.183,-2.446 16.616,-6.884 l 17.117,-17.116 h 60.537 l 17.112,17.113 c 4.436,4.441 10.338,6.887 16.619,6.887 3.695,0 7.255,-0.853 10.466,-2.452 0.078,0.085 0.149,0.173 0.231,0.256 l 66.372,66.372 c -2.898,4.763 -4.569,10.352 -4.569,16.324 0,5.972 1.671,11.562 4.569,16.325 l -58.372,58.372 c -2.929,2.929 -2.929,7.678 0,10.606 1.464,1.465 3.384,2.197 5.303,2.197 1.919,0 3.839,-0.732 5.303,-2.197 l 58.372,-58.372 c 4.764,2.899 10.353,4.569 16.325,4.569 17.369,0 31.5,-14.131 31.5,-31.5 0,-5.972 -1.671,-11.561 -4.569,-16.324 l 58.372,-58.372 c 2.929,-2.929 2.929,-7.678 0,-10.606 -2.928,-2.929 -7.677,-2.929 -10.606,-10e-4 z m -74.697,-267.197 c 9.098,0 16.5,7.402 16.5,16.5 0,9.099 -7.402,16.5 -16.5,16.5 -9.098,0 -16.5,-7.401 -16.5,-16.5 0,-9.098 7.402,-16.5 16.5,-16.5 z m -352.5,16.5 c 0,-9.098 7.402,-16.5 16.5,-16.5 9.098,0 16.5,7.402 16.5,16.5 0,9.099 -7.402,16.5 -16.5,16.5 -9.098,0 -16.5,-7.401 -16.5,-16.5 z m 16.5,352.5 c -9.098,0 -16.5,-7.401 -16.5,-16.5 0,-9.098 7.402,-16.5 16.5,-16.5 9.098,0 16.5,7.402 16.5,16.5 0,9.099 -7.402,16.5 -16.5,16.5 z m 232,-112 c -2.271,0 -4.404,-0.883 -6.009,-2.49 l -19.313,-19.313 c -1.406,-1.407 -3.314,-2.197 -5.303,-2.197 h -25.875 v -0.5 c 0,-4.142 -3.358,-7.5 -7.5,-7.5 -4.142,0 -7.5,3.358 -7.5,7.5 v 0.5 h -25.875 c -1.989,0 -3.897,0.791 -5.303,2.197 l -19.316,19.315 c -1.602,1.604 -3.735,2.487 -6.006,2.487 -2.271,0 -4.404,-0.883 -6.011,-2.492 -1.605,-1.604 -2.489,-3.738 -2.489,-6.008 0,-2.27 0.884,-4.403 2.491,-6.009 l 19.313,-19.313 c 1.407,-1.407 2.197,-3.314 2.197,-5.304 v -66.75 c 0,-1.989 -0.79,-3.896 -2.197,-5.303 l -19.314,-19.314 c -1.605,-1.604 -2.489,-3.738 -2.489,-6.008 0,-2.27 0.884,-4.403 2.494,-6.012 1.602,-1.604 3.735,-2.488 6.006,-2.488 2.271,0 4.404,0.884 6.009,2.491 l 19.313,19.313 c 1.406,1.406 3.314,2.196 5.303,2.196 h 25.874 v 48.5 c 0,4.143 3.358,7.5 7.5,7.5 4.142,0 7.5,-3.357 7.5,-7.5 v -48.498 h 25.875 c 1.989,0 3.897,-0.79 5.303,-2.196 l 19.316,-19.316 c 1.602,-1.604 3.735,-2.488 6.006,-2.488 2.271,0 4.404,0.884 6.011,2.493 1.605,1.604 2.489,3.738 2.489,6.007 0,2.27 -0.884,4.403 -2.491,6.01 l -19.313,19.313 c -1.407,1.406 -2.197,3.314 -2.197,5.303 v 66.75 c 0,1.989 0.79,3.897 2.197,5.304 l 19.314,19.314 c 1.605,1.604 2.489,3.738 2.489,6.007 0,2.27 -0.884,4.403 -2.494,6.013 -1.601,1.603 -3.734,2.486 -6.005,2.486 z m 104,112 c -9.098,0 -16.5,-7.401 -16.5,-16.5 0,-9.098 7.402,-16.5 16.5,-16.5 9.098,0 16.5,7.402 16.5,16.5 0,9.099 -7.402,16.5 -16.5,16.5 z"
     id="path4"
     inkscape:connector-curvature="0" /><path
     d="m 423.49975,415.99975 c -1.98,0 -3.91,0.8 -5.3,2.2 -1.4,1.39 -2.2,3.33 -2.2,5.3 0,1.97 0.8,3.91 2.2,5.3 1.39,1.4 3.32,2.2 5.3,2.2 1.98,0 3.91,-0.8 5.3,-2.2 1.4,-1.39 2.2,-3.33 2.2,-5.3 0,-1.97 -0.8,-3.91 -2.2,-5.3 -1.39,-1.4 -3.32,-2.2 -5.3,-2.2 z"
     id="path6"
     inkscape:connector-curvature="0" /><path
     d="m 423.49975,94.99975 c 1.98,0 3.91,-0.8 5.3,-2.2 1.4,-1.39 2.2,-3.33 2.2,-5.3 0,-1.97 -0.8,-3.91 -2.2,-5.3 -1.39,-1.4 -3.32,-2.2 -5.3,-2.2 -1.98,0 -3.91,0.8 -5.3,2.2 -1.4,1.39 -2.2,3.33 -2.2,5.3 0,1.97 0.8,3.91 2.2,5.3 1.39,1.4 3.32,2.2 5.3,2.2 z"
     id="path8"
     inkscape:connector-curvature="0" /><path
     d="m 87.49975,79.99975 c -1.98,0 -3.91,0.8 -5.3,2.2 -1.4,1.39 -2.2,3.33 -2.2,5.3 0,1.97 0.8,3.91 2.2,5.3 1.39,1.4 3.32,2.2 5.3,2.2 1.98,0 3.91,-0.8 5.3,-2.2 1.4,-1.39 2.2,-3.33 2.2,-5.3 0,-1.97 -0.8,-3.91 -2.2,-5.3 -1.39,-1.4 -3.32,-2.2 -5.3,-2.2 z"
     id="path10"
     inkscape:connector-curvature="0" /><path
     d="m 279.49975,223.99975 c -4.142,0 -7.5,3.358 -7.5,7.5 v 40.5 h -33 v -40.5 c 0,-4.142 -3.358,-7.5 -7.5,-7.5 -4.142,0 -7.5,3.358 -7.5,7.5 v 48 c 0,4.143 3.358,7.5 7.5,7.5 h 48 c 4.142,0 7.5,-3.357 7.5,-7.5 v -48 c 0,-4.141 -3.358,-7.5 -7.5,-7.5 z"
     id="path12"
     inkscape:connector-curvature="0" /></g>















</svg>