<svg
  xmlns               = "http://www.w3.org/2000/svg"
  xmlns:ev            = "http://www.w3.org/2001/xml-events"
  id                  = "raiz"
  width               = "100%"
  height              = "100%"
  preserveAspectRatio = "xMidYMid meet"
>

<!--

  SVL - Scalable Vector Logo
  Arkanon <arkanon@lsd.org.br>

  $modifed = 2014/02/26 (Wed) 03:38:59 (BRS)
  $counted = 2009/06/25 (Qui) 13:56:34
  $created = 2008/07/28 (Seg) 14:47:54

-->

  <defs id="definições">

    <circle id="def-ponto" cx="0" cy="0" r=".5" />

    <path
      id="def-tat"
      transform="translate(-8.5 -7.5)"
      fill-rule="evenodd"
      d="
          M  2 1
          v  1 h  1 v  1 h  1 v  1 h -1 v  4 h  1 v  1 h -1 v  1 h -1 v  1 h  2 v -1 h  2 v  1 h  1 v  1 h -1 v  2 h  1 v  1
          h  2
          v -1 h  1 v -2 h -1 v -1 h  1 v -1 h  2 v  1 h  2 v -1 h -1 v -1 h -1 v -1 h  1 v -4 h -1 v -1 h  1 v -1 h  1 v -1
          h -2 v  2 h -1 v -1 h -2 v -1
          h -2
          v  1 h -2 v  1 h -1 v -2 h -2
          M  8  7
          v  1 h  1 v -1 h -1
        " />

  </defs>

  <g id="tela">
    <rect id="fundo" />
  </g>

  <foreignObject>
    <body xmlns="http://www.w3.org/1999/xhtml">
      <a     id="save" />
      <input id="load" />
    </body>
  </foreignObject>

  <script id="rom-0" type="application/javascript" href="rom.0.auxiliar.js"        />
  <script id="rom-1" type="application/javascript" href="rom.1.geral.js"           />
  <script id="rom-2" type="application/javascript" href="rom.2.listas.js"          />
  <script id="rom-3" type="application/javascript" href="rom.3.matematica.js"      />
  <script id="rom-4" type="application/javascript" href="rom.4.grafico-nao-tat.js" />
  <script id="rom-5" type="application/javascript" href="rom.5.grafico-tat.js"     />
  <script id="rom-z" type="application/javascript" href="rom.z.boot.js"            />

</svg>
