<?xml version="1.0" encoding="UTF-8" standalone="no"?>
<!-- Created with Inkscape (http://www.inkscape.org/) -->

<svg
   xmlns:dc="http://purl.org/dc/elements/1.1/"
   xmlns:cc="http://creativecommons.org/ns#"
   xmlns:rdf="http://www.w3.org/1999/02/22-rdf-syntax-ns#"
   xmlns:svg="http://www.w3.org/2000/svg"
   xmlns="http://www.w3.org/2000/svg"
   xmlns:xlink="http://www.w3.org/1999/xlink"
   xmlns:sodipodi="http://sodipodi.sourceforge.net/DTD/sodipodi-0.dtd"
   xmlns:inkscape="http://www.inkscape.org/namespaces/inkscape"
   height="45.002529"
   id="svg2"
   inkscape:export-filename="/home/jimmac/Desktop/drive-harddisk.png"
   inkscape:export-xdpi="90"
   inkscape:export-ydpi="90"
   inkscape:output_extension="org.inkscape.output.svg.inkscape"
   inkscape:version="0.92.4 (unknown)"
   sodipodi:docname="save_as.svg"
   sodipodi:version="0.32"
   version="1.0"
   width="42">
  <metadata
     id="metadata2">
    <rdf:RDF>
      <cc:Work
         rdf:about="">
        <dc:title>Jakub Steiner, Lapo Calamandrei</dc:title>
        <dc:description />
        <dc:subject>
          <rdf:Bag>
            <rdf:li>hdd</rdf:li>
            <rdf:li>drive</rdf:li>
            <rdf:li>fixed</rdf:li>
            <rdf:li>media</rdf:li>
            <rdf:li>hard</rdf:li>
          </rdf:Bag>
        </dc:subject>
        <dc:publisher>
          <cc:Agent
             rdf:about="http://www.openclipart.org/">
            <dc:title>Open Clip Art Library, Source: GNOME Icon Theme, Source: GNOME Icon Theme, Source: GNOME Icon Theme, Source: GNOME Icon Theme</dc:title>
          </cc:Agent>
        </dc:publisher>
        <dc:creator>
          <cc:Agent>
            <dc:title>Jakub Steiner, Lapo Calamandrei</dc:title>
          </cc:Agent>
        </dc:creator>
        <dc:rights>
          <cc:Agent>
            <dc:title>Jakub Steiner, Lapo Calamandrei</dc:title>
          </cc:Agent>
        </dc:rights>
        <dc:date />
        <dc:format>image/svg+xml</dc:format>
        <dc:type
           rdf:resource="http://purl.org/dc/dcmitype/StillImage" />
        <cc:license
           rdf:resource="http://creativecommons.org/licenses/GPL/2.0/" />
        <dc:language>en</dc:language>
      </cc:Work>
    </rdf:RDF>
  </metadata>
  <defs
     id="defs4">
    <linearGradient
       id="linearGradient6451">
      <stop
         id="stop6453"
         offset="0"
         style="stop-color:#eeeeec;stop-opacity:1;" />
      <stop
         id="stop6455"
         offset="1"
         style="stop-color:#ffffff;stop-opacity:1;" />
    </linearGradient>
    <linearGradient
       id="linearGradient7781"
       inkscape:collect="always">
      <stop
         id="stop7783"
         offset="0"
         style="stop-color:#ffffff;stop-opacity:1;" />
      <stop
         id="stop7785"
         offset="1"
         style="stop-color:#ffffff;stop-opacity:0;" />
    </linearGradient>
    <linearGradient
       id="linearGradient6715"
       inkscape:collect="always">
      <stop
         id="stop6717"
         offset="0"
         style="stop-color:#000000;stop-opacity:1;" />
      <stop
         id="stop6719"
         offset="1"
         style="stop-color:#000000;stop-opacity:0;" />
    </linearGradient>
    <linearGradient
       id="linearGradient6549">
      <stop
         id="stop6551"
         offset="0"
         style="stop-color:#8ae234;stop-opacity:1" />
      <stop
         id="stop6553"
         offset="1"
         style="stop-color:#73d216;stop-opacity:1" />
    </linearGradient>
    <linearGradient
       id="linearGradient2916"
       inkscape:collect="always">
      <stop
         id="stop2918"
         offset="0"
         style="stop-color:white;stop-opacity:1;" />
      <stop
         id="stop2920"
         offset="1"
         style="stop-color:white;stop-opacity:0;" />
    </linearGradient>
    <linearGradient
       id="linearGradient2902"
       inkscape:collect="always">
      <stop
         id="stop2905"
         offset="0"
         style="stop-color:black;stop-opacity:1;" />
      <stop
         id="stop2907"
         offset="1"
         style="stop-color:black;stop-opacity:0;" />
    </linearGradient>
    <linearGradient
       id="linearGradient2986"
       inkscape:collect="always">
      <stop
         id="stop2988"
         offset="0"
         style="stop-color:black;stop-opacity:1;" />
      <stop
         id="stop2990"
         offset="1"
         style="stop-color:black;stop-opacity:0;" />
    </linearGradient>
    <linearGradient
       id="linearGradient2967"
       inkscape:collect="always">
      <stop
         id="stop2969"
         offset="0"
         style="stop-color:white;stop-opacity:1;" />
      <stop
         id="stop2971"
         offset="1"
         style="stop-color:white;stop-opacity:0;" />
    </linearGradient>
    <linearGradient
       id="linearGradient2064">
      <stop
         id="stop2066"
         offset="0"
         style="stop-color:white;stop-opacity:1;" />
      <stop
         id="stop2070"
         offset="0.5"
         style="stop-color:#555753;stop-opacity:0.60000002;" />
      <stop
         id="stop2068"
         offset="1"
         style="stop-color:#555753;stop-opacity:0;" />
    </linearGradient>
    <linearGradient
       id="linearGradient9641">
      <stop
         id="stop9643"
         offset="0"
         style="stop-color:white;stop-opacity:1" />
      <stop
         id="stop9645"
         offset="1"
         style="stop-color:#888a85;stop-opacity:1" />
    </linearGradient>
    <linearGradient
       id="linearGradient9633">
      <stop
         id="stop9635"
         offset="0"
         style="stop-color:#eeeeec;stop-opacity:1" />
      <stop
         id="stop9639"
         offset="1"
         style="stop-color:#888a85;stop-opacity:1" />
    </linearGradient>
    <linearGradient
       id="linearGradient9613">
      <stop
         id="stop9615"
         offset="0"
         style="stop-color:white;stop-opacity:1" />
      <stop
         id="stop9619"
         offset="0.5"
         style="stop-color:white;stop-opacity:1;" />
      <stop
         id="stop9617"
         offset="1"
         style="stop-color:#cccfca;stop-opacity:1" />
    </linearGradient>
    <linearGradient
       id="linearGradient8710">
      <stop
         id="stop8712"
         offset="0"
         style="stop-color:black;stop-opacity:1;" />
      <stop
         id="stop8714"
         offset="1"
         style="stop-color:white;stop-opacity:1;" />
    </linearGradient>
    <linearGradient
       id="linearGradient8631">
      <stop
         id="stop8633"
         offset="0"
         style="stop-color:#eeeeec;stop-opacity:1" />
      <stop
         id="stop8637"
         offset="0.2"
         style="stop-color:#eeeeec;stop-opacity:1;" />
      <stop
         id="stop8635"
         offset="1"
         style="stop-color:#babdb6;stop-opacity:1" />
    </linearGradient>
    <linearGradient
       id="linearGradient8625">
      <stop
         id="stop8627"
         offset="0"
         style="stop-color:white;stop-opacity:1" />
      <stop
         id="stop8629"
         offset="1"
         style="stop-color:#babdb6;stop-opacity:1" />
    </linearGradient>
    <linearGradient
       id="linearGradient8613">
      <stop
         id="stop8615"
         offset="0"
         style="stop-color:#babdb6;stop-opacity:1" />
      <stop
         id="stop8617"
         offset="1"
         style="stop-color:#2e3436;stop-opacity:1" />
    </linearGradient>
    <linearGradient
       id="linearGradient5740">
      <stop
         id="stop5742"
         offset="0"
         style="stop-color:#d0d0cb;stop-opacity:1;" />
      <stop
         id="stop5744"
         offset="1"
         style="stop-color:#babdb6;stop-opacity:1" />
    </linearGradient>
    <linearGradient
       id="linearGradient5690">
      <stop
         id="stop5692"
         offset="0"
         style="stop-color:white;stop-opacity:1;" />
      <stop
         id="stop5694"
         offset="1"
         style="stop-color:#888a85;stop-opacity:0.59848487" />
    </linearGradient>
    <linearGradient
       id="linearGradient2899">
      <stop
         id="stop2901"
         offset="0"
         style="stop-color:#555753;stop-opacity:1" />
      <stop
         id="stop2903"
         offset="1"
         style="stop-color:#2e3436;stop-opacity:1" />
    </linearGradient>
    <linearGradient
       id="linearGradient3468">
      <stop
         id="stop3470"
         offset="0"
         style="stop-color:#fdfdfc;stop-opacity:1" />
      <stop
         id="stop3472"
         offset="1"
         style="stop-color:white;stop-opacity:0.37121212" />
    </linearGradient>
    <linearGradient
       id="linearGradient2909">
      <stop
         id="stop2911"
         offset="0"
         style="stop-color:white;stop-opacity:0;" />
      <stop
         id="stop2917"
         offset="0.5"
         style="stop-color:white;stop-opacity:1;" />
      <stop
         id="stop2913"
         offset="1"
         style="stop-color:white;stop-opacity:0;" />
    </linearGradient>
    <linearGradient
       id="linearGradient2839">
      <stop
         id="stop2841"
         offset="0"
         style="stop-color:white;stop-opacity:0.25773194;" />
      <stop
         id="stop2847"
         offset="0.5472973"
         style="stop-color:white;stop-opacity:1;" />
      <stop
         id="stop2849"
         offset="0.66243607"
         style="stop-color:white;stop-opacity:0.24705882;" />
      <stop
         id="stop2851"
         offset="0.875"
         style="stop-color:white;stop-opacity:0.83505154;" />
      <stop
         id="stop2843"
         offset="1"
         style="stop-color:white;stop-opacity:0;" />
    </linearGradient>
    <linearGradient
       gradientTransform="matrix(1,0,0,0.995556,0,1.068887)"
       gradientUnits="userSpaceOnUse"
       id="linearGradient3474"
       inkscape:collect="always"
       x1="24.748737"
       x2="24.998737"
       xlink:href="#linearGradient3468"
       y1="35.354588"
       y2="14.997767" />
    <linearGradient
       gradientTransform="matrix(1,0,0,1.42294,10.5,-14.95703)"
       gradientUnits="userSpaceOnUse"
       id="linearGradient4711"
       inkscape:collect="always"
       x1="15.335379"
       x2="20.329321"
       xlink:href="#linearGradient2909"
       y1="33.06237"
       y2="36.37693" />
    <linearGradient
       gradientTransform="matrix(1,0,0,1.42294,-0.875,-15.04578)"
       gradientUnits="userSpaceOnUse"
       id="linearGradient4713"
       inkscape:collect="always"
       x1="15.335379"
       x2="20.329321"
       xlink:href="#linearGradient2909"
       y1="33.06237"
       y2="36.37693" />
    <linearGradient
       gradientTransform="matrix(0.459833,0,-0.391165,1.370105,40.62503,-13.29892)"
       gradientUnits="userSpaceOnUse"
       id="linearGradient4715"
       inkscape:collect="always"
       x1="15.335379"
       x2="20.329321"
       xlink:href="#linearGradient2909"
       y1="33.06237"
       y2="36.37693" />
    <radialGradient
       cx="25.251999"
       cy="16.47991"
       fx="25.251999"
       fy="16.47991"
       gradientTransform="matrix(1.032991,-0.596398,0.575121,0.99614,-12.23456,16.55448)"
       gradientUnits="userSpaceOnUse"
       id="radialGradient5748"
       inkscape:collect="always"
       r="21.980215"
       xlink:href="#linearGradient5740" />
    <linearGradient
       gradientTransform="matrix(0.940224,0,0,0.931632,1.331811,6.401537)"
       gradientUnits="userSpaceOnUse"
       id="linearGradient5790"
       inkscape:collect="always"
       x1="18.048874"
       x2="22.211937"
       xlink:href="#linearGradient2064"
       y1="25.461344"
       y2="12.143078" />
    <linearGradient
       gradientUnits="userSpaceOnUse"
       id="linearGradient5865"
       inkscape:collect="always"
       x1="24"
       x2="25.818018"
       xlink:href="#linearGradient8631"
       y1="36.638382"
       y2="6.8314762" />
    <linearGradient
       gradientUnits="userSpaceOnUse"
       id="linearGradient7658"
       inkscape:collect="always"
       x1="27.057796"
       x2="32.042896"
       xlink:href="#linearGradient2839"
       y1="12.669416"
       y2="31.219666" />
    <linearGradient
       gradientUnits="userSpaceOnUse"
       id="linearGradient8603"
       inkscape:collect="always"
       x1="20.304037"
       x2="18.498415"
       xlink:href="#linearGradient5690"
       y1="24.035707"
       y2="40.647167" />
    <radialGradient
       cx="7.5177727"
       cy="30.573555"
       fx="7.5177727"
       fy="30.573555"
       gradientTransform="matrix(1.662477,0,0,1.61358,-4.989175,-18.65647)"
       gradientUnits="userSpaceOnUse"
       id="radialGradient8619"
       inkscape:collect="always"
       r="0.53125"
       xlink:href="#linearGradient8613" />
    <radialGradient
       cx="7.5191436"
       cy="30.304251"
       fx="7.5191436"
       fy="30.304251"
       gradientTransform="matrix(1.389748,0,0,1.348872,-2.91982,-10.63815)"
       gradientUnits="userSpaceOnUse"
       id="radialGradient8623"
       inkscape:collect="always"
       r="0.53125"
       xlink:href="#linearGradient9613" />
    <radialGradient
       cx="7.5336008"
       cy="30.307562"
       fx="7.5336008"
       fy="30.307562"
       gradientTransform="matrix(1.569487,0,0,1.523325,-4.288627,-15.92107)"
       gradientUnits="userSpaceOnUse"
       id="radialGradient8664"
       inkscape:collect="always"
       r="0.53125"
       xlink:href="#linearGradient9633" />
    <radialGradient
       cx="7.5177727"
       cy="30.573555"
       fx="7.5177727"
       fy="30.573555"
       gradientTransform="matrix(1.662477,0,0,1.61358,-4.989175,-18.65647)"
       gradientUnits="userSpaceOnUse"
       id="radialGradient8666"
       inkscape:collect="always"
       r="0.53125"
       xlink:href="#linearGradient8613" />
    <radialGradient
       cx="7.4792061"
       cy="30.36071"
       fx="7.4792061"
       fy="30.36071"
       gradientTransform="matrix(1.662477,0,0,1.61358,-4.989175,-18.65647)"
       gradientUnits="userSpaceOnUse"
       id="radialGradient8676"
       inkscape:collect="always"
       r="0.53125"
       xlink:href="#linearGradient8625" />
    <radialGradient
       cx="7.5177727"
       cy="30.573555"
       fx="7.5177727"
       fy="30.573555"
       gradientTransform="matrix(1.662477,0,0,1.61358,-4.989175,-18.65647)"
       gradientUnits="userSpaceOnUse"
       id="radialGradient8678"
       inkscape:collect="always"
       r="0.53125"
       xlink:href="#linearGradient8613" />
    <radialGradient
       cx="7.4893188"
       cy="30.337601"
       fx="7.4893188"
       fy="30.337601"
       gradientTransform="matrix(1.662477,0,0,1.61358,-4.989175,-18.65647)"
       gradientUnits="userSpaceOnUse"
       id="radialGradient8680"
       inkscape:collect="always"
       r="0.53125"
       xlink:href="#linearGradient9641" />
    <radialGradient
       cx="7.5177727"
       cy="30.573555"
       fx="7.5177727"
       fy="30.573555"
       gradientTransform="matrix(1.662477,0,0,1.61358,-4.989175,-18.65647)"
       gradientUnits="userSpaceOnUse"
       id="radialGradient8682"
       inkscape:collect="always"
       r="0.53125"
       xlink:href="#linearGradient8613" />
    <linearGradient
       gradientTransform="translate(0,5)"
       gradientUnits="userSpaceOnUse"
       id="linearGradient8716"
       inkscape:collect="always"
       x1="40.617188"
       x2="40.710938"
       xlink:href="#linearGradient8710"
       y1="30.554688"
       y2="30.359375" />
    <linearGradient
       gradientTransform="matrix(0.602867,-0.797841,0.797841,0.602867,-41.12611,49.62773)"
       gradientUnits="userSpaceOnUse"
       id="linearGradient9605"
       inkscape:collect="always"
       x1="40.617188"
       x2="40.710938"
       xlink:href="#linearGradient8710"
       y1="30.554688"
       y2="30.359375" />
    <linearGradient
       gradientTransform="rotate(-30.000012,3.7488065,78.589153)"
       gradientUnits="userSpaceOnUse"
       id="linearGradient9649"
       inkscape:collect="always"
       x1="40.617188"
       x2="40.710938"
       xlink:href="#linearGradient8710"
       y1="30.554688"
       y2="30.359375" />
    <linearGradient
       gradientTransform="matrix(0.707107,0.527555,-0.707107,0.527555,29.0058,-19.09196)"
       gradientUnits="userSpaceOnUse"
       id="linearGradient9654"
       inkscape:collect="always"
       x1="40.617188"
       x2="40.710938"
       xlink:href="#linearGradient8710"
       y1="30.554688"
       y2="30.359375" />
    <linearGradient
       gradientUnits="userSpaceOnUse"
       id="linearGradient2973"
       inkscape:collect="always"
       x1="12.5"
       x2="12.5"
       xlink:href="#linearGradient2967"
       y1="43.1875"
       y2="34.045513" />
    <linearGradient
       gradientTransform="translate(0,50)"
       gradientUnits="userSpaceOnUse"
       id="linearGradient5655"
       inkscape:collect="always"
       x1="53.812813"
       x2="-2.8138931"
       xlink:href="#linearGradient2899"
       y1="43.573235"
       y2="35.500015" />
    <linearGradient
       gradientTransform="translate(0,5)"
       gradientUnits="userSpaceOnUse"
       id="linearGradient2992"
       inkscape:collect="always"
       x1="21.9375"
       x2="21.9375"
       xlink:href="#linearGradient2986"
       y1="39"
       y2="37.995617" />
    <linearGradient
       gradientTransform="translate(0,7)"
       gradientUnits="userSpaceOnUse"
       id="linearGradient2910"
       inkscape:collect="always"
       x1="22.101398"
       x2="22.971142"
       xlink:href="#linearGradient2902"
       y1="27.658131"
       y2="20.903238" />
    <linearGradient
       gradientTransform="translate(0,7)"
       gradientUnits="userSpaceOnUse"
       id="linearGradient2922"
       inkscape:collect="always"
       x1="24.847851"
       x2="24.847851"
       xlink:href="#linearGradient2916"
       y1="28.908398"
       y2="25.757175" />
    <radialGradient
       cx="16.5"
       cy="15"
       fx="16.5"
       fy="15"
       gradientTransform="matrix(1,0,0,0.5454545,0,6.8181818)"
       gradientUnits="userSpaceOnUse"
       id="radialGradient6752"
       inkscape:collect="always"
       r="5.5"
       xlink:href="#linearGradient6715" />
    <linearGradient
       gradientTransform="matrix(1.4314406,0,0,1.4345912,0.332755,-5.7794018)"
       gradientUnits="userSpaceOnUse"
       id="linearGradient7822"
       inkscape:collect="always"
       x1="18.410261"
       x2="17.024746"
       xlink:href="#linearGradient6549"
       y1="14.364082"
       y2="8.1057186" />
    <linearGradient
       gradientUnits="userSpaceOnUse"
       id="linearGradient7826"
       inkscape:collect="always"
       x1="23.5"
       x2="14.922542"
       xlink:href="#linearGradient7781"
       y1="17.0625"
       y2="17.0625" />
    <linearGradient
       gradientUnits="userSpaceOnUse"
       id="linearGradient6457"
       inkscape:collect="always"
       x1="21.478369"
       x2="21.478369"
       xlink:href="#linearGradient6451"
       y1="1.6845057"
       y2="6.5747066" />
  </defs>
  <sodipodi:namedview
     bordercolor="#666"
     borderlayer="true"
     borderopacity="0.36078431"
     height="48px"
     id="base"
     inkscape:current-layer="layer1"
     inkscape:cx="21"
     inkscape:cy="22.501265"
     inkscape:document-units="px"
     inkscape:grid-bbox="true"
     inkscape:grid-points="true"
     inkscape:guide-bbox="true"
     inkscape:pageopacity="0.0"
     inkscape:pageshadow="2"
     inkscape:showpageshadow="false"
     inkscape:window-height="1032"
     inkscape:window-width="1920"
     inkscape:window-x="0"
     inkscape:window-y="23"
     inkscape:zoom="18.354524"
     pagecolor="#ffffff"
     showborder="true"
     showgrid="false"
     showguides="false"
     width="48px"
     fit-margin-top="0"
     fit-margin-left="0"
     fit-margin-right="0"
     fit-margin-bottom="0"
     inkscape:window-maximized="1">
    <sodipodi:guide
       id="guide2023"
       orientation="horizontal"
       position="-3.0000005,9.00253"
       inkscape:locked="false" />
    <sodipodi:guide
       id="guide2025"
       orientation="horizontal"
       position="-3.0000005,24.50253"
       inkscape:locked="false" />
    <inkscape:grid
       id="GridFromPre046Settings"
       type="xygrid"
       originx="-3.0000005"
       originy="-2.99747"
       spacingx="0.5"
       spacingy="0.5"
       color="#3f3fff"
       empcolor="#3f3fff"
       opacity="0.15"
       empopacity="0.38"
       empspacing="2" />
  </sodipodi:namedview>
  <g
     id="layer1"
     inkscape:groupmode="layer"
     inkscape:label="Livello 1"
     style="display:inline"
     transform="translate(-3.0000005)">
    <g
       id="g3918">
      <g
         transform="translate(0,-43.99747)"
         id="g5672">
        <path
           style="color:#000000;display:inline;overflow:visible;visibility:visible;fill:url(#linearGradient5655);fill-opacity:1;fill-rule:nonzero;stroke:#2e3436;stroke-width:1;stroke-linecap:square;stroke-linejoin:round;stroke-miterlimit:4;stroke-dasharray:none;stroke-dashoffset:1.39999998;stroke-opacity:1;marker:none;marker-start:none;marker-mid:none;marker-end:none"
           sodipodi:nodetypes="ccccccccccccc"
           id="rect2010"
           d="M 4.5182287,80.500013 H 43.481768 c 0.564099,0 1.018229,0.45413 1.018229,1.018229 v 2.963543 c 0,1.315584 -0.450231,3.018228 -2.455729,3.018228 L 40.5,87.5 v 1 h -33 v -1 l -1.8567713,1.3e-5 c -1.2712053,0 -2.1432282,-0.884627 -2.1432282,-2.255665 v -3.726106 c 0,-0.564099 0.4541297,-1.018229 1.0182282,-1.018229 z"
           inkscape:connector-curvature="0" />
        <path
           transform="translate(0,50)"
           style="color:#000000;display:inline;overflow:visible;visibility:visible;opacity:0.1;fill:none;fill-opacity:1;fill-rule:nonzero;stroke:url(#linearGradient2973);stroke-width:0.99999988;stroke-linecap:square;stroke-linejoin:miter;stroke-miterlimit:4;stroke-dashoffset:1.39999998;stroke-opacity:1;marker:none;marker-start:none;marker-mid:none;marker-end:none"
           sodipodi:nodetypes="ccccccc"
           id="path2076"
           d="m 4.59375,31.59375 v 3.729743 c 0,0.599619 0.3756505,1.104854 0.8863276,1.104854 H 42.426407 c 0.512469,0 0.979843,-0.507235 0.979843,-1.016466 V 31.59375 Z"
           inkscape:connector-curvature="0" />
        <g
           transform="translate(0,50)"
           style="opacity:0.5"
           id="g4706">
          <path
             style="opacity:0.10952382;fill:url(#linearGradient4711);fill-opacity:1;fill-rule:evenodd;stroke:none;stroke-width:1px;stroke-linecap:butt;stroke-linejoin:miter;stroke-opacity:1"
             sodipodi:nodetypes="ccccc"
             inkscape:export-ydpi="90"
             inkscape:export-xdpi="90"
             inkscape:export-filename="/home/lapo/Desktop/uhm.png"
             id="path2907"
             d="m 26.144738,32.088747 c 0,0 -1.502602,5.533939 -3.226175,5.911253 0,0 6.231378,-0.125771 6.231378,-0.125771 1.387072,-0.317461 3.358758,-5.785482 3.358758,-5.785482 z"
             inkscape:connector-curvature="0" />
          <path
             style="opacity:0.10952382;fill:url(#linearGradient4713);fill-opacity:1;fill-rule:evenodd;stroke:none;stroke-width:1px;stroke-linecap:butt;stroke-linejoin:miter;stroke-opacity:1"
             sodipodi:nodetypes="ccccc"
             inkscape:export-ydpi="90"
             inkscape:export-xdpi="90"
             inkscape:export-filename="/home/lapo/Desktop/uhm.png"
             id="path2892"
             d="m 14.769738,32 c 0,0 -1.502602,5.533939 -3.226175,5.911253 0,0 6.231378,-0.125771 6.231378,-0.125771 C 19.162013,37.468021 21.133699,32 21.133699,32 Z"
             inkscape:connector-curvature="0" />
          <path
             style="opacity:0.10952382;fill:url(#linearGradient4715);fill-opacity:1;fill-rule:evenodd;stroke:none;stroke-width:1px;stroke-linecap:butt;stroke-linejoin:miter;stroke-opacity:1"
             sodipodi:nodetypes="ccccc"
             inkscape:export-ydpi="90"
             inkscape:export-xdpi="90"
             inkscape:export-filename="/home/lapo/Desktop/uhm.png"
             id="path2896"
             d="m 34.886139,32 c 0,0 -2.212224,5.328458 -3.108503,5.691761 0,0 2.899969,-0.121101 2.899969,-0.121101 C 35.402697,37.264987 37.8125,32 37.8125,32 Z"
             inkscape:connector-curvature="0" />
        </g>
      </g>
      <path
         style="fill:url(#radialGradient5748);fill-opacity:1;stroke:#888a85;stroke-width:1.00000024;stroke-linecap:round;stroke-linejoin:miter;stroke-miterlimit:4;stroke-dashoffset:0;stroke-opacity:1"
         sodipodi:nodetypes="cczzcczzc"
         inkscape:export-ydpi="90"
         inkscape:export-xdpi="90"
         inkscape:export-filename="/home/lapo/Desktop/uhm.png"
         id="rect1879"
         d="m 11.693127,15.498788 h 24.572566 c 1.68417,0 2.396517,0.117479 3.040019,2.385005 l 5.074491,17.881119 c 0.501024,1.765471 -1.355848,2.735101 -3.040018,2.735101 H 6.6186312 c -1.868408,0 -3.4893833,-1.181417 -3.0400182,-2.735101 L 8.8290448,17.611497 c 0.5683008,-1.964905 1.1799122,-2.112709 2.8640822,-2.112709 z"
         inkscape:connector-curvature="0" />
      <path
         transform="translate(0,5)"
         style="display:inline;opacity:0.46240599;fill:url(#linearGradient7658);fill-opacity:1;stroke:none;stroke-width:1.00000024;stroke-linecap:round;stroke-linejoin:miter;stroke-miterlimit:4;stroke-dashoffset:0;stroke-opacity:1"
         sodipodi:type="inkscape:offset"
         inkscape:radius="-0.5"
         inkscape:original="M 11.6875 10.5 C 10.00333 10.5 9.4120513 10.660095 8.84375 12.625 L 3.59375 30.75 C 3.1443849 32.303684 4.7565918 33.500002 6.625 33.5 L 41.34375 33.5 C 43.02792 33.5 44.876024 32.515471 44.375 30.75 L 39.3125 12.875 C 38.668998 10.607474 37.965419 10.5 36.28125 10.5 L 11.6875 10.5 z "
         id="path5806"
         d="m 11.6875,11 c -0.826242,0 -1.28475,0.05742 -1.5625,0.242188 -0.2777497,0.184768 -0.5284825,0.580009 -0.8007812,1.521484 l -5.25,18.125 c -0.1708249,0.590628 0.021709,1.039316 0.4902343,1.4375 C 5.0329784,32.724356 5.7975106,33.000001 6.625,33 h 34.71875 c 0.744655,0 1.538941,-0.232575 2.03125,-0.609375 0.492309,-0.3768 0.719298,-0.799984 0.519531,-1.503906 l -5.0625,-17.875 C 38.52278,11.922001 38.224454,11.462814 37.910156,11.253906 37.595859,11.044998 37.112699,11 36.28125,11 Z" />
      <ellipse
         transform="matrix(-2.628602,0,0,1.777765,27.79309,-18.77739)"
         style="color:#000000;display:inline;overflow:visible;visibility:visible;opacity:1;fill:url(#radialGradient8623);fill-opacity:1;fill-rule:nonzero;stroke:none;stroke-width:1;stroke-linecap:square;stroke-linejoin:miter;stroke-miterlimit:4;stroke-dasharray:none;stroke-dashoffset:1.39999998;stroke-opacity:1;marker:none;marker-start:none;marker-mid:none;marker-end:none"
         id="path8621"
         cx="7.625"
         cy="30.578125"
         rx="0.53125"
         ry="0.515625" />
      <path
         style="fill:none;fill-opacity:1;stroke:url(#linearGradient5790);stroke-width:1.00000012;stroke-linecap:round;stroke-linejoin:round;stroke-miterlimit:4;stroke-dasharray:none;stroke-dashoffset:0;stroke-opacity:1"
         sodipodi:nodetypes="cccssscccc"
         id="path2784"
         d="m 16.110953,17.552805 c -0.573581,0 -1.02837,0.431821 -1.02837,0.989859 l -0.940223,3.230801 c -2.859962,1.276514 -4.6423552,3.099073 -4.6423552,5.123976 0,3.856957 6.4790242,6.987239 14.4853222,6.98724 8.006296,0 14.514705,-3.130284 14.514704,-6.98724 0,-2.039034 -1.835591,-3.875388 -4.730501,-5.153089 l -0.940224,-3.201688 c 0,-0.558038 -0.454788,-0.989859 -1.02837,-0.989859 z"
         inkscape:connector-curvature="0" />
      <path
         style="display:inline;fill:none;fill-opacity:1;stroke:url(#linearGradient3474);stroke-width:1.00000036;stroke-linecap:round;stroke-linejoin:miter;stroke-miterlimit:4;stroke-dashoffset:0;stroke-opacity:1"
         sodipodi:nodetypes="csccsccsccscc"
         id="path3394"
         d="m 11.6875,16.500005 c -0.803124,0 -1.097168,0.07051 -1.21875,0.155556 -0.121582,0.08505 -0.357707,0.40212 -0.6875,1.306667 l -5.25,18.137786 c -0.1337204,0.366765 -0.054827,0.533865 0.3125,0.84 0.3673267,0.306136 1.066693,0.56 1.78125,0.560001 h 34.71875 c 0.639793,0 1.393345,-0.237954 1.78125,-0.52889 0.387905,-0.290935 0.488311,-0.382809 0.3125,-0.871111 L 38.375,18.242228 c -0.377206,-1.04766 -0.68208,-1.439297 -0.84375,-1.555556 -0.16167,-0.116259 -0.443711,-0.186667 -1.25,-0.186667 z"
         inkscape:connector-curvature="0" />
      <g
         transform="translate(7,4)"
         style="opacity:0.3028571"
         id="g5657">
        <rect
           y="35.500008"
           x="18.499996"
           width="14.000004"
           style="color:#000000;display:inline;overflow:visible;visibility:visible;opacity:1;fill:#ffffff;fill-opacity:1;fill-rule:nonzero;stroke:#eeeeec;stroke-width:1.00000024;stroke-linecap:square;stroke-linejoin:miter;stroke-miterlimit:4;stroke-dasharray:none;stroke-dashoffset:1.39999998;stroke-opacity:1;marker:none;marker-start:none;marker-mid:none;marker-end:none"
           ry="0.74712253"
           rx="0.75130093"
           id="rect5641"
           height="1.9999924" />
        <rect
           y="36"
           x="19"
           width="1"
           style="color:#000000;display:inline;overflow:visible;visibility:visible;opacity:1;fill:#000000;fill-opacity:1;fill-rule:nonzero;stroke:none;stroke-width:1;stroke-linecap:square;stroke-linejoin:miter;stroke-miterlimit:4;stroke-dasharray:none;stroke-dashoffset:1.39999998;stroke-opacity:1;marker:none;marker-start:none;marker-mid:none;marker-end:none"
           id="rect5645"
           height="1" />
        <rect
           y="36"
           x="22"
           width="1"
           style="color:#000000;display:inline;overflow:visible;visibility:visible;opacity:1;fill:#000000;fill-opacity:1;fill-rule:nonzero;stroke:none;stroke-width:1;stroke-linecap:square;stroke-linejoin:miter;stroke-miterlimit:4;stroke-dasharray:none;stroke-dashoffset:1.39999998;stroke-opacity:1;marker:none;marker-start:none;marker-mid:none;marker-end:none"
           id="rect5647"
           height="1" />
        <rect
           y="36"
           x="24"
           width="1"
           style="color:#000000;display:inline;overflow:visible;visibility:visible;opacity:1;fill:#000000;fill-opacity:1;fill-rule:nonzero;stroke:none;stroke-width:1;stroke-linecap:square;stroke-linejoin:miter;stroke-miterlimit:4;stroke-dasharray:none;stroke-dashoffset:1.39999998;stroke-opacity:1;marker:none;marker-start:none;marker-mid:none;marker-end:none"
           id="rect5649"
           height="1" />
        <rect
           y="36"
           x="26"
           width="1"
           style="color:#000000;display:inline;overflow:visible;visibility:visible;opacity:1;fill:#000000;fill-opacity:1;fill-rule:nonzero;stroke:none;stroke-width:1;stroke-linecap:square;stroke-linejoin:miter;stroke-miterlimit:4;stroke-dasharray:none;stroke-dashoffset:1.39999998;stroke-opacity:1;marker:none;marker-start:none;marker-mid:none;marker-end:none"
           id="rect5651"
           height="1" />
        <rect
           y="36"
           x="29"
           width="2"
           style="color:#000000;display:inline;overflow:visible;visibility:visible;opacity:1;fill:#000000;fill-opacity:1;fill-rule:nonzero;stroke:none;stroke-width:1;stroke-linecap:square;stroke-linejoin:miter;stroke-miterlimit:4;stroke-dasharray:none;stroke-dashoffset:1.39999998;stroke-opacity:1;marker:none;marker-start:none;marker-mid:none;marker-end:none"
           id="rect5653"
           height="1" />
      </g>
      <path
         transform="translate(0,5)"
         style="display:inline;fill:url(#linearGradient5865);fill-opacity:1;stroke:none;stroke-width:1.00000012;stroke-linecap:round;stroke-linejoin:round;stroke-miterlimit:4;stroke-dasharray:none;stroke-dashoffset:0;stroke-opacity:1"
         sodipodi:type="inkscape:offset"
         inkscape:radius="-0.44194174"
         inkscape:original="M 16.125 12.5625 C 15.55142 12.5625 15.09375 12.973212 15.09375 13.53125 L 14.15625 16.78125 C 11.296288 18.057765 9.5 19.881347 9.5 21.90625 C 9.5 25.763206 15.993702 28.874999 24 28.875 C 32.006296 28.874999 38.500001 25.763206 38.5 21.90625 C 38.5 19.867215 36.67616 18.027701 33.78125 16.75 L 32.84375 13.53125 C 32.843748 12.973212 32.386082 12.5625 31.8125 12.5625 L 16.125 12.5625 z "
         id="path5857"
         d="m 16.125,13.003906 c -0.362612,0 -0.589844,0.210942 -0.589844,0.527344 a 0.44198593,0.44198593 0 0 1 -0.01758,0.123047 l -0.9375,3.25 a 0.44198593,0.44198593 0 0 1 -0.24414,0.28125 c -1.389903,0.620369 -2.504368,1.368471 -3.25586,2.177734 -0.751491,0.809263 -1.1386718,1.661199 -1.1386718,2.542969 0,1.680455 1.4530108,3.311153 3.9980468,4.533203 2.545037,1.22205 6.114654,1.99414 10.060547,1.994141 3.945892,-1e-6 7.51551,-0.772091 10.060547,-1.994141 2.545037,-1.22205 3.998047,-2.852748 3.998047,-4.533203 0,-0.887751 -0.391823,-1.747213 -1.154297,-2.5625 -0.762474,-0.815287 -1.893636,-1.568394 -3.300781,-2.189453 a 0.44198593,0.44198593 0 0 1 -0.246094,-0.28125 l -0.9375,-3.21875 a 0.44198593,0.44198593 0 0 1 -0.01758,-0.123047 c -10e-7,-0.316404 -0.22723,-0.527344 -0.589844,-0.527344 z" />
      <ellipse
         transform="matrix(0.449978,0,0,0.349909,16.36363,17.21469)"
         style="color:#000000;display:inline;overflow:visible;visibility:visible;opacity:0.9;fill:#000000;fill-opacity:0.05303028;fill-rule:nonzero;stroke:url(#linearGradient8603);stroke-width:2.52015233;stroke-linecap:square;stroke-linejoin:miter;stroke-miterlimit:4;stroke-dasharray:none;stroke-dashoffset:1.39999998;stroke-opacity:1;marker:none;marker-start:none;marker-mid:none;marker-end:none"
         id="path8595"
         cx="16.970562"
         cy="25.107418"
         rx="7.7781744"
         ry="4.2868347" />
      <ellipse
         transform="matrix(1.411772,0,0,0.969697,-3.014767,5.848485)"
         style="color:#000000;display:inline;overflow:visible;visibility:visible;opacity:1;fill:url(#radialGradient8619);fill-opacity:1;fill-rule:nonzero;stroke:none;stroke-width:1;stroke-linecap:square;stroke-linejoin:miter;stroke-miterlimit:4;stroke-dasharray:none;stroke-dashoffset:1.39999998;stroke-opacity:1;marker:none;marker-start:none;marker-mid:none;marker-end:none"
         id="path8611"
         cx="7.625"
         cy="30.578125"
         rx="0.53125"
         ry="0.515625" />
      <ellipse
         transform="matrix(-2.628602,0,0,1.777765,60.79309,-18.77739)"
         style="color:#000000;display:inline;overflow:visible;visibility:visible;opacity:1;fill:url(#radialGradient8664);fill-opacity:1;fill-rule:nonzero;stroke:none;stroke-width:0.46259445;stroke-linecap:square;stroke-linejoin:miter;stroke-miterlimit:4;stroke-dasharray:none;stroke-dashoffset:1.39999998;stroke-opacity:1;marker:none;marker-start:none;marker-mid:none;marker-end:none"
         id="path8660"
         cx="7.625"
         cy="30.578125"
         rx="0.53125"
         ry="0.515625" />
      <ellipse
         transform="matrix(1.411772,0,0,0.969697,29.98523,5.848485)"
         style="color:#000000;display:inline;overflow:visible;visibility:visible;opacity:1;fill:url(#radialGradient8666);fill-opacity:1;fill-rule:nonzero;stroke:none;stroke-width:1;stroke-linecap:square;stroke-linejoin:miter;stroke-miterlimit:4;stroke-dasharray:none;stroke-dashoffset:1.39999998;stroke-opacity:1;marker:none;marker-start:none;marker-mid:none;marker-end:none"
         id="path8662"
         cx="7.625"
         cy="30.578125"
         rx="0.53125"
         ry="0.515625" />
      <ellipse
         transform="matrix(-2.628602,0,0,1.777765,31.79309,-35.77739)"
         style="color:#000000;display:inline;overflow:visible;visibility:visible;opacity:1;fill:url(#radialGradient8676);fill-opacity:1;fill-rule:nonzero;stroke:none;stroke-width:1;stroke-linecap:square;stroke-linejoin:miter;stroke-miterlimit:4;stroke-dasharray:none;stroke-dashoffset:1.39999998;stroke-opacity:1;marker:none;marker-start:none;marker-mid:none;marker-end:none"
         id="path8668"
         cx="7.625"
         cy="30.578125"
         rx="0.53125"
         ry="0.515625" />
      <ellipse
         transform="matrix(1.411772,0,0,0.969697,0.985233,-11.15152)"
         style="color:#000000;display:inline;overflow:visible;visibility:visible;opacity:1;fill:url(#radialGradient8678);fill-opacity:1;fill-rule:nonzero;stroke:none;stroke-width:1;stroke-linecap:square;stroke-linejoin:miter;stroke-miterlimit:4;stroke-dasharray:none;stroke-dashoffset:1.39999998;stroke-opacity:1;marker:none;marker-start:none;marker-mid:none;marker-end:none"
         id="path8670"
         cx="7.625"
         cy="30.578125"
         rx="0.53125"
         ry="0.515625" />
      <ellipse
         transform="matrix(-2.628602,0,0,1.777765,56.3029,-35.77739)"
         style="color:#000000;display:inline;overflow:visible;visibility:visible;opacity:1;fill:url(#radialGradient8680);fill-opacity:1;fill-rule:nonzero;stroke:none;stroke-width:1;stroke-linecap:square;stroke-linejoin:miter;stroke-miterlimit:4;stroke-dasharray:none;stroke-dashoffset:1.39999998;stroke-opacity:1;marker:none;marker-start:none;marker-mid:none;marker-end:none"
         id="path8672"
         cx="7.625"
         cy="30.578125"
         rx="0.53125"
         ry="0.515625" />
      <ellipse
         transform="matrix(1.411772,0,0,0.969697,25.49504,-11.15152)"
         style="color:#000000;display:inline;overflow:visible;visibility:visible;opacity:1;fill:url(#radialGradient8682);fill-opacity:1;fill-rule:nonzero;stroke:none;stroke-width:1;stroke-linecap:square;stroke-linejoin:miter;stroke-miterlimit:4;stroke-dasharray:none;stroke-dashoffset:1.39999998;stroke-opacity:1;marker:none;marker-start:none;marker-mid:none;marker-end:none"
         id="path8674"
         cx="7.625"
         cy="30.578125"
         rx="0.53125"
         ry="0.515625" />
      <path
         style="opacity:0.4;fill:none;fill-opacity:1;fill-rule:evenodd;stroke:url(#linearGradient8716);stroke-width:0.29999995;stroke-linecap:round;stroke-linejoin:miter;stroke-miterlimit:4;stroke-dasharray:none;stroke-opacity:1"
         id="path8700"
         d="m 40.328109,35.261401 0.874999,0.430332"
         inkscape:connector-curvature="0" />
      <path
         style="display:inline;opacity:0.4;fill:none;fill-opacity:1;fill-rule:evenodd;stroke:url(#linearGradient9605);stroke-width:0.29999995;stroke-linecap:round;stroke-linejoin:miter;stroke-miterlimit:4;stroke-dasharray:none;stroke-opacity:1"
         id="path9603"
         d="M 7.330186,35.695906 8.201031,35.257228"
         inkscape:connector-curvature="0" />
      <path
         style="display:inline;opacity:0.4;fill:none;fill-opacity:1;fill-rule:evenodd;stroke:url(#linearGradient9649);stroke-width:0.29999995;stroke-linecap:round;stroke-linejoin:miter;stroke-miterlimit:4;stroke-dasharray:none;stroke-opacity:1"
         id="path9647"
         d="m 11.263531,18.446473 0.972937,-0.06482"
         inkscape:connector-curvature="0" />
      <path
         style="display:inline;opacity:0.4;fill:none;fill-opacity:1;fill-rule:evenodd;stroke:url(#linearGradient9654);stroke-width:0.29999998;stroke-linecap:round;stroke-linejoin:miter;stroke-miterlimit:4;stroke-dasharray:none;stroke-opacity:1"
         id="path9652"
         d="m 36.124038,18.147874 0.314427,0.688634"
         inkscape:connector-curvature="0" />
      <rect
         y="43"
         x="8"
         width="32.03125"
         style="color:#000000;display:inline;overflow:visible;visibility:visible;opacity:0.12000002;fill:url(#linearGradient2992);fill-opacity:1;fill-rule:nonzero;stroke:none;stroke-width:0.68183619;stroke-linecap:butt;stroke-linejoin:miter;stroke-miterlimit:4;stroke-dasharray:none;stroke-dashoffset:0;stroke-opacity:1;marker:none;marker-start:none;marker-mid:none;marker-end:none"
         id="rect2984"
         height="1" />
      <path
         style="color:#000000;display:inline;overflow:visible;visibility:visible;opacity:0.12000002;fill:none;fill-opacity:1;fill-rule:nonzero;stroke:url(#linearGradient2910);stroke-width:1.00000036;stroke-linecap:round;stroke-linejoin:round;stroke-miterlimit:4;stroke-dasharray:none;stroke-dashoffset:0;stroke-opacity:1;marker:none;marker-start:none;marker-mid:none;marker-end:none"
         sodipodi:nodetypes="ccccccccc"
         id="path1997"
         d="M 10.460155,20.082355 6.8513979,32.675762 C 8.2982685,33.375511 10.625,34.167061 10.429825,36.533131 H 37.299883 C 37.869398,34.640915 39.875,33.375 41.34614,33.25 L 37.498106,20.082355 32.350135,17.523347 H 14.318912 Z"
         inkscape:connector-curvature="0" />
      <path
         style="color:#000000;display:inline;overflow:visible;visibility:visible;opacity:0.83428572;fill:none;fill-opacity:1;fill-rule:nonzero;stroke:url(#linearGradient2922);stroke-width:1.00000036;stroke-linecap:round;stroke-linejoin:round;stroke-miterlimit:4;stroke-dasharray:none;stroke-dashoffset:0;stroke-opacity:1;marker:none;marker-start:none;marker-mid:none;marker-end:none"
         sodipodi:nodetypes="ccccc"
         id="path2912"
         d="m 7.9763979,32.050762 c 1.4468706,0.699749 3.1789321,1.433241 3.4256991,3.357369 H 36.857941 C 37.427456,33.515915 38.875,32.5 40.34614,32.375 Z"
         inkscape:connector-curvature="0" />
      <ellipse
         transform="matrix(2.1471606,0,0,1.4314409,-11.580953,1.2105393)"
         style="display:inline;opacity:0.2;fill:url(#radialGradient6752);fill-opacity:1;stroke:none;stroke-width:1;stroke-linecap:butt;stroke-linejoin:miter;stroke-miterlimit:4;stroke-dasharray:none;stroke-dashoffset:0;stroke-opacity:1"
         id="path6723"
         cx="16.5"
         cy="15"
         rx="5.5"
         ry="3" />
      <rect
         y="0.49999997"
         x="4.5000005"
         width="40"
         style="opacity:1;fill:url(#linearGradient6457);fill-opacity:1;stroke:#4e9a06;stroke-width:1;stroke-linecap:butt;stroke-linejoin:miter;stroke-miterlimit:4;stroke-dasharray:none;stroke-dashoffset:0;stroke-opacity:1"
         ry="2.5425858"
         rx="2.5425858"
         id="rect5480"
         height="10" />
      <path
         style="display:inline;opacity:1;fill:none;fill-opacity:1;stroke:#ffffff;stroke-width:1;stroke-linecap:butt;stroke-linejoin:miter;stroke-miterlimit:4;stroke-dasharray:none;stroke-dashoffset:0;stroke-opacity:1"
         sodipodi:type="inkscape:offset"
         inkscape:radius="-1.016466"
         inkscape:original="M 7.03125 0.5 C 5.6226574 0.5 4.5 1.6226574 4.5 3.03125 L 4.5 7.96875 C 4.5 9.3773426 5.6226574 10.5 7.03125 10.5 L 41.96875 10.5 C 43.377343 10.5 44.5 9.3773425 44.5 7.96875 L 44.5 3.03125 C 44.5 1.6226574 43.377344 0.5 41.96875 0.5 L 7.03125 0.5 z "
         id="path6463"
         d="m 7.03125,1.515625 c -0.8685059,0 -1.515625,0.6471191 -1.515625,1.515625 v 4.9375 c 0,0.8685059 0.6471191,1.515625 1.515625,1.515625 h 34.9375 c 0.868506,0 1.515625,-0.647119 1.515625,-1.515625 v -4.9375 c 0,-0.8685066 -0.647117,-1.515625 -1.515625,-1.515625 z" />
      <g
         id="g7817">
        <path
           style="display:inline;fill:url(#linearGradient7822);fill-opacity:1;stroke:#4e9a06;stroke-width:0.99999994;stroke-linecap:butt;stroke-linejoin:round;stroke-miterlimit:4;stroke-dasharray:none;stroke-dashoffset:0;stroke-opacity:1"
           sodipodi:nodetypes="ccccccc"
           id="path6526"
           d="m 18.5,10 v 3.5 h -6 l 11.5,13 11.5,-13 h -6 V 10"
           inkscape:connector-curvature="0" />
        <path
           style="display:inline;opacity:0.6;fill:none;fill-opacity:1;stroke:#ffffff;stroke-width:1;stroke-linecap:butt;stroke-linejoin:miter;stroke-miterlimit:4;stroke-dashoffset:0;stroke-opacity:1"
           sodipodi:nodetypes="ccccccccc"
           id="path7769"
           d="m 19.5,10 v 3.5 c 4e-6,0.552286 -0.447714,1.000004 -1,1 H 14.71875 L 24,25 33.28125,14.5 H 29.5 c -0.552286,4e-6 -1.000004,-0.447714 -1,-1 V 10"
           inkscape:connector-curvature="0" />
        <path
           style="display:inline;opacity:0.5;fill:url(#linearGradient7826);fill-opacity:1;stroke:none;stroke-width:0.99999994;stroke-linecap:butt;stroke-linejoin:round;stroke-miterlimit:4;stroke-dasharray:none;stroke-dashoffset:0;stroke-opacity:1"
           sodipodi:nodetypes="ccccccc"
           id="path7776"
           d="m 19,10 v 3.5 c -2.8e-5,0.276131 -0.223869,0.499972 -0.5,0.5 H 13.625 L 24,25.71875 V 10 Z"
           inkscape:connector-curvature="0" />
      </g>
      <rect
         y="3"
         x="7"
         width="14"
         style="opacity:1;fill:#d3d7cf;fill-opacity:1;stroke:none;stroke-width:1;stroke-linecap:butt;stroke-linejoin:miter;stroke-miterlimit:4;stroke-dasharray:none;stroke-dashoffset:0;stroke-opacity:1"
         id="rect6467"
         height="5" />
      <rect
         y="2"
         x="22"
         width="1"
         style="display:inline;opacity:1;fill:#555753;fill-opacity:1;stroke:none;stroke-width:1;stroke-linecap:butt;stroke-linejoin:miter;stroke-miterlimit:4;stroke-dasharray:none;stroke-dashoffset:0;stroke-opacity:1"
         id="rect6469"
         height="7" />
    </g>
  </g>
</svg>
