<?xml version="1.0" encoding="UTF-8" standalone="no"?>
<svg
   xmlns:dc="http://purl.org/dc/elements/1.1/"
   xmlns:cc="http://creativecommons.org/ns#"
   xmlns:rdf="http://www.w3.org/1999/02/22-rdf-syntax-ns#"
   xmlns:svg="http://www.w3.org/2000/svg"
   xmlns="http://www.w3.org/2000/svg"
   xmlns:sodipodi="http://sodipodi.sourceforge.net/DTD/sodipodi-0.dtd"
   xmlns:inkscape="http://www.inkscape.org/namespaces/inkscape"
   width="1633"
   height="1013"
   viewBox="0 0 432.06458 268.02288"
   version="1.1"
   id="svg8"
   inkscape:version="1.0 (1.0+r73+1)"
   sodipodi:docname="credits-v2.svg"
   inkscape:export-filename="/home/arkanon/git/fbjs/enquadramento/credits-v2.png"
   inkscape:export-xdpi="96"
   inkscape:export-ydpi="96">
  <defs
     id="defs2" />
  <sodipodi:namedview
     inkscape:guide-bbox="true"
     showguides="true"
     id="base"
     pagecolor="#ffffff"
     bordercolor="#666666"
     borderopacity="1.0"
     inkscape:pageopacity="0"
     inkscape:pageshadow="2"
     inkscape:zoom="0.63079961"
     inkscape:cx="816.5"
     inkscape:cy="506.5"
     inkscape:document-units="px"
     inkscape:current-layer="layer1"
     inkscape:document-rotation="0"
     showgrid="false"
     showborder="true"
     inkscape:window-width="1600"
     inkscape:window-height="851"
     inkscape:window-x="0"
     inkscape:window-y="24"
     inkscape:window-maximized="1"
     fit-margin-top="20"
     fit-margin-left="20"
     fit-margin-right="20"
     fit-margin-bottom="20"
     inkscape:showpageshadow="false"
     lock-margins="true"
     units="px"
     inkscape:pagecheckerboard="false" />
  <metadata
     id="metadata5">
    <rdf:RDF>
      <cc:Work
         rdf:about="">
        <dc:format>image/svg+xml</dc:format>
        <dc:type
           rdf:resource="http://purl.org/dc/dcmitype/StillImage" />
        <dc:title />
      </cc:Work>
    </rdf:RDF>
  </metadata>
  <g
     style="display:inline;opacity:1"
     inkscape:label="Layer 1"
     inkscape:groupmode="layer"
     id="layer1"
     transform="translate(101.82319,-4.2756098)">
    <rect
       id="rect81"
       inkscape:label="fundo"
       x="-101.8232"
       y="4.2756143"
       width="432.06458"
       height="268.02289"
       sodipodi:insensitive="true"
       style="fill:#000000;fill-rule:evenodd;stroke:none;stroke-width:0.529166;stroke-linecap:round;stroke-linejoin:round;stroke-dashoffset:200;paint-order:stroke fill markers" />
    <path
       id="path1005"
       inkscape:label="direita"
       sodipodi:nodetypes="scssssccsscscscsscccsscss"
       inkscape:transform-center-y="3.5629389"
       inkscape:transform-center-x="3.0734634"
       sodipodi:insensitive="true"
       style="opacity:0.5;fill:#ffff00;stroke-width:0.264583"
       d="m 280.34833,225.1063 c -0.18285,-0.0191 -0.34056,-0.13512 -0.40846,-0.30595 -0.20462,-0.51564 -0.58301,-1.72084 -0.58301,-3.58602 0,-1.03625 -0.80435,-1.56874 -1.60937,-1.56874 -0.79099,0 -1.567,0.51392 -1.567,1.56874 v 3.50235 c 0,0.25436 -0.20236,0.46701 -0.45564,0.49133 h -12.10746 c -2.13852,0 -2.13936,3.1844 -8.4e-4,3.1844 h 5.57793 c 0.31583,0 0.54867,0.29672 0.48143,0.6052 -0.14355,0.65813 -0.15704,1.71803 0.91542,2.43537 0.18112,0.12109 0.26959,0.34444 0.20612,0.55295 -0.187,0.61455 -0.36957,1.88911 0.94535,2.6964 0.14194,0.0872 0.2363,0.23658 0.23938,0.40325 0.0123,0.65666 0.272,2.33445 2.5562,2.7178 0.36342,0.0609 0.72576,0.0929 1.09345,0.0929 1.73046,0 3.57775,-0.70772 6.18981,-2.4291 0.0509,-0.0334 0.10813,-0.0579 0.16748,-0.0705 l 1.82376,-0.39282 c 0.22721,-0.0489 0.38707,-0.2498 0.38707,-0.48236 v -6.64373 c 0,-0.11254 -0.0358,-0.2208 -0.106,-0.30888 -0.72148,-0.90633 -2.01823,-2.2822 -3.74561,-2.46251 z" />
    <path
       id="path1101"
       inkscape:label="esquerda"
       sodipodi:nodetypes="scssssccsscscscsscccsscss"
       inkscape:transform-center-x="-3.0734635"
       inkscape:transform-center-y="-3.5629389"
       sodipodi:insensitive="true"
       style="opacity:0.5;fill:#ffff00;stroke-width:0.264583"
       d="m -40.290415,70.52003 c 0.18285,0.0191 0.34056,0.13512 0.40846,0.30595 0.20462,0.51564 0.58301,1.72084 0.58301,3.58602 0,1.03625 0.80435,1.56874 1.60937,1.56874 0.79099,0 1.567,-0.51392 1.567,-1.56874 v -3.50235 c 0,-0.25436 0.20236,-0.46701 0.45564,-0.49133 h 12.10746 c 2.13852,0 2.13936,-3.1844 8.4e-4,-3.1844 h -5.57793 c -0.31583,0 -0.54867,-0.29672 -0.48143,-0.6052 0.14355,-0.65813 0.15704,-1.71803 -0.91542,-2.43537 -0.18112,-0.12109 -0.26959,-0.34444 -0.20612,-0.55295 0.187,-0.61455 0.36957,-1.88911 -0.94535,-2.6964 -0.14194,-0.0872 -0.2363,-0.23658 -0.23938,-0.40325 -0.0123,-0.65666 -0.272,-2.33445 -2.5562,-2.7178 -0.36342,-0.0609 -0.72576,-0.0929 -1.09345,-0.0929 -1.73046,0 -3.57775,0.70772 -6.18981,2.4291 -0.0509,0.0334 -0.10813,0.0579 -0.16748,0.0705 l -1.82376,0.39282 c -0.22721,0.0489 -0.38707,0.2498 -0.38707,0.48236 v 6.64373 c 0,0.11254 0.0358,0.2208 0.106,0.30888 0.72148,0.90633 2.01823,2.2822 3.74561,2.46251 z" />
    <rect
       id="rect85"
       inkscape:label="enquadramento"
       x="-35.137768"
       y="71.476654"
       width="310.33344"
       height="152.67302"
       sodipodi:insensitive="true"
       style="fill:none;fill-rule:evenodd;stroke:#ffff00;stroke-width:0.264583;stroke-linecap:round;stroke-linejoin:round;stroke-miterlimit:4;stroke-dasharray:0.264583, 1.5875;stroke-dashoffset:0;paint-order:stroke fill markers" />
    <text
       id="text912"
       inkscape:label="creditos"
       x="147.92577"
       y="184.90366"
       xml:space="preserve"
       style="font-style:normal;font-weight:normal;font-size:7.05555px;line-height:1.25;font-family:sans-serif;letter-spacing:0px;word-spacing:0px;fill:#ffff00;fill-opacity:1;stroke:none;stroke-width:0.264583"
       sodipodi:insensitive="true"><tspan
         id="tspan910"
         x="147.92577"
         y="184.90366"
         sodipodi:role="line"
         style="font-style:normal;font-variant:normal;font-weight:300;font-stretch:normal;font-size:7.05555px;font-family:Ubuntu;-inkscape-font-specification:'Ubuntu Light';fill:#ffff00;stroke-width:0.264583"><tspan
   style="font-style:italic;font-variant:normal;font-weight:300;font-stretch:normal;font-size:5.64444px;font-family:Ubuntu;-inkscape-font-specification:'Ubuntu Light Italic'"
   id="tspan93">Fotografia</tspan>   Cláudia Schreiner</tspan><tspan
         x="147.92577"
         y="194.05983"
         sodipodi:role="line"
         style="font-style:normal;font-variant:normal;font-weight:300;font-stretch:normal;font-size:7.05555px;font-family:Ubuntu;-inkscape-font-specification:'Ubuntu Light';fill:#ffff00;stroke-width:0.264583"
         id="tspan87"><tspan
   style="font-style:italic;font-variant:normal;font-weight:300;font-stretch:normal;font-size:5.64444px;font-family:Ubuntu;-inkscape-font-specification:'Ubuntu Light Italic'"
   id="tspan101">Montagem por linha de comando</tspan>   Arkanon</tspan><tspan
         x="147.92577"
         y="203.216"
         sodipodi:role="line"
         style="font-style:normal;font-variant:normal;font-weight:300;font-stretch:normal;font-size:7.05555px;font-family:Ubuntu;-inkscape-font-specification:'Ubuntu Light';fill:#ffff00;stroke-width:0.264583"
         id="tspan89"><tspan
   style="font-style:italic;font-variant:normal;font-weight:300;font-stretch:normal;font-size:5.64444px;font-family:Ubuntu;-inkscape-font-specification:'Ubuntu Light Italic'"
   id="tspan105">Trilha sonora (fragmento)</tspan>   Inverno – Vivaldi</tspan><tspan
         x="147.92577"
         y="212.37218"
         sodipodi:role="line"
         style="font-style:normal;font-variant:normal;font-weight:300;font-stretch:normal;font-size:7.05555px;font-family:Ubuntu;-inkscape-font-specification:'Ubuntu Light';fill:#ffff00;stroke-width:0.264583"
         id="tspan91"><tspan
   style="font-style:italic;font-variant:normal;font-weight:300;font-stretch:normal;font-size:5.64444px;font-family:Ubuntu;-inkscape-font-specification:'Ubuntu Light Italic'"
   id="tspan109">Interpretação</tspan>   Symphoniacs</tspan></text>
  </g>
</svg>
