/home/e20210009615/Bureau/L3/GenieLogiciel/TD7/t-dsonar-massal/src/main/java/pizzas/Ingredient.java
/home/e20210009615/Bureau/L3/GenieLogiciel/TD7/t-dsonar-massal/src/main/java/pizzas/BasePizzas.java
/home/e20210009615/Bureau/L3/GenieLogiciel/TD7/t-dsonar-massal/src/main/java/pizzas/Pizza.java
