SELECT MESSAGE_ID as MessageID
    FROM TB_R_DATA_EXCHANGE
    WHERE TITLE = @0
    AND BODY = @1
    AND FILE_URL = @2
    AND MAX_RETENTION_DATE = @3
    AND SENT_TO = @4
    AND PASSWORD = @5
    AND TYPE = @6
    AND CREATED_BY = @7
    AND CREATED_DT = @8