DECLARE @@DOCK_PACKING TABLE (DOCK_CD VARCHAR(4))
DECLARE @@items VARCHAR(MAX)

SELECT @@items = SYSTEM_VALUE FROM TB_M_SYSTEM WHERE FUNCTION_ID = 'DOCK_PACKING' AND SYSTEM_CD = 'EMERGENCY_ORDER'
INSERT INTO @@DOCK_PACKING SELECT LTRIM(RTRIM(s)) FROM dbo.[fnSplitString](@@items, ',')

if exists(select * from TB_T_CED_EMERGENCY_ORDER_PART 
	where SessionID=@0 AND UserID=@1 AND 
		PART_NO=REPLACE(@2,'-','') AND SUPPLIER_CD=@8 AND SUPPLIER_PLANT=@9 AND DOCK_CD=@10)  
BEGIN
	--IF @10 = '1N'   --1H, 1J, 1K, 1L, 1M, 1N, 1Q, 1U, 1V, 1W, 1X, 1Y, 1Z
	--IF @10 = '1H' OR @10 = '1J' OR @10 = '1K' OR @10 = '1L' OR @10 = '1M' OR @10 = '1N' OR @10 = '1Q' OR
	--   @10 = '1U' OR @10 = '1V' OR @10 = '1W' OR @10 = '1X' OR @10 = '1Y' OR @10 = '1Z'
	IF @10 IN (SELECT DOCK_CD FROM @@DOCK_PACKING)
	BEGIN	
		update TB_T_CED_EMERGENCY_ORDER_PART set 
		KANBAN_NO=@4,
		ORDER_QTY=@5,
		QTY_PER_CONTAINER=@6,
		PIECES_QTY=(Case WHEN @7='' THEN CONVERT(INT,@5) * CONVERT(INT,@6) ELSE @7 END),
		KANBAN_PRINT_ADDRESS = @12,
		IMPORTIR_INFO = @13,
		IMPORTIR_INFO2 = @14,
		IMPORTIR_INFO3 = @15,
		IMPORTIR_INFO4 = @16,
		PART_BARCODE = @17,
		PROGRESS_LANE_NO = @18,
		CONVEYANCE_NO = @19
	where SessionID=@0 AND UserID=@1 AND PART_NO=REPLACE(@2,'-','') AND SUPPLIER_CD=@8 AND SUPPLIER_PLANT=@9 AND DOCK_CD=@10 AND PART_BARCODE = @17		
	END
	ELSE
	BEGIN
		update TB_T_CED_EMERGENCY_ORDER_PART set 
		KANBAN_NO=@4,
		ORDER_QTY=@5,
		QTY_PER_CONTAINER=@6,
		PIECES_QTY=(Case WHEN @7='' THEN CONVERT(INT,@5) * CONVERT(INT,@6) ELSE @7 END),
		KANBAN_PRINT_ADDRESS = @12,
		IMPORTIR_INFO = @13,
		IMPORTIR_INFO2 = @14,
		IMPORTIR_INFO3 = @15,
		IMPORTIR_INFO4 = @16,
		PART_BARCODE = @17		
	where SessionID=@0 AND UserID=@1 AND PART_NO=REPLACE(@2,'-','') AND SUPPLIER_CD=@8 AND SUPPLIER_PLANT=@9 AND DOCK_CD=@10
	END	
END
else
BEGIN
	--IF @10 = '1N'   --1H, 1J, 1K, 1L, 1M, 1N, 1Q, 1U, 1V, 1W, 1X, 1Y, 1Z
	--IF @10 = '1H' OR @10 = '1J' OR @10 = '1K' OR @10 = '1L' OR @10 = '1M' OR @10 = '1N' OR @10 = '1Q' OR
	--   @10 = '1U' OR @10 = '1V' OR @10 = '1W' OR @10 = '1X' OR @10 = '1Y' OR @10 = '1Z'
	IF @10 IN (SELECT DOCK_CD FROM @@DOCK_PACKING)
	BEGIN
		insert into TB_T_CED_EMERGENCY_ORDER_PART
	(
		SessionID,
		UserID,
		SUPPLIER_CD,
		SUPPLIER_PLANT,
		DOCK_CD,
		PART_NO,
		PART_NAME,
		KANBAN_NO,
		ORDER_QTY,
		QTY_PER_CONTAINER,
		PIECES_QTY,
		BUILD_OUT_FLAG,
		KANBAN_PRINT_ADDRESS,
		IMPORTIR_INFO,
		IMPORTIR_INFO2,
		IMPORTIR_INFO3,
		IMPORTIR_INFO4,
		PART_BARCODE,
		PROGRESS_LANE_NO,
		CONVEYANCE_NO,
		PROD_DATE,
		CREATED_DT,
		FUNCTION_ID, --2019-01-13 : FID.Ridwan
		SUBMIT_TYPE,
		ID
	)
	values(
		@0,
		@1,
		@8,
		@9,
		@10,
		REPLACE(@2,'-',''),
		@3,
		@4,
		@5,
		@6,
		(Case WHEN @7='' THEN CONVERT(INT,@5) * CONVERT(INT,@6) ELSE @7 END),
		@11,
		@12,
		@13,
		@14,
		@15,
		@16,
		@17,
		@18,
		@19,
		@20,
		GETDATE(),
		'131', --2019-01-13 : FID.Ridwan
		2,
		(SELECT isnull(max(ID) + 1, 1)
		FROM
		TB_T_CED_EMERGENCY_ORDER_PART)
	)
	END
	ELSE
	BEGIN
		insert into TB_T_CED_EMERGENCY_ORDER_PART
	(
		SessionID,
		UserID,
		SUPPLIER_CD,
		SUPPLIER_PLANT,
		DOCK_CD,
		PART_NO,
		PART_NAME,
		KANBAN_NO,
		ORDER_QTY,
		QTY_PER_CONTAINER,
		PIECES_QTY,
		BUILD_OUT_FLAG,
		KANBAN_PRINT_ADDRESS,
		IMPORTIR_INFO,
		IMPORTIR_INFO2,
		IMPORTIR_INFO3,
		IMPORTIR_INFO4,
		PART_BARCODE,
		PROD_DATE,
		CREATED_DT,
		FUNCTION_ID, --2019-01-13 : FID.Ridwan
		SUBMIT_TYPE,
		ID			
	)
	values(
		@0,
		@1,
		@8,
		@9,
		@10,
		REPLACE(@2,'-',''),
		@3,
		@4,
		@5,
		@6,
		(Case WHEN @7='' THEN CONVERT(INT,@5) * CONVERT(INT,@6) ELSE @7 END),  
		@11,
		@12,
		@13,
		@14,
		@15,
		@16,
		@17,
		@20,
		GETDATE(),
		'131', --2019-01-13 : FID.Ridwan
		2,
		(SELECT isnull(max(ID) + 1, 1)
		FROM
		TB_T_CED_EMERGENCY_ORDER_PART)
	)
	END	
END