﻿INSERT INTO 
	TB_R_DELIVERY_CTL_SUPPLIERDOCK (DELIVERY_NO, PICKUP_DT, SUPPLIER_CD, SUPPLIER_NAME, SUPP_PLANT_CD, DOCK_CD, ROUTE, RATE, 
									ARRVDATETIME, DPTDATETIME, LP_CD, CREATED_BY, CREATED_DT)
	VALUES(@0, @1, @2, @3, @4, @5, @6, @7, @8, @9, @10, @11, @12); 