SELECT [DELIVERY_NO]
      ,[DOCK_CD]
      ,[STATION]
      ,[ARRIVAL_GATE_DT]
      ,[ARRIVAL_PLAN_DT]
      ,[DEPARTURE_PLAN_DT]
      ,[ARRIVAL_STATUS]
      ,[ARRIVAL_GAP]
      ,[ARRIVAL_ACTUAL_DT]
      ,[DEPARTURE_ACTUAL_DT]
      ,[DEPARTURE_STATUS]
      ,[DEPARTURE_GAP]
      ,[REMAINING]
      ,[CREATED_BY]
      ,[CREATED_DT]
      ,[CHANGED_BY]
      ,[CHANGED_DT]
  FROM [dbo].[TB_R_DELIVERY_CTL_D]
