0003|2|201709261200|00000146|00000146
R117000162	0003	2		807B	1	1R	SP17092615			755330K01000	S004	3	2017-09-26 00:00:00.000	SP43	1	1	1				SUGITY CREATIVES	MOULDING WINDSHIELD		2017-09-26 10:40:00.000	2017-09-26 08:49:00.000				AP07	02	2017-09-26 00:00:00.000	0003	2	1R	2017-09-26 08:49:00.000																									2017-09-26 16:57:37.710				0		0		0		0		0		0	0			0		0	0	SUNTER 1		755330K01000				9722D10	THAILAND	SEA	A3-DG	R11700016200100001	001	CT3	10/09/2017				

R117000162	0003	2		807B	1	1R	SP17092615			755330K01000	S004	3	2017-09-26 00:00:00.000	SP43	1	1	1				SUGITY CREATIVES	MOULDING WINDSHIELD		2017-09-26 10:40:00.000	2017-09-26 08:49:00.000				AP07	02	2017-09-26 00:00:00.000	0003	2	1R	2017-09-26 08:49:00.000																									2017-09-26 16:57:37.710				0		0		0		0		0		0	0			0		0	0	SUNTER 1		755330K01000				9722D10	THAILAND	SEA	A3-DG	R11700016200100002	001	CT3	10/09/2017				

R117000162	0003	2		807B	1	1R	SP17092615			755330K01000	S004	3	2017-09-26 00:00:00.000	SP43	1	1	1				SUGITY CREATIVES	MOULDING WINDSHIELD		2017-09-26 10:40:00.000	2017-09-26 08:49:00.000				AP07	02	2017-09-26 00:00:00.000	0003	2	1R	2017-09-26 08:49:00.000																									2017-09-26 16:57:37.710				0		0		0		0		0		0	0			0		0	0	SUNTER 1		755330K01000				9722D10	THAILAND	SEA	A3-DG	R11700016200100003	001	CT3	10/09/2017				

R117000162	0003	2		807B	1	1R	SP17092615			755330K01000	S004	3	2017-09-26 00:00:00.000	SP43	1	1	1				SUGITY CREATIVES	MOULDING WINDSHIELD		2017-09-26 10:40:00.000	2017-09-26 08:49:00.000				AP07	02	2017-09-26 00:00:00.000	0003	2	1R	2017-09-26 08:49:00.000																									2017-09-26 16:57:37.710				0		0		0		0		0		0	0			0		0	0	SUNTER 1		755330K01000				9722D10	THAILAND	SEA	A3-DG	R11700016200100004	001	CT3	10/09/2017				

R117000162	0003	2		807B	1	1R	SP17092615			755330K01000	S004	3	2017-09-26 00:00:00.000	SP43	1	1	1				SUGITY CREATIVES	MOULDING WINDSHIELD		2017-09-26 10:40:00.000	2017-09-26 08:49:00.000				AP07	02	2017-09-26 00:00:00.000	0003	2	1R	2017-09-26 08:49:00.000																									2017-09-26 16:57:37.710				0		0		0		0		0		0	0			0		0	0	SUNTER 1		755330K01000				9722D10	THAILAND	SEA	A3-DG	R11700016200100005	001	CT3	10/09/2017				

R117000162	0003	2		807B	1	1R	SP17092615			755330K01000	S004	3	2017-09-26 00:00:00.000	SP43	1	1	1				SUGITY CREATIVES	MOULDING WINDSHIELD		2017-09-26 10:40:00.000	2017-09-26 08:49:00.000				AP07	02	2017-09-26 00:00:00.000	0003	2	1R	2017-09-26 08:49:00.000																									2017-09-26 16:57:37.710				0		0		0		0		0		0	0			0		0	0	SUNTER 1		755330K01000				9722D10	THAILAND	SEA	A3-DG	R11700016200100006	001	CT3	10/09/2017				

R117000162	0003	2		807B	1	1R	SP17092615			755330K01000	S004	3	2017-09-26 00:00:00.000	SP43	1	1	1				SUGITY CREATIVES	MOULDING WINDSHIELD		2017-09-26 10:40:00.000	2017-09-26 08:49:00.000				AP07	02	2017-09-26 00:00:00.000	0003	2	1R	2017-09-26 08:49:00.000																									2017-09-26 16:57:37.710				0		0		0		0		0		0	0			0		0	0	SUNTER 1		755330K01000				9722D10	THAILAND	SEA	A3-DG	R11700016200100007	001	CT3	10/09/2017				

R117000162	0003	2		807B	1	1R	SP17092615			755330K01000	S004	3	2017-09-26 00:00:00.000	SP43	1	1	1				SUGITY CREATIVES	MOULDING WINDSHIELD		2017-09-26 10:40:00.000	2017-09-26 08:49:00.000				AP07	02	2017-09-26 00:00:00.000	0003	2	1R	2017-09-26 08:49:00.000																									2017-09-26 16:57:37.710				0		0		0		0		0		0	0			0		0	0	SUNTER 1		755330K01000				9722D10	THAILAND	SEA	A3-DG	R11700016200100008	001	CT3	10/09/2017				

R117000162	0003	2		807B	1	1R	SP17092615			755330K01000	S004	3	2017-09-26 00:00:00.000	SP43	1	1	1				SUGITY CREATIVES	MOULDING WINDSHIELD		2017-09-26 10:40:00.000	2017-09-26 08:49:00.000				AP07	02	2017-09-26 00:00:00.000	0003	2	1R	2017-09-26 08:49:00.000																									2017-09-26 16:57:37.710				0		0		0		0		0		0	0			0		0	0	SUNTER 1		755330K01000				9722D10	THAILAND	SEA	A3-DG	R11700016200100009	001	CT3	10/09/2017				

R117000162	0003	2		807B	1	1R	SP17092615			755330K01000	S004	3	2017-09-26 00:00:00.000	SP43	1	1	1				SUGITY CREATIVES	MOULDING WINDSHIELD		2017-09-26 10:40:00.000	2017-09-26 08:49:00.000				AP07	02	2017-09-26 00:00:00.000	0003	2	1R	2017-09-26 08:49:00.000																									2017-09-26 16:57:37.710				0		0		0		0		0		0	0			0		0	0	SUNTER 1		755330K01000				9722D10	THAILAND	SEA	A3-DG	R11700016200100010	001	CT3	10/09/2017				

R117000162	0003	2		807B	1	1R	SP17092615			755330K01000	S004	3	2017-09-26 00:00:00.000	SP43	1	1	1				SUGITY CREATIVES	MOULDING WINDSHIELD		2017-09-26 10:40:00.000	2017-09-26 08:49:00.000				AP07	02	2017-09-26 00:00:00.000	0003	2	1R	2017-09-26 08:49:00.000																									2017-09-26 16:57:37.710				0		0		0		0		0		0	0			0		0	0	SUNTER 1		755330K01000				9722D10	THAILAND	SEA	A3-DG	R11700016200100011	001	CT3	10/09/2017				

R117000162	0003	2		807B	1	1R	SP17092615			755330K01000	S004	3	2017-09-26 00:00:00.000	SP43	1	1	1				SUGITY CREATIVES	MOULDING WINDSHIELD		2017-09-26 10:40:00.000	2017-09-26 08:49:00.000				AP07	02	2017-09-26 00:00:00.000	0003	2	1R	2017-09-26 08:49:00.000																									2017-09-26 16:57:37.710				0		0		0		0		0		0	0			0		0	0	SUNTER 1		755330K01000				9722D10	THAILAND	SEA	A3-DG	R11700016200100012	001	CT3	10/09/2017				

R117000162	0003	2		807B	1	1R	SP17092615			755330K01000	S004	3	2017-09-26 00:00:00.000	SP43	1	1	1				SUGITY CREATIVES	MOULDING WINDSHIELD		2017-09-26 10:40:00.000	2017-09-26 08:49:00.000				AP07	02	2017-09-26 00:00:00.000	0003	2	1R	2017-09-26 08:49:00.000																									2017-09-26 16:57:37.710				0		0		0		0		0		0	0			0		0	0	SUNTER 1		755330K01000				9722D10	THAILAND	SEA	A3-DG	R11700016200100013	001	CT3	10/09/2017				

R117000162	0003	2		807B	1	1R	SP17092615			755330K01000	S004	3	2017-09-26 00:00:00.000	SP43	1	1	1				SUGITY CREATIVES	MOULDING WINDSHIELD		2017-09-26 10:40:00.000	2017-09-26 08:49:00.000				AP07	02	2017-09-26 00:00:00.000	0003	2	1R	2017-09-26 08:49:00.000																									2017-09-26 16:57:37.710				0		0		0		0		0		0	0			0		0	0	SUNTER 1		755330K01000				9722D10	THAILAND	SEA	A3-DG	R11700016200100014	001	CT3	10/09/2017				

R117000162	0003	2		807B	1	1R	SP17092615			755330K01000	S004	3	2017-09-26 00:00:00.000	SP43	1	1	1				SUGITY CREATIVES	MOULDING WINDSHIELD		2017-09-26 10:40:00.000	2017-09-26 08:49:00.000				AP07	02	2017-09-26 00:00:00.000	0003	2	1R	2017-09-26 08:49:00.000																									2017-09-26 16:57:37.710				0		0		0		0		0		0	0			0		0	0	SUNTER 1		755330K01000				9722D10	THAILAND	SEA	A3-DG	R11700016200100015	001	CT3	10/09/2017				

R117000162	0003	2		807B	1	1R	SP17092615			755330K01000	S004	3	2017-09-26 00:00:00.000	SP43	1	1	1				SUGITY CREATIVES	MOULDING WINDSHIELD		2017-09-26 10:40:00.000	2017-09-26 08:49:00.000				AP07	02	2017-09-26 00:00:00.000	0003	2	1R	2017-09-26 08:49:00.000																									2017-09-26 16:57:37.710				0		0		0		0		0		0	0			0		0	0	SUNTER 1		755330K01000				9722D10	THAILAND	SEA	A3-DG	R11700016200100016	001	CT3	10/09/2017				

R117000162	0003	2		807B	1	1R	SP17092615			755330K01000	S004	3	2017-09-26 00:00:00.000	SP43	1	1	1				SUGITY CREATIVES	MOULDING WINDSHIELD		2017-09-26 10:40:00.000	2017-09-26 08:49:00.000				AP07	02	2017-09-26 00:00:00.000	0003	2	1R	2017-09-26 08:49:00.000																									2017-09-26 16:57:37.710				0		0		0		0		0		0	0			0		0	0	SUNTER 1		755330K01000				9722D10	THAILAND	SEA	A3-DG	R11700016200100017	001	CT3	10/09/2017				

R117000162	0003	2		807B	1	1R	SP17092615			755330K01000	S004	3	2017-09-26 00:00:00.000	SP43	1	1	1				SUGITY CREATIVES	MOULDING WINDSHIELD		2017-09-26 10:40:00.000	2017-09-26 08:49:00.000				AP07	02	2017-09-26 00:00:00.000	0003	2	1R	2017-09-26 08:49:00.000																									2017-09-26 16:57:37.710				0		0		0		0		0		0	0			0		0	0	SUNTER 1		755330K01000				9722D10	THAILAND	SEA	A3-DG	R11700016200100018	001	CT3	10/09/2017				

R117000162	0003	2		807B	1	1R	SP17092615			755330K01000	S004	3	2017-09-26 00:00:00.000	SP43	1	1	1				SUGITY CREATIVES	MOULDING WINDSHIELD		2017-09-26 10:40:00.000	2017-09-26 08:49:00.000				AP07	02	2017-09-26 00:00:00.000	0003	2	1R	2017-09-26 08:49:00.000																									2017-09-26 16:57:37.710				0		0		0		0		0		0	0			0		0	0	SUNTER 1		755330K01000				9722D10	THAILAND	SEA	A3-DG	R11700016200100019	001	CT3	10/09/2017				

R117000162	0003	2		807B	1	1R	SP17092615			755330K01000	S004	3	2017-09-26 00:00:00.000	SP43	1	1	1				SUGITY CREATIVES	MOULDING WINDSHIELD		2017-09-26 10:40:00.000	2017-09-26 08:49:00.000				AP07	02	2017-09-26 00:00:00.000	0003	2	1R	2017-09-26 08:49:00.000																									2017-09-26 16:57:37.710				0		0		0		0		0		0	0			0		0	0	SUNTER 1		755330K01000				9722D10	THAILAND	SEA	A3-DG	R11700016200100020	001	CT3	10/09/2017				

R117000162	0003	2		807B	1	1R	SP17092615			755330K01000	S004	3	2017-09-26 00:00:00.000	SP43	1	1	1				SUGITY CREATIVES	MOULDING WINDSHIELD		2017-09-26 10:40:00.000	2017-09-26 08:49:00.000				AP07	02	2017-09-26 00:00:00.000	0003	2	1R	2017-09-26 08:49:00.000																									2017-09-26 16:57:37.710				0		0		0		0		0		0	0			0		0	0	SUNTER 1		755330K01000				9722D10	THAILAND	SEA	A3-DG	R11700016200100021	001	CT3	10/09/2017				

R117000162	0003	2		807B	1	1R	SP17092615			755330K01000	S004	3	2017-09-26 00:00:00.000	SP43	1	1	1				SUGITY CREATIVES	MOULDING WINDSHIELD		2017-09-26 10:40:00.000	2017-09-26 08:49:00.000				AP07	02	2017-09-26 00:00:00.000	0003	2	1R	2017-09-26 08:49:00.000																									2017-09-26 16:57:37.710				0		0		0		0		0		0	0			0		0	0	SUNTER 1		755330K01000				9722D10	THAILAND	SEA	A3-DG	R11700016200100022	001	CT3	10/09/2017				

R117000162	0003	2		807B	1	1R	SP17092615			755330K01000	S004	3	2017-09-26 00:00:00.000	SP43	1	1	1				SUGITY CREATIVES	MOULDING WINDSHIELD		2017-09-26 10:40:00.000	2017-09-26 08:49:00.000				AP07	02	2017-09-26 00:00:00.000	0003	2	1R	2017-09-26 08:49:00.000																									2017-09-26 16:57:37.710				0		0		0		0		0		0	0			0		0	0	SUNTER 1		755330K01000				9722D10	THAILAND	SEA	A3-DG	R11700016200100023	001	CT3	10/09/2017				

R117000162	0003	2		807B	1	1R	SP17092615			755330K01000	S004	3	2017-09-26 00:00:00.000	SP43	1	1	1				SUGITY CREATIVES	MOULDING WINDSHIELD		2017-09-26 10:40:00.000	2017-09-26 08:49:00.000				AP07	02	2017-09-26 00:00:00.000	0003	2	1R	2017-09-26 08:49:00.000																									2017-09-26 16:57:37.710				0		0		0		0		0		0	0			0		0	0	SUNTER 1		755330K01000				9722D10	THAILAND	SEA	A3-DG	R11700016200100024	001	CT3	10/09/2017				

R117000162	0003	2		807B	1	1R	SP17092615			755330K01000	S004	3	2017-09-26 00:00:00.000	SP43	1	1	1				SUGITY CREATIVES	MOULDING WINDSHIELD		2017-09-26 10:40:00.000	2017-09-26 08:49:00.000				AP07	02	2017-09-26 00:00:00.000	0003	2	1R	2017-09-26 08:49:00.000																									2017-09-26 16:57:37.710				0		0		0		0		0		0	0			0		0	0	SUNTER 1		755330K01000				9722D10	THAILAND	SEA	A3-DG	R11700016200100025	001	CT3	10/09/2017				

R117000162	0003	2		807B	1	1R	SP17092615			755330K01000	S004	3	2017-09-26 00:00:00.000	SP43	1	1	1				SUGITY CREATIVES	MOULDING WINDSHIELD		2017-09-26 10:40:00.000	2017-09-26 08:49:00.000				AP07	02	2017-09-26 00:00:00.000	0003	2	1R	2017-09-26 08:49:00.000																									2017-09-26 16:57:37.710				0		0		0		0		0		0	0			0		0	0	SUNTER 1		755330K01000				9722D10	THAILAND	SEA	A3-DG	R11700016200100026	001	CT3	10/09/2017				

R117000162	0003	2		807B	1	1R	SP17092615			755330K01000	S004	3	2017-09-26 00:00:00.000	SP43	1	1	1				SUGITY CREATIVES	MOULDING WINDSHIELD		2017-09-26 10:40:00.000	2017-09-26 08:49:00.000				AP07	02	2017-09-26 00:00:00.000	0003	2	1R	2017-09-26 08:49:00.000																									2017-09-26 16:57:37.710				0		0		0		0		0		0	0			0		0	0	SUNTER 1		755330K01000				9722D10	THAILAND	SEA	A3-DG	R11700016200100027	001	CT3	10/09/2017				

R117000162	0003	2		807B	1	1R	SP17092615			755330K01000	S004	3	2017-09-26 00:00:00.000	SP43	1	1	1				SUGITY CREATIVES	MOULDING WINDSHIELD		2017-09-26 10:40:00.000	2017-09-26 08:49:00.000				AP07	02	2017-09-26 00:00:00.000	0003	2	1R	2017-09-26 08:49:00.000																									2017-09-26 16:57:37.710				0		0		0		0		0		0	0			0		0	0	SUNTER 1		755330K01000				9722D10	THAILAND	SEA	A3-DG	R11700016200100028	001	CT3	10/09/2017				

R117000162	0003	2		807B	1	1R	SP17092615			755330K01000	S004	3	2017-09-26 00:00:00.000	SP43	1	1	1				SUGITY CREATIVES	MOULDING WINDSHIELD		2017-09-26 10:40:00.000	2017-09-26 08:49:00.000				AP07	02	2017-09-26 00:00:00.000	0003	2	1R	2017-09-26 08:49:00.000																									2017-09-26 16:57:37.710				0		0		0		0		0		0	0			0		0	0	SUNTER 1		755330K01000				9722D10	THAILAND	SEA	A3-DG	R11700016200100029	001	CT3	10/09/2017				

R117000162	0003	2		807B	1	1R	SP17092615			755330K01000	S004	3	2017-09-26 00:00:00.000	SP43	1	1	1				SUGITY CREATIVES	MOULDING WINDSHIELD		2017-09-26 10:40:00.000	2017-09-26 08:49:00.000				AP07	02	2017-09-26 00:00:00.000	0003	2	1R	2017-09-26 08:49:00.000																									2017-09-26 16:57:37.710				0		0		0		0		0		0	0			0		0	0	SUNTER 1		755330K01000				9722D10	THAILAND	SEA	A3-DG	R11700016200100030	001	CT3	10/09/2017				

R117000162	0003	2		807B	1	1R	SP17092615			755330K01000	S004	3	2017-09-26 00:00:00.000	SP43	1	1	1				SUGITY CREATIVES	MOULDING WINDSHIELD		2017-09-26 10:40:00.000	2017-09-26 08:49:00.000				AP07	02	2017-09-26 00:00:00.000	0003	2	1R	2017-09-26 08:49:00.000																									2017-09-26 16:57:37.710				0		0		0		0		0		0	0			0		0	0	SUNTER 1		755330K01000				9722D10	THAILAND	SEA	A3-DG	R11700016200100031	001	CT3	10/09/2017				

R117000162	0003	2		807B	1	1R	SP17092615			755330K01000	S004	3	2017-09-26 00:00:00.000	SP43	1	1	1				SUGITY CREATIVES	MOULDING WINDSHIELD		2017-09-26 10:40:00.000	2017-09-26 08:49:00.000				AP07	02	2017-09-26 00:00:00.000	0003	2	1R	2017-09-26 08:49:00.000																									2017-09-26 16:57:37.710				0		0		0		0		0		0	0			0		0	0	SUNTER 1		755330K01000				9722D10	THAILAND	SEA	A3-DG	R11700016200100032	001	CT3	10/09/2017				

R117000162	0003	2		807B	1	1R	SP17092615			755330K01000	S004	3	2017-09-26 00:00:00.000	SP43	1	1	1				SUGITY CREATIVES	MOULDING WINDSHIELD		2017-09-26 10:40:00.000	2017-09-26 08:49:00.000				AP07	02	2017-09-26 00:00:00.000	0003	2	1R	2017-09-26 08:49:00.000																									2017-09-26 16:57:37.710				0		0		0		0		0		0	0			0		0	0	SUNTER 1		755330K01000				9722D10	THAILAND	SEA	A3-DG	R11700016200100033	001	CT3	10/09/2017				

R117000162	0003	2		807B	1	1R	SP17092615			755330K01000	S004	3	2017-09-26 00:00:00.000	SP43	1	1	1				SUGITY CREATIVES	MOULDING WINDSHIELD		2017-09-26 10:40:00.000	2017-09-26 08:49:00.000				AP07	02	2017-09-26 00:00:00.000	0003	2	1R	2017-09-26 08:49:00.000																									2017-09-26 16:57:37.710				0		0		0		0		0		0	0			0		0	0	SUNTER 1		755330K01000				9722D10	THAILAND	SEA	A3-DG	R11700016200100034	001	CT3	10/09/2017				

R117000162	0003	2		807B	1	1R	SP17092615			755330K01000	S004	3	2017-09-26 00:00:00.000	SP43	1	1	1				SUGITY CREATIVES	MOULDING WINDSHIELD		2017-09-26 10:40:00.000	2017-09-26 08:49:00.000				AP07	02	2017-09-26 00:00:00.000	0003	2	1R	2017-09-26 08:49:00.000																									2017-09-26 16:57:37.710				0		0		0		0		0		0	0			0		0	0	SUNTER 1		755330K01000				9722D10	THAILAND	SEA	A3-DG	R11700016200100035	001	CT3	10/09/2017				

R117000162	0003	2		807B	1	1R	SP17092615			755330K01000	S004	3	2017-09-26 00:00:00.000	SP43	1	1	1				SUGITY CREATIVES	MOULDING WINDSHIELD		2017-09-26 10:40:00.000	2017-09-26 08:49:00.000				AP07	02	2017-09-26 00:00:00.000	0003	2	1R	2017-09-26 08:49:00.000																									2017-09-26 16:57:37.710				0		0		0		0		0		0	0			0		0	0	SUNTER 1		755330K01000				9722D10	THAILAND	SEA	A3-DG	R11700016200100036	001	CT3	10/09/2017				

R117000162	0003	2		807B	1	1R	SP17092615			757100K01200	S005	3	2017-09-26 00:00:00.000	SP46	1	1	1				SUGITY CREATIVES	MOULDING A/S,FR RH		2017-09-26 10:40:00.000	2017-09-26 08:49:00.000				AP07	02	2017-09-26 00:00:00.000	0003	2	1R	2017-09-26 08:49:00.000																									2017-09-26 16:57:37.710				0		0		0		0		0		0	0			0		0	0	SUNTER 1		757100K01200				9722D10	THAILAND	SEA	A3-DG	R11700016200200001	001	CT4	10/09/2017				

R117000162	0003	2		807B	1	1R	SP17092615			757100K01200	S005	3	2017-09-26 00:00:00.000	SP46	1	1	1				SUGITY CREATIVES	MOULDING A/S,FR RH		2017-09-26 10:40:00.000	2017-09-26 08:49:00.000				AP07	02	2017-09-26 00:00:00.000	0003	2	1R	2017-09-26 08:49:00.000																									2017-09-26 16:57:37.710				0		0		0		0		0		0	0			0		0	0	SUNTER 1		757100K01200				9722D10	THAILAND	SEA	A3-DG	R11700016200200002	001	CT4	10/09/2017				

R117000162	0003	2		807B	1	1R	SP17092615			757100K01200	S005	3	2017-09-26 00:00:00.000	SP46	1	1	1				SUGITY CREATIVES	MOULDING A/S,FR RH		2017-09-26 10:40:00.000	2017-09-26 08:49:00.000				AP07	02	2017-09-26 00:00:00.000	0003	2	1R	2017-09-26 08:49:00.000																									2017-09-26 16:57:37.710				0		0		0		0		0		0	0			0		0	0	SUNTER 1		757100K01200				9722D10	THAILAND	SEA	A3-DG	R11700016200200003	001	CT4	10/09/2017				

R117000162	0003	2		807B	1	1R	SP17092615			757100K01200	S005	3	2017-09-26 00:00:00.000	SP46	1	1	1				SUGITY CREATIVES	MOULDING A/S,FR RH		2017-09-26 10:40:00.000	2017-09-26 08:49:00.000				AP07	02	2017-09-26 00:00:00.000	0003	2	1R	2017-09-26 08:49:00.000																									2017-09-26 16:57:37.710				0		0		0		0		0		0	0			0		0	0	SUNTER 1		757100K01200				9722D10	THAILAND	SEA	A3-DG	R11700016200200004	001	CT4	10/09/2017				

R117000162	0003	2		807B	1	1R	SP17092615			757100K01200	S005	3	2017-09-26 00:00:00.000	SP46	1	1	1				SUGITY CREATIVES	MOULDING A/S,FR RH		2017-09-26 10:40:00.000	2017-09-26 08:49:00.000				AP07	02	2017-09-26 00:00:00.000	0003	2	1R	2017-09-26 08:49:00.000																									2017-09-26 16:57:37.710				0		0		0		0		0		0	0			0		0	0	SUNTER 1		757100K01200				9722D10	THAILAND	SEA	A3-DG	R11700016200200005	001	CT4	10/09/2017				

R117000162	0003	2		807B	1	1R	SP17092615			757100K01200	S005	3	2017-09-26 00:00:00.000	SP46	1	1	1				SUGITY CREATIVES	MOULDING A/S,FR RH		2017-09-26 10:40:00.000	2017-09-26 08:49:00.000				AP07	02	2017-09-26 00:00:00.000	0003	2	1R	2017-09-26 08:49:00.000																									2017-09-26 16:57:37.710				0		0		0		0		0		0	0			0		0	0	SUNTER 1		757100K01200				9722D10	THAILAND	SEA	A3-DG	R11700016200200006	001	CT4	10/09/2017				

R117000162	0003	2		807B	1	1R	SP17092615			757100K01200	S005	3	2017-09-26 00:00:00.000	SP46	1	1	1				SUGITY CREATIVES	MOULDING A/S,FR RH		2017-09-26 10:40:00.000	2017-09-26 08:49:00.000				AP07	02	2017-09-26 00:00:00.000	0003	2	1R	2017-09-26 08:49:00.000																									2017-09-26 16:57:37.710				0		0		0		0		0		0	0			0		0	0	SUNTER 1		757100K01200				9722D10	THAILAND	SEA	A3-DG	R11700016200200007	001	CT4	10/09/2017				

R117000162	0003	2		807B	1	1R	SP17092615			757100K01200	S005	3	2017-09-26 00:00:00.000	SP46	1	1	1				SUGITY CREATIVES	MOULDING A/S,FR RH		2017-09-26 10:40:00.000	2017-09-26 08:49:00.000				AP07	02	2017-09-26 00:00:00.000	0003	2	1R	2017-09-26 08:49:00.000																									2017-09-26 16:57:37.710				0		0		0		0		0		0	0			0		0	0	SUNTER 1		757100K01200				9722D10	THAILAND	SEA	A3-DG	R11700016200200008	001	CT4	10/09/2017				

R117000162	0003	2		807B	1	1R	SP17092615			757100K01200	S005	3	2017-09-26 00:00:00.000	SP46	1	1	1				SUGITY CREATIVES	MOULDING A/S,FR RH		2017-09-26 10:40:00.000	2017-09-26 08:49:00.000				AP07	02	2017-09-26 00:00:00.000	0003	2	1R	2017-09-26 08:49:00.000																									2017-09-26 16:57:37.710				0		0		0		0		0		0	0			0		0	0	SUNTER 1		757100K01200				9722D10	THAILAND	SEA	A3-DG	R11700016200200009	001	CT4	10/09/2017				

R117000162	0003	2		807B	1	1R	SP17092615			757100K01200	S005	3	2017-09-26 00:00:00.000	SP46	1	1	1				SUGITY CREATIVES	MOULDING A/S,FR RH		2017-09-26 10:40:00.000	2017-09-26 08:49:00.000				AP07	02	2017-09-26 00:00:00.000	0003	2	1R	2017-09-26 08:49:00.000																									2017-09-26 16:57:37.710				0		0		0		0		0		0	0			0		0	0	SUNTER 1		757100K01200				9722D10	THAILAND	SEA	A3-DG	R11700016200200010	001	CT4	10/09/2017				

R117000162	0003	2		807B	1	1R	SP17092615			757100K01200	S005	3	2017-09-26 00:00:00.000	SP46	1	1	1				SUGITY CREATIVES	MOULDING A/S,FR RH		2017-09-26 10:40:00.000	2017-09-26 08:49:00.000				AP07	02	2017-09-26 00:00:00.000	0003	2	1R	2017-09-26 08:49:00.000																									2017-09-26 16:57:37.710				0		0		0		0		0		0	0			0		0	0	SUNTER 1		757100K01200				9722D10	THAILAND	SEA	A3-DG	R11700016200200011	001	CT4	10/09/2017				

R117000162	0003	2		807B	1	1R	SP17092615			757100K01200	S005	3	2017-09-26 00:00:00.000	SP46	1	1	1				SUGITY CREATIVES	MOULDING A/S,FR RH		2017-09-26 10:40:00.000	2017-09-26 08:49:00.000				AP07	02	2017-09-26 00:00:00.000	0003	2	1R	2017-09-26 08:49:00.000																									2017-09-26 16:57:37.710				0		0		0		0		0		0	0			0		0	0	SUNTER 1		757100K01200				9722D10	THAILAND	SEA	A3-DG	R11700016200200012	001	CT4	10/09/2017				

R117000162	0003	2		807B	1	1R	SP17092615			757100K01200	S005	3	2017-09-26 00:00:00.000	SP46	1	1	1				SUGITY CREATIVES	MOULDING A/S,FR RH		2017-09-26 10:40:00.000	2017-09-26 08:49:00.000				AP07	02	2017-09-26 00:00:00.000	0003	2	1R	2017-09-26 08:49:00.000																									2017-09-26 16:57:37.710				0		0		0		0		0		0	0			0		0	0	SUNTER 1		757100K01200				9722D10	THAILAND	SEA	A3-DG	R11700016200200013	001	CT4	10/09/2017				

R117000162	0003	2		807B	1	1R	SP17092615			757100K01200	S005	3	2017-09-26 00:00:00.000	SP46	1	1	1				SUGITY CREATIVES	MOULDING A/S,FR RH		2017-09-26 10:40:00.000	2017-09-26 08:49:00.000				AP07	02	2017-09-26 00:00:00.000	0003	2	1R	2017-09-26 08:49:00.000																									2017-09-26 16:57:37.710				0		0		0		0		0		0	0			0		0	0	SUNTER 1		757100K01200				9722D10	THAILAND	SEA	A3-DG	R11700016200200014	001	CT4	10/09/2017				

R117000162	0003	2		807B	1	1R	SP17092615			757100K01200	S005	3	2017-09-26 00:00:00.000	SP46	1	1	1				SUGITY CREATIVES	MOULDING A/S,FR RH		2017-09-26 10:40:00.000	2017-09-26 08:49:00.000				AP07	02	2017-09-26 00:00:00.000	0003	2	1R	2017-09-26 08:49:00.000																									2017-09-26 16:57:37.710				0		0		0		0		0		0	0			0		0	0	SUNTER 1		757100K01200				9722D10	THAILAND	SEA	A3-DG	R11700016200200015	001	CT4	10/09/2017				

R117000162	0003	2		807B	1	1R	SP17092615			757100K01200	S005	3	2017-09-26 00:00:00.000	SP46	1	1	1				SUGITY CREATIVES	MOULDING A/S,FR RH		2017-09-26 10:40:00.000	2017-09-26 08:49:00.000				AP07	02	2017-09-26 00:00:00.000	0003	2	1R	2017-09-26 08:49:00.000																									2017-09-26 16:57:37.710				0		0		0		0		0		0	0			0		0	0	SUNTER 1		757100K01200				9722D10	THAILAND	SEA	A3-DG	R11700016200200016	001	CT4	10/09/2017				

R117000162	0003	2		807B	1	1R	SP17092615			757100K01200	S005	3	2017-09-26 00:00:00.000	SP46	1	1	1				SUGITY CREATIVES	MOULDING A/S,FR RH		2017-09-26 10:40:00.000	2017-09-26 08:49:00.000				AP07	02	2017-09-26 00:00:00.000	0003	2	1R	2017-09-26 08:49:00.000																									2017-09-26 16:57:37.710				0		0		0		0		0		0	0			0		0	0	SUNTER 1		757100K01200				9722D10	THAILAND	SEA	A3-DG	R11700016200200017	001	CT4	10/09/2017				

R117000162	0003	2		807B	1	1R	SP17092615			757100K01200	S005	3	2017-09-26 00:00:00.000	SP46	1	1	1				SUGITY CREATIVES	MOULDING A/S,FR RH		2017-09-26 10:40:00.000	2017-09-26 08:49:00.000				AP07	02	2017-09-26 00:00:00.000	0003	2	1R	2017-09-26 08:49:00.000																									2017-09-26 16:57:37.710				0		0		0		0		0		0	0			0		0	0	SUNTER 1		757100K01200				9722D10	THAILAND	SEA	A3-DG	R11700016200200018	001	CT4	10/09/2017				

R117000162	0003	2		807B	1	1R	SP17092615			757100K01200	S005	3	2017-09-26 00:00:00.000	SP46	1	1	1				SUGITY CREATIVES	MOULDING A/S,FR RH		2017-09-26 10:40:00.000	2017-09-26 08:49:00.000				AP07	02	2017-09-26 00:00:00.000	0003	2	1R	2017-09-26 08:49:00.000																									2017-09-26 16:57:37.710				0		0		0		0		0		0	0			0		0	0	SUNTER 1		757100K01200				9722D10	THAILAND	SEA	A3-DG	R11700016200200019	001	CT4	10/09/2017				

R117000162	0003	2		807B	1	1R	SP17092615			757100K01200	S005	3	2017-09-26 00:00:00.000	SP46	1	1	1				SUGITY CREATIVES	MOULDING A/S,FR RH		2017-09-26 10:40:00.000	2017-09-26 08:49:00.000				AP07	02	2017-09-26 00:00:00.000	0003	2	1R	2017-09-26 08:49:00.000																									2017-09-26 16:57:37.710				0		0		0		0		0		0	0			0		0	0	SUNTER 1		757100K01200				9722D10	THAILAND	SEA	A3-DG	R11700016200200020	001	CT4	10/09/2017				

R117000162	0003	2		807B	1	1R	SP17092615			757100K01200	S005	3	2017-09-26 00:00:00.000	SP46	1	1	1				SUGITY CREATIVES	MOULDING A/S,FR RH		2017-09-26 10:40:00.000	2017-09-26 08:49:00.000				AP07	02	2017-09-26 00:00:00.000	0003	2	1R	2017-09-26 08:49:00.000																									2017-09-26 16:57:37.710				0		0		0		0		0		0	0			0		0	0	SUNTER 1		757100K01200				9722D10	THAILAND	SEA	A3-DG	R11700016200200021	001	CT4	10/09/2017				

R117000162	0003	2		807B	1	1R	SP17092615			757100K01200	S005	3	2017-09-26 00:00:00.000	SP46	1	1	1				SUGITY CREATIVES	MOULDING A/S,FR RH		2017-09-26 10:40:00.000	2017-09-26 08:49:00.000				AP07	02	2017-09-26 00:00:00.000	0003	2	1R	2017-09-26 08:49:00.000																									2017-09-26 16:57:37.710				0		0		0		0		0		0	0			0		0	0	SUNTER 1		757100K01200				9722D10	THAILAND	SEA	A3-DG	R11700016200200022	001	CT4	10/09/2017				

R117000162	0003	2		807B	1	1R	SP17092615			757100K01200	S005	3	2017-09-26 00:00:00.000	SP46	1	1	1				SUGITY CREATIVES	MOULDING A/S,FR RH		2017-09-26 10:40:00.000	2017-09-26 08:49:00.000				AP07	02	2017-09-26 00:00:00.000	0003	2	1R	2017-09-26 08:49:00.000																									2017-09-26 16:57:37.710				0		0		0		0		0		0	0			0		0	0	SUNTER 1		757100K01200				9722D10	THAILAND	SEA	A3-DG	R11700016200200023	001	CT4	10/09/2017				

R117000162	0003	2		807B	1	1R	SP17092615			757100K01200	S005	3	2017-09-26 00:00:00.000	SP46	1	1	1				SUGITY CREATIVES	MOULDING A/S,FR RH		2017-09-26 10:40:00.000	2017-09-26 08:49:00.000				AP07	02	2017-09-26 00:00:00.000	0003	2	1R	2017-09-26 08:49:00.000																									2017-09-26 16:57:37.710				0		0		0		0		0		0	0			0		0	0	SUNTER 1		757100K01200				9722D10	THAILAND	SEA	A3-DG	R11700016200200024	001	CT4	10/09/2017				

R117000162	0003	2		807B	1	1R	SP17092615			757100K01200	S005	3	2017-09-26 00:00:00.000	SP46	1	1	1				SUGITY CREATIVES	MOULDING A/S,FR RH		2017-09-26 10:40:00.000	2017-09-26 08:49:00.000				AP07	02	2017-09-26 00:00:00.000	0003	2	1R	2017-09-26 08:49:00.000																									2017-09-26 16:57:37.710				0		0		0		0		0		0	0			0		0	0	SUNTER 1		757100K01200				9722D10	THAILAND	SEA	A3-DG	R11700016200200025	001	CT4	10/09/2017				

R117000162	0003	2		807B	1	1R	SP17092615			757100K01200	S005	3	2017-09-26 00:00:00.000	SP46	1	1	1				SUGITY CREATIVES	MOULDING A/S,FR RH		2017-09-26 10:40:00.000	2017-09-26 08:49:00.000				AP07	02	2017-09-26 00:00:00.000	0003	2	1R	2017-09-26 08:49:00.000																									2017-09-26 16:57:37.710				0		0		0		0		0		0	0			0		0	0	SUNTER 1		757100K01200				9722D10	THAILAND	SEA	A3-DG	R11700016200200026	001	CT4	10/09/2017				

R117000162	0003	2		807B	1	1R	SP17092615			757100K01200	S005	3	2017-09-26 00:00:00.000	SP46	1	1	1				SUGITY CREATIVES	MOULDING A/S,FR RH		2017-09-26 10:40:00.000	2017-09-26 08:49:00.000				AP07	02	2017-09-26 00:00:00.000	0003	2	1R	2017-09-26 08:49:00.000																									2017-09-26 16:57:37.710				0		0		0		0		0		0	0			0		0	0	SUNTER 1		757100K01200				9722D10	THAILAND	SEA	A3-DG	R11700016200200027	001	CT4	10/09/2017				

R117000162	0003	2		807B	1	1R	SP17092615			757100K01200	S005	3	2017-09-26 00:00:00.000	SP46	1	1	1				SUGITY CREATIVES	MOULDING A/S,FR RH		2017-09-26 10:40:00.000	2017-09-26 08:49:00.000				AP07	02	2017-09-26 00:00:00.000	0003	2	1R	2017-09-26 08:49:00.000																									2017-09-26 16:57:37.710				0		0		0		0		0		0	0			0		0	0	SUNTER 1		757100K01200				9722D10	THAILAND	SEA	A3-DG	R11700016200200028	001	CT4	10/09/2017				

R117000162	0003	2		807B	1	1R	SP17092615			757100K01200	S005	3	2017-09-26 00:00:00.000	SP46	1	1	1				SUGITY CREATIVES	MOULDING A/S,FR RH		2017-09-26 10:40:00.000	2017-09-26 08:49:00.000				AP07	02	2017-09-26 00:00:00.000	0003	2	1R	2017-09-26 08:49:00.000																									2017-09-26 16:57:37.710				0		0		0		0		0		0	0			0		0	0	SUNTER 1		757100K01200				9722D10	THAILAND	SEA	A3-DG	R11700016200200029	001	CT4	10/09/2017				

R117000162	0003	2		807B	1	1R	SP17092615			757100K01200	S005	3	2017-09-26 00:00:00.000	SP46	1	1	1				SUGITY CREATIVES	MOULDING A/S,FR RH		2017-09-26 10:40:00.000	2017-09-26 08:49:00.000				AP07	02	2017-09-26 00:00:00.000	0003	2	1R	2017-09-26 08:49:00.000																									2017-09-26 16:57:37.710				0		0		0		0		0		0	0			0		0	0	SUNTER 1		757100K01200				9722D10	THAILAND	SEA	A3-DG	R11700016200200030	001	CT4	10/09/2017				

R117000162	0003	2		807B	1	1R	SP17092615			757100K01200	S005	3	2017-09-26 00:00:00.000	SP46	1	1	1				SUGITY CREATIVES	MOULDING A/S,FR RH		2017-09-26 10:40:00.000	2017-09-26 08:49:00.000				AP07	02	2017-09-26 00:00:00.000	0003	2	1R	2017-09-26 08:49:00.000																									2017-09-26 16:57:37.710				0		0		0		0		0		0	0			0		0	0	SUNTER 1		757100K01200				9722D10	THAILAND	SEA	A3-DG	R11700016200200031	001	CT4	10/09/2017				

R117000162	0003	2		807B	1	1R	SP17092615			757100K01200	S005	3	2017-09-26 00:00:00.000	SP46	1	1	1				SUGITY CREATIVES	MOULDING A/S,FR RH		2017-09-26 10:40:00.000	2017-09-26 08:49:00.000				AP07	02	2017-09-26 00:00:00.000	0003	2	1R	2017-09-26 08:49:00.000																									2017-09-26 16:57:37.710				0		0		0		0		0		0	0			0		0	0	SUNTER 1		757100K01200				9722D10	THAILAND	SEA	A3-DG	R11700016200200032	001	CT4	10/09/2017				

R117000162	0003	2		807B	1	1R	SP17092615			757100K01200	S005	3	2017-09-26 00:00:00.000	SP46	1	1	1				SUGITY CREATIVES	MOULDING A/S,FR RH		2017-09-26 10:40:00.000	2017-09-26 08:49:00.000				AP07	02	2017-09-26 00:00:00.000	0003	2	1R	2017-09-26 08:49:00.000																									2017-09-26 16:57:37.710				0		0		0		0		0		0	0			0		0	0	SUNTER 1		757100K01200				9722D10	THAILAND	SEA	A3-DG	R11700016200200033	001	CT4	10/09/2017				

R117000162	0003	2		807B	1	1R	SP17092615			757100K01200	S005	3	2017-09-26 00:00:00.000	SP46	1	1	1				SUGITY CREATIVES	MOULDING A/S,FR RH		2017-09-26 10:40:00.000	2017-09-26 08:49:00.000				AP07	02	2017-09-26 00:00:00.000	0003	2	1R	2017-09-26 08:49:00.000																									2017-09-26 16:57:37.710				0		0		0		0		0		0	0			0		0	0	SUNTER 1		757100K01200				9722D10	THAILAND	SEA	A3-DG	R11700016200200034	001	CT4	10/09/2017				

R117000162	0003	2		807B	1	1R	SP17092615			757100K01200	S005	3	2017-09-26 00:00:00.000	SP46	1	1	1				SUGITY CREATIVES	MOULDING A/S,FR RH		2017-09-26 10:40:00.000	2017-09-26 08:49:00.000				AP07	02	2017-09-26 00:00:00.000	0003	2	1R	2017-09-26 08:49:00.000																									2017-09-26 16:57:37.710				0		0		0		0		0		0	0			0		0	0	SUNTER 1		757100K01200				9722D10	THAILAND	SEA	A3-DG	R11700016200200035	001	CT4	10/09/2017				

R117000162	0003	2		807B	1	1R	SP17092615			757100K01200	S005	3	2017-09-26 00:00:00.000	SP46	1	1	1				SUGITY CREATIVES	MOULDING A/S,FR RH		2017-09-26 10:40:00.000	2017-09-26 08:49:00.000				AP07	02	2017-09-26 00:00:00.000	0003	2	1R	2017-09-26 08:49:00.000																									2017-09-26 16:57:37.710				0		0		0		0		0		0	0			0		0	0	SUNTER 1		757100K01200				9722D10	THAILAND	SEA	A3-DG	R11700016200200036	001	CT4	10/09/2017				

R117000162	0003	2		807B	1	1R	SP17092615			757100K01200	S005	3	2017-09-26 00:00:00.000	SP46	1	1	1				SUGITY CREATIVES	MOULDING A/S,FR RH		2017-09-26 10:40:00.000	2017-09-26 08:49:00.000				AP07	02	2017-09-26 00:00:00.000	0003	2	1R	2017-09-26 08:49:00.000																									2017-09-26 16:57:37.710				0		0		0		0		0		0	0			0		0	0	SUNTER 1		757100K01200				9722D10	THAILAND	SEA	A3-DG	R11700016200200037	001	CT4	10/09/2017				

R117000162	0003	2		807B	1	1R	SP17092615			757100K01200	S005	3	2017-09-26 00:00:00.000	SP46	1	1	1				SUGITY CREATIVES	MOULDING A/S,FR RH		2017-09-26 10:40:00.000	2017-09-26 08:49:00.000				AP07	02	2017-09-26 00:00:00.000	0003	2	1R	2017-09-26 08:49:00.000																									2017-09-26 16:57:37.710				0		0		0		0		0		0	0			0		0	0	SUNTER 1		757100K01200				9722D10	THAILAND	SEA	A3-DG	R11700016200200038	001	CT4	10/09/2017				

R117000162	0003	2		807B	1	1R	SP17092615			757100K01200	S005	3	2017-09-26 00:00:00.000	SP46	1	1	1				SUGITY CREATIVES	MOULDING A/S,FR RH		2017-09-26 10:40:00.000	2017-09-26 08:49:00.000				AP07	02	2017-09-26 00:00:00.000	0003	2	1R	2017-09-26 08:49:00.000																									2017-09-26 16:57:37.710				0		0		0		0		0		0	0			0		0	0	SUNTER 1		757100K01200				9722D10	THAILAND	SEA	A3-DG	R11700016200200039	001	CT4	10/09/2017				

R117000162	0003	2		807B	1	1R	SP17092615			757100K01200	S005	3	2017-09-26 00:00:00.000	SP46	1	1	1				SUGITY CREATIVES	MOULDING A/S,FR RH		2017-09-26 10:40:00.000	2017-09-26 08:49:00.000				AP07	02	2017-09-26 00:00:00.000	0003	2	1R	2017-09-26 08:49:00.000																									2017-09-26 16:57:37.710				0		0		0		0		0		0	0			0		0	0	SUNTER 1		757100K01200				9722D10	THAILAND	SEA	A3-DG	R11700016200200040	001	CT4	10/09/2017				

R117000162	0003	2		807B	1	1R	SP17092615			757100K01200	S005	3	2017-09-26 00:00:00.000	SP46	1	1	1				SUGITY CREATIVES	MOULDING A/S,FR RH		2017-09-26 10:40:00.000	2017-09-26 08:49:00.000				AP07	02	2017-09-26 00:00:00.000	0003	2	1R	2017-09-26 08:49:00.000																									2017-09-26 16:57:37.710				0		0		0		0		0		0	0			0		0	0	SUNTER 1		757100K01200				9722D10	THAILAND	SEA	A3-DG	R11700016200200041	001	CT4	10/09/2017				

R117000162	0003	2		807B	1	1R	SP17092615			757100K01200	S005	3	2017-09-26 00:00:00.000	SP46	1	1	1				SUGITY CREATIVES	MOULDING A/S,FR RH		2017-09-26 10:40:00.000	2017-09-26 08:49:00.000				AP07	02	2017-09-26 00:00:00.000	0003	2	1R	2017-09-26 08:49:00.000																									2017-09-26 16:57:37.710				0		0		0		0		0		0	0			0		0	0	SUNTER 1		757100K01200				9722D10	THAILAND	SEA	A3-DG	R11700016200200042	001	CT4	10/09/2017				

R117000162	0003	2		807B	1	1R	SP17092615			757100K01200	S005	3	2017-09-26 00:00:00.000	SP46	1	1	1				SUGITY CREATIVES	MOULDING A/S,FR RH		2017-09-26 10:40:00.000	2017-09-26 08:49:00.000				AP07	02	2017-09-26 00:00:00.000	0003	2	1R	2017-09-26 08:49:00.000																									2017-09-26 16:57:37.710				0		0		0		0		0		0	0			0		0	0	SUNTER 1		757100K01200				9722D10	THAILAND	SEA	A3-DG	R11700016200200043	001	CT4	10/09/2017				

R117000162	0003	2		807B	1	1R	SP17092615			757100K01200	S005	3	2017-09-26 00:00:00.000	SP46	1	1	1				SUGITY CREATIVES	MOULDING A/S,FR RH		2017-09-26 10:40:00.000	2017-09-26 08:49:00.000				AP07	02	2017-09-26 00:00:00.000	0003	2	1R	2017-09-26 08:49:00.000																									2017-09-26 16:57:37.710				0		0		0		0		0		0	0			0		0	0	SUNTER 1		757100K01200				9722D10	THAILAND	SEA	A3-DG	R11700016200200044	001	CT4	10/09/2017				

R117000162	0003	2		807B	1	1R	SP17092615			757100K01200	S005	3	2017-09-26 00:00:00.000	SP46	1	1	1				SUGITY CREATIVES	MOULDING A/S,FR RH		2017-09-26 10:40:00.000	2017-09-26 08:49:00.000				AP07	02	2017-09-26 00:00:00.000	0003	2	1R	2017-09-26 08:49:00.000																									2017-09-26 16:57:37.710				0		0		0		0		0		0	0			0		0	0	SUNTER 1		757100K01200				9722D10	THAILAND	SEA	A3-DG	R11700016200200045	001	CT4	10/09/2017				

R117000162	0003	2		807B	1	1R	SP17092615			757100K01200	S005	3	2017-09-26 00:00:00.000	SP46	1	1	1				SUGITY CREATIVES	MOULDING A/S,FR RH		2017-09-26 10:40:00.000	2017-09-26 08:49:00.000				AP07	02	2017-09-26 00:00:00.000	0003	2	1R	2017-09-26 08:49:00.000																									2017-09-26 16:57:37.710				0		0		0		0		0		0	0			0		0	0	SUNTER 1		757100K01200				9722D10	THAILAND	SEA	A3-DG	R11700016200200046	001	CT4	10/09/2017				

R117000162	0003	2		807B	1	1R	SP17092615			757100K01200	S005	3	2017-09-26 00:00:00.000	SP46	1	1	1				SUGITY CREATIVES	MOULDING A/S,FR RH		2017-09-26 10:40:00.000	2017-09-26 08:49:00.000				AP07	02	2017-09-26 00:00:00.000	0003	2	1R	2017-09-26 08:49:00.000																									2017-09-26 16:57:37.710				0		0		0		0		0		0	0			0		0	0	SUNTER 1		757100K01200				9722D10	THAILAND	SEA	A3-DG	R11700016200200047	001	CT4	10/09/2017				

R117000162	0003	2		807B	1	1R	SP17092615			757100K01200	S005	3	2017-09-26 00:00:00.000	SP46	1	1	1				SUGITY CREATIVES	MOULDING A/S,FR RH		2017-09-26 10:40:00.000	2017-09-26 08:49:00.000				AP07	02	2017-09-26 00:00:00.000	0003	2	1R	2017-09-26 08:49:00.000																									2017-09-26 16:57:37.710				0		0		0		0		0		0	0			0		0	0	SUNTER 1		757100K01200				9722D10	THAILAND	SEA	A3-DG	R11700016200200048	001	CT4	10/09/2017				

R117000162	0003	2		807B	1	1R	SP17092615			757100K01200	S005	3	2017-09-26 00:00:00.000	SP46	1	1	1				SUGITY CREATIVES	MOULDING A/S,FR RH		2017-09-26 10:40:00.000	2017-09-26 08:49:00.000				AP07	02	2017-09-26 00:00:00.000	0003	2	1R	2017-09-26 08:49:00.000																									2017-09-26 16:57:37.710				0		0		0		0		0		0	0			0		0	0	SUNTER 1		757100K01200				9722D10	THAILAND	SEA	A3-DG	R11700016200200049	001	CT4	10/09/2017				

R117000162	0003	2		807B	1	1R	SP17092615			757100K01200	S005	3	2017-09-26 00:00:00.000	SP46	1	1	1				SUGITY CREATIVES	MOULDING A/S,FR RH		2017-09-26 10:40:00.000	2017-09-26 08:49:00.000				AP07	02	2017-09-26 00:00:00.000	0003	2	1R	2017-09-26 08:49:00.000																									2017-09-26 16:57:37.710				0		0		0		0		0		0	0			0		0	0	SUNTER 1		757100K01200				9722D10	THAILAND	SEA	A3-DG	R11700016200200050	001	CT4	10/09/2017				

R117000162	0003	2		807B	1	1R	SP17092615			757100K01200	S005	3	2017-09-26 00:00:00.000	SP46	1	1	1				SUGITY CREATIVES	MOULDING A/S,FR RH		2017-09-26 10:40:00.000	2017-09-26 08:49:00.000				AP07	02	2017-09-26 00:00:00.000	0003	2	1R	2017-09-26 08:49:00.000																									2017-09-26 16:57:37.710				0		0		0		0		0		0	0			0		0	0	SUNTER 1		757100K01200				9722D10	THAILAND	SEA	A3-DG	R11700016200200051	001	CT4	10/09/2017				

R117000162	0003	2		807B	1	1R	SP17092615			757100K01200	S005	3	2017-09-26 00:00:00.000	SP46	1	1	1				SUGITY CREATIVES	MOULDING A/S,FR RH		2017-09-26 10:40:00.000	2017-09-26 08:49:00.000				AP07	02	2017-09-26 00:00:00.000	0003	2	1R	2017-09-26 08:49:00.000																									2017-09-26 16:57:37.710				0		0		0		0		0		0	0			0		0	0	SUNTER 1		757100K01200				9722D10	THAILAND	SEA	A3-DG	R11700016200200052	001	CT4	10/09/2017				

R117000162	0003	2		807B	1	1R	SP17092615			757100K01200	S005	3	2017-09-26 00:00:00.000	SP46	1	1	1				SUGITY CREATIVES	MOULDING A/S,FR RH		2017-09-26 10:40:00.000	2017-09-26 08:49:00.000				AP07	02	2017-09-26 00:00:00.000	0003	2	1R	2017-09-26 08:49:00.000																									2017-09-26 16:57:37.710				0		0		0		0		0		0	0			0		0	0	SUNTER 1		757100K01200				9722D10	THAILAND	SEA	A3-DG	R11700016200200053	001	CT4	10/09/2017				

R117000162	0003	2		807B	1	1R	SP17092615			757100K01200	S005	3	2017-09-26 00:00:00.000	SP46	1	1	1				SUGITY CREATIVES	MOULDING A/S,FR RH		2017-09-26 10:40:00.000	2017-09-26 08:49:00.000				AP07	02	2017-09-26 00:00:00.000	0003	2	1R	2017-09-26 08:49:00.000																									2017-09-26 16:57:37.710				0		0		0		0		0		0	0			0		0	0	SUNTER 1		757100K01200				9722D10	THAILAND	SEA	A3-DG	R11700016200200054	001	CT4	10/09/2017				

R117000162	0003	2		807B	1	1R	SP17092615			757100K01200	S005	3	2017-09-26 00:00:00.000	SP46	1	1	1				SUGITY CREATIVES	MOULDING A/S,FR RH		2017-09-26 10:40:00.000	2017-09-26 08:49:00.000				AP07	02	2017-09-26 00:00:00.000	0003	2	1R	2017-09-26 08:49:00.000																									2017-09-26 16:57:37.710				0		0		0		0		0		0	0			0		0	0	SUNTER 1		757100K01200				9722D10	THAILAND	SEA	A3-DG	R11700016200200055	001	CT4	10/09/2017				

R117000162	0003	2		807B	1	1R	SP17092615			757100K01200	S005	3	2017-09-26 00:00:00.000	SP46	1	1	1				SUGITY CREATIVES	MOULDING A/S,FR RH		2017-09-26 10:40:00.000	2017-09-26 08:49:00.000				AP07	02	2017-09-26 00:00:00.000	0003	2	1R	2017-09-26 08:49:00.000																									2017-09-26 16:57:37.710				0		0		0		0		0		0	0			0		0	0	SUNTER 1		757100K01200				9722D10	THAILAND	SEA	A3-DG	R11700016200200056	001	CT4	10/09/2017				

R117000162	0003	2		807B	1	1R	SP17092615			757100K01200	S005	3	2017-09-26 00:00:00.000	SP46	1	1	1				SUGITY CREATIVES	MOULDING A/S,FR RH		2017-09-26 10:40:00.000	2017-09-26 08:49:00.000				AP07	02	2017-09-26 00:00:00.000	0003	2	1R	2017-09-26 08:49:00.000																									2017-09-26 16:57:37.710				0		0		0		0		0		0	0			0		0	0	SUNTER 1		757100K01200				9722D10	THAILAND	SEA	A3-DG	R11700016200200057	001	CT4	10/09/2017				

R117000162	0003	2		807B	1	1R	SP17092615			757100K01200	S005	3	2017-09-26 00:00:00.000	SP46	1	1	1				SUGITY CREATIVES	MOULDING A/S,FR RH		2017-09-26 10:40:00.000	2017-09-26 08:49:00.000				AP07	02	2017-09-26 00:00:00.000	0003	2	1R	2017-09-26 08:49:00.000																									2017-09-26 16:57:37.710				0		0		0		0		0		0	0			0		0	0	SUNTER 1		757100K01200				9722D10	THAILAND	SEA	A3-DG	R11700016200200058	001	CT4	10/09/2017				

R117000162	0003	2		807B	1	1R	SP17092615			757100K01200	S005	3	2017-09-26 00:00:00.000	SP46	1	1	1				SUGITY CREATIVES	MOULDING A/S,FR RH		2017-09-26 10:40:00.000	2017-09-26 08:49:00.000				AP07	02	2017-09-26 00:00:00.000	0003	2	1R	2017-09-26 08:49:00.000																									2017-09-26 16:57:37.710				0		0		0		0		0		0	0			0		0	0	SUNTER 1		757100K01200				9722D10	THAILAND	SEA	A3-DG	R11700016200200059	001	CT4	10/09/2017				

R117000162	0003	2		807B	1	1R	SP17092615			757100K01200	S005	3	2017-09-26 00:00:00.000	SP46	1	1	1				SUGITY CREATIVES	MOULDING A/S,FR RH		2017-09-26 10:40:00.000	2017-09-26 08:49:00.000				AP07	02	2017-09-26 00:00:00.000	0003	2	1R	2017-09-26 08:49:00.000																									2017-09-26 16:57:37.710				0		0		0		0		0		0	0			0		0	0	SUNTER 1		757100K01200				9722D10	THAILAND	SEA	A3-DG	R11700016200200060	001	CT4	10/09/2017				

R117000162	0003	2		807B	1	1R	SP17092615			757100K01200	S005	3	2017-09-26 00:00:00.000	SP46	1	1	1				SUGITY CREATIVES	MOULDING A/S,FR RH		2017-09-26 10:40:00.000	2017-09-26 08:49:00.000				AP07	02	2017-09-26 00:00:00.000	0003	2	1R	2017-09-26 08:49:00.000																									2017-09-26 16:57:37.710				0		0		0		0		0		0	0			0		0	0	SUNTER 1		757100K01200				9722D10	THAILAND	SEA	A3-DG	R11700016200200061	001	CT4	10/09/2017				

R117000162	0003	2		807B	1	1R	SP17092615			757100K01200	S005	3	2017-09-26 00:00:00.000	SP46	1	1	1				SUGITY CREATIVES	MOULDING A/S,FR RH		2017-09-26 10:40:00.000	2017-09-26 08:49:00.000				AP07	02	2017-09-26 00:00:00.000	0003	2	1R	2017-09-26 08:49:00.000																									2017-09-26 16:57:37.710				0		0		0		0		0		0	0			0		0	0	SUNTER 1		757100K01200				9722D10	THAILAND	SEA	A3-DG	R11700016200200062	001	CT4	10/09/2017				

R117000162	0003	2		807B	1	1R	SP17092615			757100K01200	S005	3	2017-09-26 00:00:00.000	SP46	1	1	1				SUGITY CREATIVES	MOULDING A/S,FR RH		2017-09-26 10:40:00.000	2017-09-26 08:49:00.000				AP07	02	2017-09-26 00:00:00.000	0003	2	1R	2017-09-26 08:49:00.000																									2017-09-26 16:57:37.710				0		0		0		0		0		0	0			0		0	0	SUNTER 1		757100K01200				9722D10	THAILAND	SEA	A3-DG	R11700016200200063	001	CT4	10/09/2017				

R117000162	0003	2		807B	1	1R	SP17092615			757100K01200	S005	3	2017-09-26 00:00:00.000	SP46	1	1	1				SUGITY CREATIVES	MOULDING A/S,FR RH		2017-09-26 10:40:00.000	2017-09-26 08:49:00.000				AP07	02	2017-09-26 00:00:00.000	0003	2	1R	2017-09-26 08:49:00.000																									2017-09-26 16:57:37.710				0		0		0		0		0		0	0			0		0	0	SUNTER 1		757100K01200				9722D10	THAILAND	SEA	A3-DG	R11700016200200064	001	CT4	10/09/2017				

R117000162	0003	2		807B	1	1R	SP17092615			757100K01200	S005	3	2017-09-26 00:00:00.000	SP46	1	1	1				SUGITY CREATIVES	MOULDING A/S,FR RH		2017-09-26 10:40:00.000	2017-09-26 08:49:00.000				AP07	02	2017-09-26 00:00:00.000	0003	2	1R	2017-09-26 08:49:00.000																									2017-09-26 16:57:37.710				0		0		0		0		0		0	0			0		0	0	SUNTER 1		757100K01200				9722D10	THAILAND	SEA	A3-DG	R11700016200200065	001	CT4	10/09/2017				

R117000162	0003	2		807B	1	1R	SP17092615			757100K01200	S005	3	2017-09-26 00:00:00.000	SP46	1	1	1				SUGITY CREATIVES	MOULDING A/S,FR RH		2017-09-26 10:40:00.000	2017-09-26 08:49:00.000				AP07	02	2017-09-26 00:00:00.000	0003	2	1R	2017-09-26 08:49:00.000																									2017-09-26 16:57:37.710				0		0		0		0		0		0	0			0		0	0	SUNTER 1		757100K01200				9722D10	THAILAND	SEA	A3-DG	R11700016200200066	001	CT4	10/09/2017				

R117000162	0003	2		807B	1	1R	SP17092615			757100K01200	S005	3	2017-09-26 00:00:00.000	SP46	1	1	1				SUGITY CREATIVES	MOULDING A/S,FR RH		2017-09-26 10:40:00.000	2017-09-26 08:49:00.000				AP07	02	2017-09-26 00:00:00.000	0003	2	1R	2017-09-26 08:49:00.000																									2017-09-26 16:57:37.710				0		0		0		0		0		0	0			0		0	0	SUNTER 1		757100K01200				9722D10	THAILAND	SEA	A3-DG	R11700016200200067	001	CT4	10/09/2017				

R117000162	0003	2		807B	1	1R	SP17092615			757100K01200	S005	3	2017-09-26 00:00:00.000	SP46	1	1	1				SUGITY CREATIVES	MOULDING A/S,FR RH		2017-09-26 10:40:00.000	2017-09-26 08:49:00.000				AP07	02	2017-09-26 00:00:00.000	0003	2	1R	2017-09-26 08:49:00.000																									2017-09-26 16:57:37.710				0		0		0		0		0		0	0			0		0	0	SUNTER 1		757100K01200				9722D10	THAILAND	SEA	A3-DG	R11700016200200068	001	CT4	10/09/2017				

R117000162	0003	2		807B	1	1R	SP17092615			757100K01200	S005	3	2017-09-26 00:00:00.000	SP46	1	1	1				SUGITY CREATIVES	MOULDING A/S,FR RH		2017-09-26 10:40:00.000	2017-09-26 08:49:00.000				AP07	02	2017-09-26 00:00:00.000	0003	2	1R	2017-09-26 08:49:00.000																									2017-09-26 16:57:37.710				0		0		0		0		0		0	0			0		0	0	SUNTER 1		757100K01200				9722D10	THAILAND	SEA	A3-DG	R11700016200200069	001	CT4	10/09/2017				

R117000162	0003	2		807B	1	1R	SP17092615			757100K01200	S005	3	2017-09-26 00:00:00.000	SP46	1	1	1				SUGITY CREATIVES	MOULDING A/S,FR RH		2017-09-26 10:40:00.000	2017-09-26 08:49:00.000				AP07	02	2017-09-26 00:00:00.000	0003	2	1R	2017-09-26 08:49:00.000																									2017-09-26 16:57:37.710				0		0		0		0		0		0	0			0		0	0	SUNTER 1		757100K01200				9722D10	THAILAND	SEA	A3-DG	R11700016200200070	001	CT4	10/09/2017				

R117000162	0003	2		807B	1	1R	SP17092615			757100K01200	S005	3	2017-09-26 00:00:00.000	SP46	1	1	1				SUGITY CREATIVES	MOULDING A/S,FR RH		2017-09-26 10:40:00.000	2017-09-26 08:49:00.000				AP07	02	2017-09-26 00:00:00.000	0003	2	1R	2017-09-26 08:49:00.000																									2017-09-26 16:57:37.710				0		0		0		0		0		0	0			0		0	0	SUNTER 1		757100K01200				9722D10	THAILAND	SEA	A3-DG	R11700016200200071	001	CT4	10/09/2017				

R117000162	0003	2		807B	1	1R	SP17092615			757100K01200	S005	3	2017-09-26 00:00:00.000	SP46	1	1	1				SUGITY CREATIVES	MOULDING A/S,FR RH		2017-09-26 10:40:00.000	2017-09-26 08:49:00.000				AP07	02	2017-09-26 00:00:00.000	0003	2	1R	2017-09-26 08:49:00.000																									2017-09-26 16:57:37.710				0		0		0		0		0		0	0			0		0	0	SUNTER 1		757100K01200				9722D10	THAILAND	SEA	A3-DG	R11700016200200072	001	CT4	10/09/2017				

R117000162	0003	2		807B	1	1R	SP17092615			757100K01200	S005	3	2017-09-26 00:00:00.000	SP46	1	1	1				SUGITY CREATIVES	MOULDING A/S,FR RH		2017-09-26 10:40:00.000	2017-09-26 08:49:00.000				AP07	02	2017-09-26 00:00:00.000	0003	2	1R	2017-09-26 08:49:00.000																									2017-09-26 16:57:37.710				0		0		0		0		0		0	0			0		0	0	SUNTER 1		757100K01200				9722D10	THAILAND	SEA	A3-DG	R11700016200200073	001	CT4	10/09/2017				

R117000162	0003	2		807B	1	1R	SP17092615			757100K01200	S005	3	2017-09-26 00:00:00.000	SP46	1	1	1				SUGITY CREATIVES	MOULDING A/S,FR RH		2017-09-26 10:40:00.000	2017-09-26 08:49:00.000				AP07	02	2017-09-26 00:00:00.000	0003	2	1R	2017-09-26 08:49:00.000																									2017-09-26 16:57:37.710				0		0		0		0		0		0	0			0		0	0	SUNTER 1		757100K01200				9722D10	THAILAND	SEA	A3-DG	R11700016200200074	001	CT4	10/09/2017				

R117000162	0003	2		807B	1	1R	SP17092615			757100K01200	S005	3	2017-09-26 00:00:00.000	SP46	1	1	1				SUGITY CREATIVES	MOULDING A/S,FR RH		2017-09-26 10:40:00.000	2017-09-26 08:49:00.000				AP07	02	2017-09-26 00:00:00.000	0003	2	1R	2017-09-26 08:49:00.000																									2017-09-26 16:57:37.710				0		0		0		0		0		0	0			0		0	0	SUNTER 1		757100K01200				9722D10	THAILAND	SEA	A3-DG	R11700016200200075	001	CT4	10/09/2017				

R117000162	0003	2		807B	1	1R	SP17092615			757100K01200	S005	3	2017-09-26 00:00:00.000	SP46	1	1	1				SUGITY CREATIVES	MOULDING A/S,FR RH		2017-09-26 10:40:00.000	2017-09-26 08:49:00.000				AP07	02	2017-09-26 00:00:00.000	0003	2	1R	2017-09-26 08:49:00.000																									2017-09-26 16:57:37.710				0		0		0		0		0		0	0			0		0	0	SUNTER 1		757100K01200				9722D10	THAILAND	SEA	A3-DG	R11700016200200076	001	CT4	10/09/2017				

R117000162	0003	2		807B	1	1R	SP17092615			757100K01200	S005	3	2017-09-26 00:00:00.000	SP46	1	1	1				SUGITY CREATIVES	MOULDING A/S,FR RH		2017-09-26 10:40:00.000	2017-09-26 08:49:00.000				AP07	02	2017-09-26 00:00:00.000	0003	2	1R	2017-09-26 08:49:00.000																									2017-09-26 16:57:37.710				0		0		0		0		0		0	0			0		0	0	SUNTER 1		757100K01200				9722D10	THAILAND	SEA	A3-DG	R11700016200200077	001	CT4	10/09/2017				

R117000162	0003	2		807B	1	1R	SP17092615			757100K01200	S005	3	2017-09-26 00:00:00.000	SP46	1	1	1				SUGITY CREATIVES	MOULDING A/S,FR RH		2017-09-26 10:40:00.000	2017-09-26 08:49:00.000				AP07	02	2017-09-26 00:00:00.000	0003	2	1R	2017-09-26 08:49:00.000																									2017-09-26 16:57:37.710				0		0		0		0		0		0	0			0		0	0	SUNTER 1		757100K01200				9722D10	THAILAND	SEA	A3-DG	R11700016200200078	001	CT4	10/09/2017				

R117000162	0003	2		807B	1	1R	SP17092615			757100K01200	S005	3	2017-09-26 00:00:00.000	SP46	1	1	1				SUGITY CREATIVES	MOULDING A/S,FR RH		2017-09-26 10:40:00.000	2017-09-26 08:49:00.000				AP07	02	2017-09-26 00:00:00.000	0003	2	1R	2017-09-26 08:49:00.000																									2017-09-26 16:57:37.710				0		0		0		0		0		0	0			0		0	0	SUNTER 1		757100K01200				9722D10	THAILAND	SEA	A3-DG	R11700016200200079	001	CT4	10/09/2017				

R117000162	0003	2		807B	1	1R	SP17092615			757100K01200	S005	3	2017-09-26 00:00:00.000	SP46	1	1	1				SUGITY CREATIVES	MOULDING A/S,FR RH		2017-09-26 10:40:00.000	2017-09-26 08:49:00.000				AP07	02	2017-09-26 00:00:00.000	0003	2	1R	2017-09-26 08:49:00.000																									2017-09-26 16:57:37.710				0		0		0		0		0		0	0			0		0	0	SUNTER 1		757100K01200				9722D10	THAILAND	SEA	A3-DG	R11700016200200080	001	CT4	10/09/2017				

R117000162	0003	2		807B	1	1R	SP17092615			757300K01200	S003	3	2017-09-26 00:00:00.000	SP47	1	1	1				SUGITY CREATIVES	MOULDING A/S,RR RH		2017-09-26 10:40:00.000	2017-09-26 08:49:00.000				AP07	02	2017-09-26 00:00:00.000	0003	2	1R	2017-09-26 08:49:00.000																									2017-09-26 16:57:37.710				0		0		0		0		0		0	0			0		0	0	SUNTER 1		757300K01200				9722D10	THAILAND	SEA	A3-DG	R11700016200300001	001	CT2	10/09/2017				

R117000162	0003	2		807B	1	1R	SP17092615			757300K01200	S003	3	2017-09-26 00:00:00.000	SP47	1	1	1				SUGITY CREATIVES	MOULDING A/S,RR RH		2017-09-26 10:40:00.000	2017-09-26 08:49:00.000				AP07	02	2017-09-26 00:00:00.000	0003	2	1R	2017-09-26 08:49:00.000																									2017-09-26 16:57:37.710				0		0		0		0		0		0	0			0		0	0	SUNTER 1		757300K01200				9722D10	THAILAND	SEA	A3-DG	R11700016200300002	001	CT2	10/09/2017				

R117000162	0003	2		807B	1	1R	SP17092615			757300K01200	S003	3	2017-09-26 00:00:00.000	SP47	1	1	1				SUGITY CREATIVES	MOULDING A/S,RR RH		2017-09-26 10:40:00.000	2017-09-26 08:49:00.000				AP07	02	2017-09-26 00:00:00.000	0003	2	1R	2017-09-26 08:49:00.000																									2017-09-26 16:57:37.710				0		0		0		0		0		0	0			0		0	0	SUNTER 1		757300K01200				9722D10	THAILAND	SEA	A3-DG	R11700016200300003	001	CT2	10/09/2017				

R117000162	0003	2		807B	1	1R	SP17092615			757300K01200	S003	3	2017-09-26 00:00:00.000	SP47	1	1	1				SUGITY CREATIVES	MOULDING A/S,RR RH		2017-09-26 10:40:00.000	2017-09-26 08:49:00.000				AP07	02	2017-09-26 00:00:00.000	0003	2	1R	2017-09-26 08:49:00.000																									2017-09-26 16:57:37.710				0		0		0		0		0		0	0			0		0	0	SUNTER 1		757300K01200				9722D10	THAILAND	SEA	A3-DG	R11700016200300004	001	CT2	10/09/2017				

R117000162	0003	2		807B	1	1R	SP17092615			757300K01200	S003	3	2017-09-26 00:00:00.000	SP47	1	1	1				SUGITY CREATIVES	MOULDING A/S,RR RH		2017-09-26 10:40:00.000	2017-09-26 08:49:00.000				AP07	02	2017-09-26 00:00:00.000	0003	2	1R	2017-09-26 08:49:00.000																									2017-09-26 16:57:37.710				0		0		0		0		0		0	0			0		0	0	SUNTER 1		757300K01200				9722D10	THAILAND	SEA	A3-DG	R11700016200300005	001	CT2	10/09/2017				

R117000162	0003	2		807B	1	1R	SP17092615			757300K01200	S003	3	2017-09-26 00:00:00.000	SP47	1	1	1				SUGITY CREATIVES	MOULDING A/S,RR RH		2017-09-26 10:40:00.000	2017-09-26 08:49:00.000				AP07	02	2017-09-26 00:00:00.000	0003	2	1R	2017-09-26 08:49:00.000																									2017-09-26 16:57:37.710				0		0		0		0		0		0	0			0		0	0	SUNTER 1		757300K01200				9722D10	THAILAND	SEA	A3-DG	R11700016200300006	001	CT2	10/09/2017				

R117000162	0003	2		807B	1	1R	SP17092615			757300K01200	S003	3	2017-09-26 00:00:00.000	SP47	1	1	1				SUGITY CREATIVES	MOULDING A/S,RR RH		2017-09-26 10:40:00.000	2017-09-26 08:49:00.000				AP07	02	2017-09-26 00:00:00.000	0003	2	1R	2017-09-26 08:49:00.000																									2017-09-26 16:57:37.710				0		0		0		0		0		0	0			0		0	0	SUNTER 1		757300K01200				9722D10	THAILAND	SEA	A3-DG	R11700016200300007	001	CT2	10/09/2017				

R117000162	0003	2		807B	1	1R	SP17092615			757300K01200	S003	3	2017-09-26 00:00:00.000	SP47	1	1	1				SUGITY CREATIVES	MOULDING A/S,RR RH		2017-09-26 10:40:00.000	2017-09-26 08:49:00.000				AP07	02	2017-09-26 00:00:00.000	0003	2	1R	2017-09-26 08:49:00.000																									2017-09-26 16:57:37.710				0		0		0		0		0		0	0			0		0	0	SUNTER 1		757300K01200				9722D10	THAILAND	SEA	A3-DG	R11700016200300008	001	CT2	10/09/2017				

R117000162	0003	2		807B	1	1R	SP17092615			757300K01200	S003	3	2017-09-26 00:00:00.000	SP47	1	1	1				SUGITY CREATIVES	MOULDING A/S,RR RH		2017-09-26 10:40:00.000	2017-09-26 08:49:00.000				AP07	02	2017-09-26 00:00:00.000	0003	2	1R	2017-09-26 08:49:00.000																									2017-09-26 16:57:37.710				0		0		0		0		0		0	0			0		0	0	SUNTER 1		757300K01200				9722D10	THAILAND	SEA	A3-DG	R11700016200300009	001	CT2	10/09/2017				

R117000162	0003	2		807B	1	1R	SP17092615			757300K01200	S003	3	2017-09-26 00:00:00.000	SP47	1	1	1				SUGITY CREATIVES	MOULDING A/S,RR RH		2017-09-26 10:40:00.000	2017-09-26 08:49:00.000				AP07	02	2017-09-26 00:00:00.000	0003	2	1R	2017-09-26 08:49:00.000																									2017-09-26 16:57:37.710				0		0		0		0		0		0	0			0		0	0	SUNTER 1		757300K01200				9722D10	THAILAND	SEA	A3-DG	R11700016200300010	001	CT2	10/09/2017				

R117000162	0003	2		807B	1	1R	SP17092615			757300K01200	S003	3	2017-09-26 00:00:00.000	SP47	1	1	1				SUGITY CREATIVES	MOULDING A/S,RR RH		2017-09-26 10:40:00.000	2017-09-26 08:49:00.000				AP07	02	2017-09-26 00:00:00.000	0003	2	1R	2017-09-26 08:49:00.000																									2017-09-26 16:57:37.710				0		0		0		0		0		0	0			0		0	0	SUNTER 1		757300K01200				9722D10	THAILAND	SEA	A3-DG	R11700016200300011	001	CT2	10/09/2017				

R117000162	0003	2		807B	1	1R	SP17092615			757300K01200	S003	3	2017-09-26 00:00:00.000	SP47	1	1	1				SUGITY CREATIVES	MOULDING A/S,RR RH		2017-09-26 10:40:00.000	2017-09-26 08:49:00.000				AP07	02	2017-09-26 00:00:00.000	0003	2	1R	2017-09-26 08:49:00.000																									2017-09-26 16:57:37.710				0		0		0		0		0		0	0			0		0	0	SUNTER 1		757300K01200				9722D10	THAILAND	SEA	A3-DG	R11700016200300012	001	CT2	10/09/2017				

R117000162	0003	2		807B	1	1R	SP17092615			757300K01200	S003	3	2017-09-26 00:00:00.000	SP47	1	1	1				SUGITY CREATIVES	MOULDING A/S,RR RH		2017-09-26 10:40:00.000	2017-09-26 08:49:00.000				AP07	02	2017-09-26 00:00:00.000	0003	2	1R	2017-09-26 08:49:00.000																									2017-09-26 16:57:37.710				0		0		0		0		0		0	0			0		0	0	SUNTER 1		757300K01200				9722D10	THAILAND	SEA	A3-DG	R11700016200300013	001	CT2	10/09/2017				

R117000162	0003	2		807B	1	1R	SP17092615			757300K01200	S003	3	2017-09-26 00:00:00.000	SP47	1	1	1				SUGITY CREATIVES	MOULDING A/S,RR RH		2017-09-26 10:40:00.000	2017-09-26 08:49:00.000				AP07	02	2017-09-26 00:00:00.000	0003	2	1R	2017-09-26 08:49:00.000																									2017-09-26 16:57:37.710				0		0		0		0		0		0	0			0		0	0	SUNTER 1		757300K01200				9722D10	THAILAND	SEA	A3-DG	R11700016200300014	001	CT2	10/09/2017				

R117000162	0003	2		807B	1	1R	SP17092615			757300K01200	S003	3	2017-09-26 00:00:00.000	SP47	1	1	1				SUGITY CREATIVES	MOULDING A/S,RR RH		2017-09-26 10:40:00.000	2017-09-26 08:49:00.000				AP07	02	2017-09-26 00:00:00.000	0003	2	1R	2017-09-26 08:49:00.000																									2017-09-26 16:57:37.710				0		0		0		0		0		0	0			0		0	0	SUNTER 1		757300K01200				9722D10	THAILAND	SEA	A3-DG	R11700016200300015	001	CT2	10/09/2017				

R117000162	0003	2		807B	1	1R	SP17092615			757300K01200	S003	3	2017-09-26 00:00:00.000	SP47	1	1	1				SUGITY CREATIVES	MOULDING A/S,RR RH		2017-09-26 10:40:00.000	2017-09-26 08:49:00.000				AP07	02	2017-09-26 00:00:00.000	0003	2	1R	2017-09-26 08:49:00.000																									2017-09-26 16:57:37.710				0		0		0		0		0		0	0			0		0	0	SUNTER 1		757300K01200				9722D10	THAILAND	SEA	A3-DG	R11700016200300016	001	CT2	10/09/2017				

R117000162	0003	2		807B	1	1R	SP17092615			757300K01200	S003	3	2017-09-26 00:00:00.000	SP47	1	1	1				SUGITY CREATIVES	MOULDING A/S,RR RH		2017-09-26 10:40:00.000	2017-09-26 08:49:00.000				AP07	02	2017-09-26 00:00:00.000	0003	2	1R	2017-09-26 08:49:00.000																									2017-09-26 16:57:37.710				0		0		0		0		0		0	0			0		0	0	SUNTER 1		757300K01200				9722D10	THAILAND	SEA	A3-DG	R11700016200300017	001	CT2	10/09/2017				

R117000162	0003	2		807B	1	1R	SP17092615			757300K01200	S003	3	2017-09-26 00:00:00.000	SP47	1	1	1				SUGITY CREATIVES	MOULDING A/S,RR RH		2017-09-26 10:40:00.000	2017-09-26 08:49:00.000				AP07	02	2017-09-26 00:00:00.000	0003	2	1R	2017-09-26 08:49:00.000																									2017-09-26 16:57:37.710				0		0		0		0		0		0	0			0		0	0	SUNTER 1		757300K01200				9722D10	THAILAND	SEA	A3-DG	R11700016200300018	001	CT2	10/09/2017				

R117000162	0003	2		807B	1	1R	SP17092615			757300K01200	S003	3	2017-09-26 00:00:00.000	SP47	1	1	1				SUGITY CREATIVES	MOULDING A/S,RR RH		2017-09-26 10:40:00.000	2017-09-26 08:49:00.000				AP07	02	2017-09-26 00:00:00.000	0003	2	1R	2017-09-26 08:49:00.000																									2017-09-26 16:57:37.710				0		0		0		0		0		0	0			0		0	0	SUNTER 1		757300K01200				9722D10	THAILAND	SEA	A3-DG	R11700016200300019	001	CT2	10/09/2017				

R117000162	0003	2		807B	1	1R	SP17092615			757300K01200	S003	3	2017-09-26 00:00:00.000	SP47	1	1	1				SUGITY CREATIVES	MOULDING A/S,RR RH		2017-09-26 10:40:00.000	2017-09-26 08:49:00.000				AP07	02	2017-09-26 00:00:00.000	0003	2	1R	2017-09-26 08:49:00.000																									2017-09-26 16:57:37.710				0		0		0		0		0		0	0			0		0	0	SUNTER 1		757300K01200				9722D10	THAILAND	SEA	A3-DG	R11700016200300020	001	CT2	10/09/2017				

R117000162	0003	2		807B	1	1R	SP17092615			757300K01200	S003	3	2017-09-26 00:00:00.000	SP47	1	1	1				SUGITY CREATIVES	MOULDING A/S,RR RH		2017-09-26 10:40:00.000	2017-09-26 08:49:00.000				AP07	02	2017-09-26 00:00:00.000	0003	2	1R	2017-09-26 08:49:00.000																									2017-09-26 16:57:37.710				0		0		0		0		0		0	0			0		0	0	SUNTER 1		757300K01200				9722D10	THAILAND	SEA	A3-DG	R11700016200300021	001	CT2	10/09/2017				

R117000162	0003	2		807B	1	1R	SP17092615			757300K01200	S003	3	2017-09-26 00:00:00.000	SP47	1	1	1				SUGITY CREATIVES	MOULDING A/S,RR RH		2017-09-26 10:40:00.000	2017-09-26 08:49:00.000				AP07	02	2017-09-26 00:00:00.000	0003	2	1R	2017-09-26 08:49:00.000																									2017-09-26 16:57:37.710				0		0		0		0		0		0	0			0		0	0	SUNTER 1		757300K01200				9722D10	THAILAND	SEA	A3-DG	R11700016200300022	001	CT2	10/09/2017				

R117000162	0003	2		807B	1	1R	SP17092615			757300K01200	S003	3	2017-09-26 00:00:00.000	SP47	1	1	1				SUGITY CREATIVES	MOULDING A/S,RR RH		2017-09-26 10:40:00.000	2017-09-26 08:49:00.000				AP07	02	2017-09-26 00:00:00.000	0003	2	1R	2017-09-26 08:49:00.000																									2017-09-26 16:57:37.710				0		0		0		0		0		0	0			0		0	0	SUNTER 1		757300K01200				9722D10	THAILAND	SEA	A3-DG	R11700016200300023	001	CT2	10/09/2017				

R117000162	0003	2		807B	1	1R	SP17092615			757300K01200	S003	3	2017-09-26 00:00:00.000	SP47	1	1	1				SUGITY CREATIVES	MOULDING A/S,RR RH		2017-09-26 10:40:00.000	2017-09-26 08:49:00.000				AP07	02	2017-09-26 00:00:00.000	0003	2	1R	2017-09-26 08:49:00.000																									2017-09-26 16:57:37.710				0		0		0		0		0		0	0			0		0	0	SUNTER 1		757300K01200				9722D10	THAILAND	SEA	A3-DG	R11700016200300024	001	CT2	10/09/2017				

R117000162	0003	2		807B	1	1R	SP17092615			757300K01200	S003	3	2017-09-26 00:00:00.000	SP47	1	1	1				SUGITY CREATIVES	MOULDING A/S,RR RH		2017-09-26 10:40:00.000	2017-09-26 08:49:00.000				AP07	02	2017-09-26 00:00:00.000	0003	2	1R	2017-09-26 08:49:00.000																									2017-09-26 16:57:37.710				0		0		0		0		0		0	0			0		0	0	SUNTER 1		757300K01200				9722D10	THAILAND	SEA	A3-DG	R11700016200300025	001	CT2	10/09/2017				

R117000162	0003	2		807B	1	1R	SP17092615			757300K01200	S003	3	2017-09-26 00:00:00.000	SP47	1	1	1				SUGITY CREATIVES	MOULDING A/S,RR RH		2017-09-26 10:40:00.000	2017-09-26 08:49:00.000				AP07	02	2017-09-26 00:00:00.000	0003	2	1R	2017-09-26 08:49:00.000																									2017-09-26 16:57:37.710				0		0		0		0		0		0	0			0		0	0	SUNTER 1		757300K01200				9722D10	THAILAND	SEA	A3-DG	R11700016200300026	001	CT2	10/09/2017				

R117000162	0003	2		807B	1	1R	SP17092615			757300K01200	S003	3	2017-09-26 00:00:00.000	SP47	1	1	1				SUGITY CREATIVES	MOULDING A/S,RR RH		2017-09-26 10:40:00.000	2017-09-26 08:49:00.000				AP07	02	2017-09-26 00:00:00.000	0003	2	1R	2017-09-26 08:49:00.000																									2017-09-26 16:57:37.710				0		0		0		0		0		0	0			0		0	0	SUNTER 1		757300K01200				9722D10	THAILAND	SEA	A3-DG	R11700016200300027	001	CT2	10/09/2017				

R117000162	0003	2		807B	1	1R	SP17092615			757300K01200	S003	3	2017-09-26 00:00:00.000	SP47	1	1	1				SUGITY CREATIVES	MOULDING A/S,RR RH		2017-09-26 10:40:00.000	2017-09-26 08:49:00.000				AP07	02	2017-09-26 00:00:00.000	0003	2	1R	2017-09-26 08:49:00.000																									2017-09-26 16:57:37.710				0		0		0		0		0		0	0			0		0	0	SUNTER 1		757300K01200				9722D10	THAILAND	SEA	A3-DG	R11700016200300028	001	CT2	10/09/2017				

R117000162	0003	2		807B	1	1R	SP17092615			757300K01200	S003	3	2017-09-26 00:00:00.000	SP47	1	1	1				SUGITY CREATIVES	MOULDING A/S,RR RH		2017-09-26 10:40:00.000	2017-09-26 08:49:00.000				AP07	02	2017-09-26 00:00:00.000	0003	2	1R	2017-09-26 08:49:00.000																									2017-09-26 16:57:37.710				0		0		0		0		0		0	0			0		0	0	SUNTER 1		757300K01200				9722D10	THAILAND	SEA	A3-DG	R11700016200300029	001	CT2	10/09/2017				

R117000162	0003	2		807B	1	1R	SP17092615			757300K01200	S003	3	2017-09-26 00:00:00.000	SP47	1	1	1				SUGITY CREATIVES	MOULDING A/S,RR RH		2017-09-26 10:40:00.000	2017-09-26 08:49:00.000				AP07	02	2017-09-26 00:00:00.000	0003	2	1R	2017-09-26 08:49:00.000																									2017-09-26 16:57:37.710				0		0		0		0		0		0	0			0		0	0	SUNTER 1		757300K01200				9722D10	THAILAND	SEA	A3-DG	R11700016200300030	001	CT2	10/09/2017				

