﻿SELECT 
	S.SYSTEM_NAME,
	R.ROLE_ID,
	R.ROLE_NAME,
	R.CREATED_BY,
	CONVERT(VARCHAR, R.CREATED_DATE , 104) + ' 00.00.000' AS CREATED_DATE,
	ISNULL(R.CHANGED_BY, '') AS CHANGED_BY,
	ISNULL(CONVERT(VARCHAR, R.CHANGED_DATE, 104), CAST(R.CHANGED_DATE AS VARCHAR)) + ' 00.00.000' AS CHANGED_DATE
FROM [10.16.25.100].OpenLDAP.dbo.TB_M_ROLE R 
	INNER JOIN [10.16.25.100].OpenLDAP.dbo.TB_M_SYSTEM S
	ON S.SYSTEM_ID = R.SYSTEM_ID  
WHERE
	(
		(ISNULL(@0, '') = '')
		OR
		(ISNULL(@0, '') != '' AND R.ROLE_NAME like '%'+@0+'%')
	)