﻿DECLARE @@sql VARCHAR(MAX)				
				
	SET @@sql = ' SELECT VEHICLE_ID AS VehicleId, VEHICLE_NO AS VehicleNo ,BODY_NO AS BodyNo		
				  FROM TB_M_DLV_VEHICLE '

	if (@0 <> '')
		set @@sql = @@sql + ' WHERE LP_CD = ''' + @0 + ''' '
		
EXEC(@@sql)				
