﻿SET NOCOUNT ON

DECLARE @@sql VARCHAR(MAX)

SET @@sql = '
SELECT * FROM (
SELECT
	 --SOH.SUPPLIER_CD + ''-'' + SOH.SUPPLIER_PLANT_CD AS [SUPPLIER_CD]
	  ISNULL(SOH.PARENT_SUPPLIER_CD,'''') + ''-'' + SOH.SUPPLIER_PLANT_CD AS [SUPPLIER_CD]
	,SUP.SUPPLIER_NAME AS [SUPPLIER_NAME]
	,CONVERT(VARCHAR, SOH.PLAN_RECEIVING_DATE, 101) + '' '' + CONVERT(VARCHAR, SOH.PLAN_RECEIVING_TIME, 0) AS [ARRIVAL_PLAN_DATE]
	,SOH.PLAN_RECEIVING_DATE
	--,SOH.MATERIAL_NO
	--,SOH.SPEC
	--,SOH.SIZE
	,SUM(SOH.ACT_TTL_KANBAN) AS ACT_TTL_KBN
	,SOH.ORDER_NO
FROM dbo.TB_R_STAMPING_STEEL_ORDER_H SOH
JOIN dbo.TB_M_SUPPLIER SUP ON SUP.SUPPLIER_CODE = SOH.SUPPLIER_CD
GROUP BY 
	 ISNULL(SOH.PARENT_SUPPLIER_CD,'''') + ''-'' + SOH.SUPPLIER_PLANT_CD
	,SUP.SUPPLIER_NAME
	,CONVERT(VARCHAR, SOH.PLAN_RECEIVING_DATE, 101) + '' '' + CONVERT(VARCHAR, SOH.PLAN_RECEIVING_TIME, 0)
	,SOH.PLAN_RECEIVING_DATE
	--,SOH.MATERIAL_NO
	--,SOH.SPEC
	--,SOH.SIZE
	,SOH.ORDER_NO
) X
WHERE 1=1
'

IF(@0 <> '')
BEGIN
	SET @@sql += ' AND X.SUPPLIER_CD = '''+ @0 +''' ';
END

IF(@1 <> '')
BEGIN
	SET @@sql += ' AND X.MATERIAL_NO = '''+ @1 +''' ';
END

IF(@2 <> '')
BEGIN
	SET @@sql += ' AND X.ORDER_NO = '''+ @2 +''' ';
END

IF(@3 <> '' AND @4 <> '')
BEGIN
	SET @@sql += ' AND X.PLAN_RECEIVING_DATE >= ''' + CONVERT(VARCHAR, CAST(@3 AS DATE), 112) + ''' ';
	SET @@sql += ' AND X.PLAN_RECEIVING_DATE <= ''' + CONVERT(VARCHAR, CAST(@4 AS DATE), 112) + ''' ';
END

EXECUTE (@@sql)