﻿select
	                        CASE WHEN N_FREQ IS NOT NULL 
								 AND N_1_FREQ IS NOT NULL
								 AND N_2_FREQ IS NOT NULL
								 AND N_3_FREQ IS NOT NULL
							THEN 'SPEX' ELSE D_ID END D_ID
                            ,VERS
                            ,REV_NO
                            ,COMP_CD
                            ,R_PLANT_CD
                            ,DOCK_CD
                            ,S_PLANT_CD
                            ,SHIP_CD
                            ,ORD_TYPE
                            ,PACK_MONTH
                            ,CAR_CD
                            ,REC_CD
                            ,SRC
                            ,PART_NO
                            ,ORDER_TYPE
                            ,ORDER_LOT_SZ
                            ,KANBAN_NUMBER
                            ,N_VOLUME
                            ,AICO_CEPT
                            ,N_1_VOLUME
                            ,AICO_CEPT1
                            ,N_2_VOLUME
                            ,AICO_CEPT2
                            ,N_3_VOLUME
                            ,AICO_CEPT3
                            ,N_D01
                            ,N_D02
                            ,N_D03
                            ,N_D04
                            ,N_D05
                            ,N_D06
                            ,N_D07
                            ,N_D08
                            ,N_D09
                            ,N_D10
                            ,N_D11
                            ,N_D12
                            ,N_D13
                            ,N_D14
                            ,N_D15
                            ,N_D16
                            ,N_D17
                            ,N_D18
                            ,N_D19
                            ,N_D20
                            ,N_D21
                            ,N_D22
                            ,N_D23
                            ,N_D24
                            ,N_D25
                            ,N_D26
                            ,N_D27
                            ,N_D28
                            ,N_D29
                            ,N_D30
                            ,N_D31
                            ,N_1_D01
                            ,N_1_D02
                            ,N_1_D03
                            ,N_1_D04
                            ,N_1_D05
                            ,N_1_D06
                            ,N_1_D07
                            ,N_1_D08
                            ,N_1_D09
                            ,N_1_D10
                            ,N_1_D11
                            ,N_1_D12
                            ,N_1_D13
                            ,N_1_D14
                            ,N_1_D15
                            ,N_1_D16
                            ,N_1_D17
                            ,N_1_D18
                            ,N_1_D19
                            ,N_1_D20
                            ,N_1_D21
                            ,N_1_D22
                            ,N_1_D23
                            ,N_1_D24
                            ,N_1_D25
                            ,N_1_D26
                            ,N_1_D27
                            ,N_1_D28
                            ,N_1_D29
                            ,N_1_D30
                            ,N_1_D31
                            ,SYSTEM_DATE
                            ,SERIES
                            ,LIFE_CYCLE
                            ,B_A_SIGN
                            ,B_A_QUANTITY
                            ,R_U_PREVIOUS
                            ,R_U_PRESENT
                            ,SUPPLIER_CD
                            ,SUPPLIER_NAME
                            ,PART_NAME
                            ,DUMMY
                            ,TERM
                            ,CREATED_BY
                            ,CREATED_DT
                            ,CHANGED_BY
                            ,CHANGED_DT
							,N_FREQ
							,N_1_FREQ
							,N_2_FREQ
							,N_3_FREQ
                        from
                            TB_R_LPOP_SUM
                        where 
                            ((PACK_MONTH=@0 AND isnull(@0,'') <> '') or (isnull(@0,'') = '')) AND 
                            ((SUPPLIER_CD=@1 AND isnull(@1,'') <> '') or (isnull(@1,'') = '')) AND                         
                            ((S_PLANT_CD=@2)) AND
                            ((VERS=@3 AND isnull(@3,'') <> '') or (isnull(@3,'') = '')) 
                        order by PACK_MONTH DESC, D_ID, VERS, SUPPLIER_CD, S_PLANT_CD