﻿DECLARE @@SQL NVARCHAR(MAX) = N'SELECT CONVERT(VARCHAR(100), ROLE_ID) + '' - '' + ROLE_NAME as DATAKEY, ROLE_ID, ROLE_NAME FROM OPENQUERY([10.16.25.100], 
						 ''select role_id, role_name from OpenLDAP.dbo.TB_M_ROLE 
						 where system_id = ''''' + @0 + '''''
						 and ISNULL(''''' + @0 + ''''', '''''''') <> ''''''''
						 or ISNULL(''''' + @0 + ''''', '''''''') = '''''''''')'

EXEC sp_executesql @@SQL