insert into TB_T_NOTIFICATION(Title, 
                                  Description, 
                                  UserNames, 
                                  Recipient_Roles, 
                                  Authentication_Method, 
                                  Notification_Level, 
                                  Action_URL,
                                  Created_BY,
                                  Created_DT)
    values(
            @0,
            @1,
            @2,
            @3,
            @4,
            @5,
            @6,
            @7,
            @8
          )
