﻿Declare @@sql varchar(max),
        @@SuppCd varchar(max) = REPLACE(@0,';',''','''),
		@@SuppCdLdap varchar(max) = REPLACE(@1,';',''',''')
	
set @@sql = '
	SELECT 
		A.SUPPLIER_CD,
		(select top 1 substring(d.SUPP_NAME,1, case when patindex(''%(%'',d.SUPP_NAME)-1>0 
													then patindex(''%(%'',d.SUPP_NAME)-1
													else len(d.SUPP_NAME) end ) 
		 from TB_M_SUPPLIER_ICS d where d.SUPP_CD=a.SUPPLIER_CD) SUPPLIER_NAME,
		A.COMPANY_STATUS,
		A.WEBSITE,
		A.CAPITAL_CURRENCY_CD,
		A.CAPITAL_AMOUNT,
		A.YEAR_ESTABLISH,
		A.YEAR_OPERATION,
		A.MODEL_INVOLVE_CD as MODEL_INVOLVE_NAME,
		A.TMMIN_PIC,
		A.MAIN_CONTACT,
		CASE WHEN A.RELATION_1ST_TIER = 1 THEN ''1'' ELSE ''0'' END RELATION_1ST_TIER,
		CASE WHEN A.RELATION_2ND_3RD_TIER = 1 THEN ''1'' ELSE ''0'' END RELATION_2ND_3RD_TIER,
		CASE WHEN A.CONSUMABLE_AND_FACILITY = 1 THEN ''1'' ELSE ''0'' END CONSUMABLE_AND_FACILITY,
		A.CONFIRM_BY_SUPPLIER,
		CONVERT(VARCHAR(20), A.CONFIRM_DT_SUPPLIER, 104) + '' '' + CONVERT(VARCHAR(20), A.CONFIRM_DT_SUPPLIER, 114) CONFIRM_DT_SUPPLIER,
		A.CREATED_BY,
		CONVERT(VARCHAR(20), A.CREATED_DT, 104) + '' '' + CONVERT(VARCHAR(20), A.CREATED_DT, 114) CREATED_DT,
		A.CHANGED_BY,
		CONVERT(VARCHAR(20), A.CHANGED_DT, 104) + '' '' + CONVERT(VARCHAR(20), A.CHANGED_DT, 114) CHANGED_DT
	FROM TB_M_SUPPLIER_GENERAL_INFO A
		LEFT JOIN TB_M_CURRENCY B 
			ON A.CAPITAL_CURRENCY_CD = B.CURRENCY_CD 
		LEFT JOIN TB_M_TMMIN_MODEL C 
			ON A.MODEL_INVOLVE_CD = C.MODEL_CD 
	WHERE 1=1 '

if(@@SuppCd <> '')
	set @@sql = @@sql + 'AND A.SUPPLIER_CD  IN ('''+ @@SuppCd +''') '

if(@@SuppCdLdap <> '')
	set @@sql = @@sql + 'AND A.SUPPLIER_CD  IN ('''+ @@SuppCdLdap +''') '

execute (@@sql)