﻿--Insert TB_R_LPOP
insert into TB_R_LPOP(
	D_ID,VERS,REV_NO,COMP_CD,R_PLANT_CD,DOCK_CD,S_PLANT_CD,SHIP_CD,ORD_TYPE,PACK_MONTH,CAR_CD,REC_CD,SRC,
	PART_NO,ORDER_TYPE,ORDER_LOT_SZ,KANBAN_NUMBER,N_VOLUME,AICO_CEPT,N_1_VOLUME,AICO_CEPT1,N_2_VOLUME,AICO_CEPT2,N_3_VOLUME,AICO_CEPT3,
	N_D01,N_D02,N_D03,N_D04,N_D05,N_D06,N_D07,N_D08,N_D09,N_D10,N_D11,N_D12,N_D13,N_D14,N_D15,
	N_D16,N_D17,N_D18,N_D19,N_D20,N_D21,N_D22,N_D23,N_D24,N_D25,N_D26,N_D27,N_D28,N_D29,N_D30,N_D31,
	N_1_D01,N_1_D02,N_1_D03,N_1_D04,N_1_D05,N_1_D06,N_1_D07,N_1_D08,N_1_D09,N_1_D10,N_1_D11,N_1_D12,N_1_D13,N_1_D14,N_1_D15,
	N_1_D16,N_1_D17,N_1_D18,N_1_D19,N_1_D20,N_1_D21,N_1_D22,N_1_D23,N_1_D24,N_1_D25,N_1_D26,N_1_D27,N_1_D28,N_1_D29,N_1_D30,N_1_D31,
	SYSTEM_DATE,SERIES,LIFE_CYCLE,B_A_SIGN,B_A_QUANTITY,R_U_PREVIOUS,R_U_PRESENT,SUPPLIER_CD,SUPPLIER_NAME,PART_NAME,
	DUMMY,TERM,CREATED_BY,CREATED_DT,CHANGED_BY,CHANGED_DT, N_FREQ, N_1_FREQ, N_2_FREQ, N_3_FREQ)
SELECT
	D_ID, VERS, REV_NO, COMP_CD, R_PLANT_CD, DOCK_CD, S_PLANT_CD, SHIP_CD, ORD_TYPE, PACK_MONTH, CAR_CD, REX_CD, SRC,
	PART_NO, ORDER_TYPE, ORDER_LOT_SZ,KANBAN_NUMBER, N_VOLUME, AICO_CEPT, N_1_VOLUME, AICO_CEPT1, N_2_VOLUME, AICO_CEPT2, N_3_VOLUME, AICO_CEPT3,
	N_D01, N_D02, N_D03, N_D04, N_D05, N_D06, N_D07, N_D08, N_D09, N_D10, N_D11, N_D12, N_D13, N_D14, N_D15,
	N_D16, N_D17, N_D18, N_D19, N_D20,N_D21, N_D22, N_D23, N_D24, N_D25, N_D26, N_D27, N_D28, N_D29, N_D30, N_D31,
	N_1_D01, N_1_D02, N_1_D03, N_1_D04, N_1_D05, N_1_D06, N_1_D07, N_1_D08, N_1_D09, N_1_D10, N_1_D11, N_1_D12, N_1_D13, N_1_D14, N_1_D15,
	N_1_D16, N_1_D17, N_1_D18, N_1_D19, N_1_D20, N_1_D21, N_1_D22, N_1_D23, N_1_D24, N_1_D25, N_1_D26, N_1_D27, N_1_D28, N_1_D29, N_1_D30, N_1_D31,
	SYSTEM_DATE, SERIES, LIFE_CYCLE, B_A_SIGN, B_A_QUANTITY, R_U_PREVIOUS, R_U_PRESENT, SUPPLIER_CD, SUPPLIER_NAME, PART_NAME,
	DUMMY, TERM, @2, GETDATE(), NULL, NULL, N_FREQ, N_1_FREQ, N_2_FREQ, N_3_FREQ
FROM(
	SELECT 
		n.D_ID,n.VERS,REV_NO=n.REV_NO,COMP_CD=n.COMP_CD,R_PLANT_CD=n.R_PLANT_CD,n.DOCK_CD,n.S_PLANT_CD,SHIP_CD=n.SHIP_CD,ORD_TYPE=n.ORD_TYPE,n.PACK_MONTH,n.CAR_CD,REX_CD=n.REX_CD,SRC=n.SRC,
		n.PART_NO,ORDER_TYPE=n.ORDER_TYPE,n.ORDER_LOT_SZ,KANBAN_NUMBER=n.KANBAN_NUMBER,n.N_VOLUME,AICO_CEPT=n.AICO_CEPT,n.N_1_VOLUME,AICO_CEPT1=n.AICO_CEPT1,n.N_2_VOLUME,AICO_CEPT2=n.AICO_CEPT2,n.N_3_VOLUME,AICO_CEPT3=n.AICO_CEPT3,
		n.N_D01,n.N_D02,n.N_D03,n.N_D04,n.N_D05,n.N_D06,n.N_D07,n.N_D08,n.N_D09,n.N_D10,n.N_D11,n.N_D12,n.N_D13,n.N_D14,n.N_D15,
		n.N_D16,n.N_D17,n.N_D18,n.N_D19,n.N_D20,n.N_D21,n.N_D22,n.N_D23,n.N_D24,n.N_D25,n.N_D26,n.N_D27,n.N_D28,n.N_D29,n.N_D30,n.N_D31,
		n.N_1_D01,n.N_1_D02,n.N_1_D03,n.N_1_D04,n.N_1_D05,n.N_1_D06,n.N_1_D07,n.N_1_D08,n.N_1_D09,n.N_1_D10,n.N_1_D11,n.N_1_D12,n.N_1_D13,n.N_1_D14,n.N_1_D15,
		n.N_1_D16,n.N_1_D17,n.N_1_D18,n.N_1_D19,n.N_1_D20,n.N_1_D21,n.N_1_D22,n.N_1_D23,n.N_1_D24,n.N_1_D25,n.N_1_D26,n.N_1_D27,n.N_1_D28,n.N_1_D29,n.N_1_D30,n.N_1_D31,
		n.SYSTEM_DATE,n.SERIES,n.LIFE_CYCLE,n.B_A_SIGN,n.B_A_QUANTITY,n.R_U_PREVIOUS,n.R_U_PRESENT,n.SUPPLIER_CD,n.SUPPLIER_NAME,n.PART_NAME,
		n.DUMMY,n.TERM,n.CREATED_BY,n.CREATED_DT,n.CHANGED_BY,n.CHANGED_DT, NULL N_FREQ, NULL N_1_FREQ, NULL N_2_FREQ, NULL N_3_FREQ
	FROM TB_R_NCS n
	WHERE n.PACK_MONTH = @0 AND n.VERS = @1 --AND SRC IN ('1','3')
	UNION ALL
	SELECT 
		D_ID,VERS,REV_NO,COMP_CD,R_PLANT_CD,DOCK_CD,S_PLANT_CD,SHIP_CD,ORD_TYPE,PACK_MONTH,CAR_CD,REX_CD,SRC,
		PART_NO,ORDER_TYPE,ORDER_LOT_SZ,KANBAN_NUMBER,N_VOLUME,AICO_CEPT,N_1_VOLUME,AICO_CEPT1,N_2_VOLUME,AICO_CEPT2,N_3_VOLUME,AICO_CEPT3,
		N_D01,N_D02,N_D03,N_D04,N_D05,N_D06,N_D07,N_D08,N_D09,N_D10,N_D11,N_D12,N_D13,N_D14,N_D15,
		N_D16,N_D17,N_D18,N_D19,N_D20,N_D21,N_D22,N_D23,N_D24,N_D25,N_D26,N_D27,N_D28,N_D29,N_D30,N_D31,
		N_1_D01,N_1_D02,N_1_D03,N_1_D04,N_1_D05,N_1_D06,N_1_D07,N_1_D08,N_1_D09,N_1_D10,N_1_D11,N_1_D12,N_1_D13,N_1_D14,N_1_D15,
		N_1_D16,N_1_D17,N_1_D18,N_1_D19,N_1_D20,N_1_D21,N_1_D22,N_1_D23,N_1_D24,N_1_D25,N_1_D26,N_1_D27,N_1_D28,N_1_D29,N_1_D30,N_1_D31,
		SYSTEM_DATE,SERIES,LIFE_CYCLE,B_A_SIGN ,B_A_QUANTITY,R_U_PREVIOUS,R_U_PRESENT,SUPPLIER_CD,SUPPLIER_NAME,PART_NAME,
		DUMMY,TERM,CREATED_BY,CREATED_DT,CHANGED_BY,CHANGED_DT, NULL N_FREQ, NULL N_1_FREQ, NULL N_2_FREQ, NULL N_3_FREQ
	FROM TB_R_FORECAST
	WHERE PACK_MONTH = @0 AND VERS = @1
	UNION ALL
	SELECT 
		n.D_ID,n.VERS,REV_NO=n.REV_NO,COMP_CD=n.COMP_CD,R_PLANT_CD=n.R_PLANT_CD,n.DOCK_CD,n.S_PLANT_CD,SHIP_CD=n.SHIP_CD,ORD_TYPE=n.ORD_TYPE,n.PACK_MONTH,n.CAR_CD,REX_CD=n.REX_CD,SRC=n.SRC,
		n.PART_NO,ORDER_TYPE=n.ORDER_TYPE,n.ORDER_LOT_SZ,KANBAN_NUMBER=n.KANBAN_NUMBER,n.N_VOLUME,AICO_CEPT=n.AICO_CEPT,n.N_1_VOLUME,AICO_CEPT1=n.AICO_CEPT1,n.N_2_VOLUME,AICO_CEPT2=n.AICO_CEPT2,n.N_3_VOLUME,AICO_CEPT3=n.AICO_CEPT3,
		n.N_D01,n.N_D02,n.N_D03,n.N_D04,n.N_D05,n.N_D06,n.N_D07,n.N_D08,n.N_D09,n.N_D10,n.N_D11,n.N_D12,n.N_D13,n.N_D14,n.N_D15,
		n.N_D16,n.N_D17,n.N_D18,n.N_D19,n.N_D20,n.N_D21,n.N_D22,n.N_D23,n.N_D24,n.N_D25,n.N_D26,n.N_D27,n.N_D28,n.N_D29,n.N_D30,n.N_D31,
		n.N_1_D01,n.N_1_D02,n.N_1_D03,n.N_1_D04,n.N_1_D05,n.N_1_D06,n.N_1_D07,n.N_1_D08,n.N_1_D09,n.N_1_D10,n.N_1_D11,n.N_1_D12,n.N_1_D13,n.N_1_D14,n.N_1_D15,
		n.N_1_D16,n.N_1_D17,n.N_1_D18,n.N_1_D19,n.N_1_D20,n.N_1_D21,n.N_1_D22,n.N_1_D23,n.N_1_D24,n.N_1_D25,n.N_1_D26,n.N_1_D27,n.N_1_D28,n.N_1_D29,n.N_1_D30,n.N_1_D31,
		n.SYSTEM_DATE,n.SERIES,n.LIFE_CYCLE,n.B_A_SIGN,n.B_A_QUANTITY,n.R_U_PREVIOUS,n.R_U_PRESENT,n.SUPPLIER_CD,n.SUPPLIER_NAME,n.PART_NAME,
		n.DUMMY,n.TERM,n.CREATED_BY,n.CREATED_DT,n.CHANGED_BY,n.CHANGED_DT, N_FREQ, N_1_FREQ, N_2_FREQ, N_3_FREQ
	FROM TB_R_SPEX n
	WHERE n.PACK_MONTH = @0 AND n.VERS = @1
)Qry

--Update TB_R_LPOP_H become consolidated
UPDATE TB_R_LPOP_H SET 
	CONSOLIDATION_STATUS = '1',
	CONSOLIDATION_BY = @2,
	CONSOLIDATION_DT = GETDATE(),
	CHANGED_BY = @2,
	CHANGED_DT = GETDATE()
WHERE PRODUCTION_MONTH = @0 AND RTRIM(TIMING) = @1 AND RTRIM(SOURCE_DATA) = 'NCS'


UPDATE TB_R_LPOP_H SET 
	CONSOLIDATION_STATUS = '1',
	CONSOLIDATION_BY = @2,
	CONSOLIDATION_DT = GETDATE(),
	CHANGED_BY = @2,
	CHANGED_DT = GETDATE()
WHERE PRODUCTION_MONTH = @0 AND RTRIM(TIMING) = @1 AND RTRIM(SOURCE_DATA) = 'FCST'

UPDATE TB_R_LPOP_H SET 
	CONSOLIDATION_STATUS = '1',
	CONSOLIDATION_BY = @2,
	CONSOLIDATION_DT = GETDATE(),
	CHANGED_BY = @2,
	CHANGED_DT = GETDATE()
WHERE PRODUCTION_MONTH = @0 AND RTRIM(TIMING) = @1 AND RTRIM(SOURCE_DATA) = 'SPEX'

--Insert TB_R_LPOP_CONFIRMATION
INSERT INTO TB_R_LPOP_CONFIRMATION(
	PRODUCTION_MONTH,LPOP_TIMING,APPROVE_BY,APPROVE_DT,REVISED_FLAG,REVISED_BY,REVISED_DT,
	PO_CREATION_STATUS,PO_CREATED_BY,PO_CREATED_DT,COMPLETENESS_CHECK_BY,COMPLETENESS_CHECK_DT,
	CREATED_BY,CREATED_DT,CHANGED_BY,CHANGED_DT,DELETION_FLAG,DELETION_BY,DELETION_DT)
SELECT
	@0,@1,null,null,null,null,null,
	null,null,null,null,null,
	@2,GETDATE(),null,null,null,null,null