﻿DECLARE @@feedback_status char(1) = '1'

IF(EXISTS(SELECT '' FROM TB_T_KEIHEN_FEEDBACK WHERE PROCESS_ID = @0 AND REPLY = 'NG'))
BEGIN
	SET @@feedback_status = '0'
END

UPDATE F
SET F.REPLY = 
			CASE WHEN T.REPLY = 'OK'
			THEN 1
			ELSE 0
			END,
	F.PLANT_CAP = CASE WHEN LOWER(T.PLANT_CAP) = 'true'
				  THEN 1 
				  ELSE 0
				  END,
	F.RAW_COMP = CASE WHEN LOWER(T.RAW_COMP) = 'true'
				  THEN 1 
				  ELSE 0
				  END,
	F.RAW_MAT = CASE WHEN LOWER(T.RAW_MAT) = 'true'
				  THEN 1 
				  ELSE 0
				  END,
	F.LOCK = 1,
	F.QTY_SUPP_REFF = T.QTY_SUPP_REFF,
	F.FEEDBACK_BY = @1,
	F.FEEDBACK_DT = GETDATE(),
	F.LOCK_BY = @1,
	F.FEEDBACK_STATUS = @@feedback_status
FROM
	TB_R_KEIHEN_FEEDBACK F INNER JOIN TB_T_KEIHEN_FEEDBACK T
	ON
		F.PACK_MONTH = T.PACK_MONTH AND 
		F.SUPPLIER_CD = T.SUPPLIER_CD AND
		F.S_PLANT_CD = T.S_PLANT_CD AND
		F.PART_NO = T.PART_NO
WHERE T.PROCESS_ID = @0