﻿--a
DECLARE @@sql as varchar(max),
		@@DELIVERY_NO varchar(max) = @0,
		@@DOCK_CD varchar(max) = @1,
		@@RCV_PLANT_CD varchar(max) = @2,
		@@SUPPLIER_CD varchar(max) = @3,
		@@SUPPLIER_PLANT varchar(max) = @4


SET @@sql='SELECT 
a.DELIVERY_NO,
b.STATION as TRUCK_STATION,
c.ROUTE,
c.RATE,
REPLACE(CONVERT(VARCHAR(20),b.ARRIVAL_PLAN_DT,120), ''-'', ''.'') as ARRIVAL_PLAN_DT,
REPLACE(CONVERT(VARCHAR(20),b.ARRIVAL_ACTUAL_DT,120), ''-'', ''.'') as ARRIVAL_ACTUAL_DT,
REPLACE(CONVERT(VARCHAR(20),b.DEPARTURE_PLAN_DT,120), ''-'', ''.'') as DEPARTURE_PLAN_DT,
REPLACE(CONVERT(VARCHAR(20),b.DEPARTURE_ACTUAL_DT,120), ''-'', ''.'') as DEPARTURE_ACTUAL_DT,
b.DOCK_CD
FROM TB_R_DELIVERY_CTL_MANIFEST a
LEFT JOIN TB_R_DELIVERY_CTL_H c ON c.DELIVERY_NO = a.DELIVERY_NO
LEFT JOIN TB_R_DELIVERY_CTL_D b ON b.DELIVERY_NO = a.DELIVERY_NO AND b.DOCK_CD = a.DOCK_CD
LEFT JOIN TB_R_DAILY_ORDER_MANIFEST d ON d.MANIFEST_NO = a.MANIFEST_NO AND d.DOCK_CD = a.DOCK_CD
WHERE 1=1'
IF(@@DELIVERY_NO <> '')
BEGIN
	SET @@sql = @@sql + ' AND a.DELIVERY_NO = '''+@@DELIVERY_NO+''''
END

IF(@@DOCK_CD <> '')
BEGIN
	SET @@sql = @@sql + ' AND b.DOCK_CD = '''+@@DOCK_CD+''''
END

IF(@@RCV_PLANT_CD <> '')
BEGIN
	SET @@sql = @@sql + ' AND d.RCV_PLANT_CD = '''+@@RCV_PLANT_CD+''''
END

IF(@@SUPPLIER_CD <> '')
BEGIN
	SET @@sql = @@sql + ' AND d.SUPPLIER_CD = '''+@@SUPPLIER_CD+''''
END

IF(@@SUPPLIER_PLANT <> '')
BEGIN
	SET @@sql = @@sql + ' AND d.SUPPLIER_PLANT = '''+@@SUPPLIER_PLANT+''''
END


IF(@@DELIVERY_NO <> '' OR @@DOCK_CD <> '' OR @@RCV_PLANT_CD <> '' OR @@SUPPLIER_CD <> '' OR @@SUPPLIER_PLANT <> '')
BEGIN
	execute(@@sql);
END