﻿INSERT INTO [dbo].[TB_R_ICS_QUEUE]
           ([IPPCS_MODUL]
           ,[IPPCS_FUNCTION]
           ,[PROCESS_ID]
           ,[PROCESS_STATUS]
           ,[CREATED_BY]
           ,[CREATED_DT])
     VALUES
           (@0
           ,@1
           ,@2
           ,@3
           ,@4
           ,@5)

