﻿DECLARE @@sql VARCHAR(MAX)

IF(@1 = 'D')
BEGIN
SET @@sql = ' SELECT COUNT(1) as CountLP
			  FROM TB_M_LOGISTIC_PARTNER 
			  WHERE LOG_PARTNER_CD = ''' + @0 + ''' '
END

ELSE IF(@1 = 'V')
BEGIN
SET @@sql = ' SELECT COUNT(1) as count
			  FROM TB_M_LOGISTIC_PARTNER 
			  WHERE LOG_PARTNER_CD = ''' + @0 + ''' '
END

ELSE

BEGIN
SET @@sql = ' SELECT COUNT(1) as count
			  FROM TB_M_DLV_VEHICLE
			  WHERE LP_CD = ''' + @0 + ''' AND VEHICLE_NO = ''' + @2 + ''' '
END

EXEC(@@sql)
 
