delete TB_R_DAILY_ORDER_MANIFEST
where ORDER_NO=@0
           and SUPPLIER_CD=@1
           and DOCK_CD=@2
           and SUPPLIER_PLANT=@3


delete TB_R_DAILY_ORDER_PART
where ORDER_NO=@0
           and SUPPLIER_CD=@1
           and DOCK_CD=@2
           and SUPPLIER_PLANT=@3