-- GetRetroTaxRate

SELECT 
	ISNULL(Z.TaxRate, 0.00) AS [TaxRate]
FROM 
	(SELECT 1 DUMMY) AS DUAL
LEFT JOIN (
	SELECT TOP 1 T.RATE/100 AS TaxRate
	FROM TB_M_TAX  T 
	WHERE T.TAX_CD = 
	   (SELECT TOP 1 TAX_CD from TB_M_LIV_TRANS_MAPPING  
		 WHERE GL_ACCOUNT = 
			(SELECT TOP 1 SYSTEM_VALUE 
			   FROM TB_M_SYSTEM 
			  WHERE SYSTEM_CD = 'RETRO_GL_ACCOUNT' 
				AND FUNCTION_ID = '51004'
			)
		)
) AS Z ON 1 = 1 