﻿Declare @@sql varchar(max),
        @@SuppCd varchar(max) = REPLACE(@0,';',''','''),
		@@SuppCdLdap varchar(max) = REPLACE(@1,';',''',''')
	
		
set @@sql = '
	SELECT 
		A.SUPPLIER_CD,
		(select top 1 substring(d.SUPP_NAME,1, case when patindex(''%(%'',d.SUPP_NAME)-1>0 
														then patindex(''%(%'',d.SUPP_NAME)-1
														else len(d.SUPP_NAME) end ) 
		from TB_M_SUPPLIER_ICS d where d.SUPP_CD=a.SUPPLIER_CD) SUPPLIER_NAME,
		A.ITEM_NO,
		CASE WHEN A.AVAILABILITY = 1 THEN ''1'' ELSE ''0'' END AVAILABILITY, 
		A.SINGLE_PLURAL,
		A.HISTORY_STRIKE_1,
		A.HISTORY_STRIKE_2,
		A.HISTORY_STRIKE_3,
		CASE WHEN A.COLLECTIVE_LABOR_AGREEMENT = 1 THEN ''1'' ELSE ''0'' END COLLECTIVE_LABOR_AGREEMENT,
		A.COMMUNICATION_MEDIA,
		CASE WHEN A.PENSION_PROGRAM = 1 THEN ''1'' ELSE ''0'' END PENSION_PROGRAM,
		A.BONUS,
		CONVERT(VARCHAR(20), SALARY_INCREASE, 104) SALARY_INCREASE,
		CASE WHEN A.MEAL_TRANSPORT_ALLOWANCE = 1 THEN ''1'' ELSE ''0'' END MEAL_TRANSPORT_ALLOWANCE,
		CASE WHEN A.MEDICAL_ALLOWANCE = 1 THEN ''1'' ELSE ''0'' END MEDICAL_ALLOWANCE,
		CASE WHEN A.THR = 1 THEN ''1'' ELSE ''0'' END THR,
		CASE WHEN A.OVERTIME = 1 THEN ''1'' ELSE ''0'' END OVERTIME,
		L.UNION_NAME,
		A.CONFIRM_BY_SUPPLIER,
		CONVERT(VARCHAR(20), A.CONFIRM_DT_SUPPLIER, 104) + '' '' + CONVERT(VARCHAR(20), A.CONFIRM_DT_SUPPLIER, 114) CONFIRM_DT_SUPPLIER,
		A.CREATED_BY,
		CONVERT(VARCHAR(20), A.CREATED_DT, 104) + '' '' + CONVERT(VARCHAR(20), A.CREATED_DT, 114) CREATED_DT,
		A.CHANGED_BY,
		CONVERT(VARCHAR(20), A.CHANGED_DT, 104) + '' '' + CONVERT(VARCHAR(20), A.CHANGED_DT, 114) CHANGED_DT 
    FROM TB_M_SUPPLIER_LABOR A 
		LEFT JOIN TB_M_SUPPLIER_UNION L on L.UNION_CD = A.UNION_CD
    WHERE 1=1 '

if(@@SuppCd <> '')
	set @@sql = @@sql + 'AND A.SUPPLIER_CD  IN ('''+ @@SuppCd +''') '
if(@@SuppCdLdap <> '')
	set @@sql = @@sql + 'AND A.SUPPLIER_CD  IN ('''+ @@SuppCdLdap +''') '


execute (@@sql)