DECLARE @@SUPPLIER_CD VARCHAR(5) = @0,
		@@SUPPLIER_PLANT VARCHAR(3) = @1,
		@@DOCK_CD VARCHAR(6) = @2,
		@@PART_NO VARCHAR(15) = REPLACE(@3,'-',''),
		@@KANBAN_QTY INT = @4,
		@@START_DT DATETIME = @5,
		@@END_DT DATETIME = @6,
		@@USERNAME VARCHAR(20) = @7,
		@@FLAG VARCHAR(5) = @8,
		@@PART_NAME VARCHAR(40) = @9,
		@@KANBAN_NO VARCHAR(5) = @10,
		@@PCK_TYPE VARCHAR(18) = @11,
		@@MODE VARCHAR(5) = @12

BEGIN TRY
	IF(@@MODE = '')
	BEGIN
		RAISERROR('Update Failed. Please Refresh the Page.', 16, 1)
	END

	IF (@@MODE = 'EDIT')
	BEGIN
		IF NOT EXISTS(SELECT 'x' FROM TB_M_PART_INFO 
				  WHERE PART_NO = @@PART_NO 
						AND SUPPLIER_CD = @@SUPPLIER_CD 
						AND SUPPLIER_PLANT = @@SUPPLIER_PLANT 
						AND DOCK_CD = @@DOCK_CD)
		BEGIN
			RAISERROR('Data is Not Exists. Update Failed', 16, 1)
		END

		UPDATE TB_M_PART_INFO 
		SET KANBAN_QTY = @@KANBAN_QTY,
			PART_NAME = @@PART_NAME,
			KANBAN_NO = @@KANBAN_NO,
			PCK_TYPE = @@PCK_TYPE,
			START_DT = @@START_DT,
			END_DT = @@END_DT,
			PRMCD = @@FLAG,
			CHANGED_BY = @@USERNAME,
			CHANGED_DT = GETDATE()
		WHERE SUPPLIER_CD = @@SUPPLIER_CD 
			  AND SUPPLIER_PLANT = @@SUPPLIER_PLANT 
			  AND DOCK_CD = @@DOCK_CD 
			  AND PART_NO = @@PART_NO 
	END
	ELSE
	BEGIN
		IF EXISTS(SELECT 'x' FROM TB_M_PART_INFO 
				  WHERE PART_NO = @@PART_NO 
						AND SUPPLIER_CD = @@SUPPLIER_CD 
						AND SUPPLIER_PLANT = @@SUPPLIER_PLANT 
						AND DOCK_CD = @@DOCK_CD)
		BEGIN
			RAISERROR('Data with same Part No, Supplier, Supplier Plant, and Dock Code is Already Exists. Update Failed', 16, 1)
		END

		INSERT INTO TB_M_PART_INFO
		( 
			SUPPLIER_CD,
			SUPPLIER_PLANT,
			PART_NO,
			DOCK_CD,
			KANBAN_QTY,
			START_DT,
			END_DT,
			CREATED_BY,
			CREATED_DT,
			PRMCD,
			PART_NAME,
			KANBAN_NO,
			PCK_TYPE
		)
		VALUES  ( 
			@@SUPPLIER_CD,
			@@SUPPLIER_PLANT,
			@@PART_NO,
			@@DOCK_CD,
			@@KANBAN_QTY, 
			@@START_DT, 
			@@END_DT, 
			@@USERNAME,
			GETDATE(), 
			@@FLAG,
			@@PART_NAME,
			@@KANBAN_NO,
			@@PCK_TYPE
		)
	END

	SELECT 'SUCCESS'
END TRY
BEGIN CATCH
	SELECT ERROR_MESSAGE()
END CATCH