DECLARE @@PR_PO_MONTH VARCHAR(7) = @0,
@@NOTES VARCHAR(MAX) = @1,
@@CREATED_BY VARCHAR (25) = @2,
@@PARAM VARCHAR (MAX) = @3,
@@PID BIGINT = @4

EXEC [SP_DLV_CreatePRJobIn] @@PR_PO_MONTH, @@NOTES, @@CREATED_BY,@@PARAM, @@PID; 
--EXEC [SP_DLV_Create_PR] @@PR_PO_MONTH, @@NOTES, @@CREATED_BY,@@PARAM, @@SELECTION, 0;