﻿	INSERT INTO 
	TB_R_DELIVERY_CTL_ORDER (DELIVERY_NO, MANIFEST_NO, ORDER_NO, SUPPLIER_CD, SUPPLIER_PLANT, ORDER_TYPE,
							 ORDER_RELEASE_DT, ROUTE, RATE, RCV_PLANT_CD, DOCK_CD, TOTAL_ITEM, TOTAL_QTY, ERROR_QTY,
							 ARRIVAL_PLAN_DT, ARRIVAL_ACTUAL_DT, DEPARTURE_PLAN_DT, CREATED_BY, CREATED_DT, CHANGED_BY, CHANGED_DT)
	VALUES(@0, @1, @2, @3, @4, @5, @6, @7, @8, @9, @10, @11, @12, @13, @14, @15, @16, @17, @18, @19, @20);