/****** For Popup Detail on LPOP Confirmation ******/
SELECT [PACK_MONTH]
      ,[D_ID]
      ,[VERS]
      ,[SUPPLIER_CD]
      ,[SUPPLIER_NAME]
      ,[PART_NO]
      ,[PART_NAME]
      ,[N_VOLUME]
      ,[N_1_VOLUME]
      ,[N_2_VOLUME]
      ,[N_3_VOLUME]
      ,[PCD_MATERIAL_MASTER]
      ,[PCD_ROUTING]
      ,[PCD_PART_LIST]
      ,[PCD_OTHERS]
      ,[PAD_DOCK_CODE]
      ,[PAD_MATDOCK]
      ,[PAD_LOCATION_CODE]
      ,[PAD_OTHERS]
      ,[PUD_MATERIAL_PRICE]
      ,[PUD_STANDARD_PRICE]
      ,[PUD_PO]
      ,[PUD_SOURCE_LIST]
      ,[PUD_SUPPLIER_MASTER]
      ,[PUD_OTHERS]
      ,[PVD_PACKING_TYPE]
      ,[PVD_OTHERS]
      ,[ISTD_SYSTEM]
      ,[ISTD_OTHERS]
  FROM TB_R_LPOP_ABNORMALITY
  WHERE PACK_MONTH=@0 AND D_ID=@1