﻿DECLARE @@SQL VARCHAR(MAX)
DECLARE @@MANIVEST_NO VARCHAR(MAX)
SET @@MANIVEST_NO = '''' + REPLACE(@0,';',''',''') + ''''

SET @@SQL = ' DECLARE @@RESULT VARCHAR(MAX)' +
		' SET @@RESULT = ''''' +
		' SELECT @@RESULT = CASE WHEN (@@RESULT = '''') THEN @@RESULT + MANIFEST_NO ELSE @@RESULT + '', '' + MANIFEST_NO END' +
		' FROM TB_R_DAILY_ORDER_MANIFEST' +
		' WHERE MANIFEST_NO IN (' + @@MANIVEST_NO + ')' +
		' AND MANIFEST_NO NOT IN (' +
		' SELECT MANIFEST_NO FROM TB_R_DAILY_ORDER_MANIFEST' +
		' WHERE MANIFEST_NO IN (' + @@MANIVEST_NO + ')' +
		' AND MANIFEST_RECEIVE_FLAG = ''5''' +
		' AND ISNULL(CANCEL_FLAG, 0) = 0' +
		' AND ISNULL(DELETION_FLAG, 0) = 0' +
		')' +
		'SELECT ISNULL(@@RESULT, '''')'

EXECUTE(@@SQL)
