﻿DECLARE @@vPR_NO varchar(max)=@0
SELECT     TB_M_LOGISTIC_PARTNER.LOG_PARTNER_NAME, TB_R_DLV_PR_D.ROUTE_CD, TB_R_DLV_PR_D.PR_QTY, TB_R_DLV_PR_H.LP_CD, TB_R_DLV_PR_H.PR_NO, 
                      (CASE 
					  WHEN TB_R_DLV_PR_H.PR_STATUS_FLAG = 'PR1' THEN 'PR Retrieved' 
					  WHEN TB_R_DLV_PR_H.PR_STATUS_FLAG = 'PR2' THEN 'PR Created'
					  WHEN TB_R_DLV_PR_H.PR_STATUS_FLAG = 'PR3' THEN 'PR - SH Approved' 
					  WHEN TB_R_DLV_PR_H.PR_STATUS_FLAG = 'PR4' THEN 'PR - DpH Approved' 
					  WHEN TB_R_DLV_PR_H.PR_STATUS_FLAG = 'PR5' THEN 'PR Released'
                      WHEN TB_R_DLV_PR_H.PR_STATUS_FLAG = 'PR6' THEN 'PR Rejected' ELSE 'NA' END) AS PR_STATUS, TB_M_DLV_ROUTE.ROUTE_NAME, 
                      CAST(TB_R_DLV_PR_H.CREATED_DT AS Date) AS CREATED_DT
FROM         TB_R_DLV_PR_H INNER JOIN
                      TB_R_DLV_PR_D ON TB_R_DLV_PR_H.PR_NO = TB_R_DLV_PR_D.PR_NO LEFT OUTER JOIN
                      TB_M_DLV_ROUTE ON TB_R_DLV_PR_D.ROUTE_CD = TB_M_DLV_ROUTE.ROUTE_CD LEFT OUTER JOIN
                      TB_M_LOGISTIC_PARTNER ON TB_R_DLV_PR_H.LP_CD = TB_M_LOGISTIC_PARTNER.LOG_PARTNER_CD
WHERE (TB_R_DLV_PR_H.PR_NO = @@vPR_NO ) 
ORDER BY TB_R_DLV_PR_D.ROUTE_CD

