DECLARE @@SQL VARCHAR(MAX),
		@@PARAM VARCHAR(MAX) = ''

SET @@SQL = '
	SELECT COMP_PRICE_CD, CONDITION_RULE, COMP_PRICE, TAX_CD, CREATED_BY, CREATED_DT, CHANGED_BY, CHANGED_DT
	FROM TB_M_DLV_COMP_PRICE_RATE
'

IF (@0 <> '')
BEGIN
	SET @@PARAM = @@PARAM + ' COMP_PRICE_CD IN (' + @0 + ')'
END

IF (@1 <> '')
BEGIN
	IF (@@PARAM <> '') SET @@PARAM = @@PARAM + ' AND'
	SET @@PARAM = @@PARAM + ' CONDITION_RULE LIKE ''%' + @1 + '%'' '
END

IF (@2 <> '')
BEGIN
	IF (@@PARAM <> '') SET @@PARAM = @@PARAM + ' AND'
	SET @@PARAM = @@PARAM + ' TAX_CD IN (' + @2 + ')'
END

IF (@@PARAM <> '')
	SET @@PARAM = 'WHERE' + @@PARAM
ELSE
	SET @@PARAM = 'WHERE COMP_PRICE_CD IS NULL'

EXEC(@@SQL+@@PARAM)