5918|1|201307301200|00000004|00001166
1201318024	5918	1		807B	1	1N	2013080201			135910W01000		1	2013-07-31 00:00:00.000	3152	56	280	5				DAIDO INDONESIA MANUFACTURING	ARM  TIMING CHAIN   TENSION	D	2013-08-02 08:15:00.000	2013-08-02 16:45:00.000	MS1N	12	2013-08-02 00:00:00.000	DS65	01	2013-08-02 00:00:00.000	807B	1	1NP	2013-08-02 11:00:00.000	2013-08-02 16:45:00.000	MS1N	12	0802																807B11NP	2013-07-31 09:45:00.000	2013-07-31 09:45:00.000	807B11NP	2013-07-31 09:45:00.000	2013-07-31 09:45:00.000				0		0		0		0		0		0	0			0		0	1	Sunter 1	                  								
1201318024	5918	1		807B	1	1N	2013080201			135660W01000		1	2013-07-31 00:00:00.000	3151	50	250	5				DAIDO INDONESIA MANUFACTURING	GUIDE  TIMING CHAIN	D	2013-08-02 08:15:00.000	2013-08-02 16:45:00.000	MS1N	12	2013-08-02 00:00:00.000	DS65	01	2013-08-02 00:00:00.000	807B	1	1NP	2013-08-02 11:00:00.000	2013-08-02 16:45:00.000	MS1N	12	0802																807B11NP	2013-07-31 09:45:00.000	2013-07-31 09:45:00.000	807B11NP	2013-07-31 09:45:00.000	2013-07-31 09:45:00.000				0		0		0		0		0		0	0			0		0	1	Sunter 1	                  								
1201318028	5918	1		807B	1	1N	2013080202			135660W01000		1	2013-07-31 00:00:00.000	3151	50	300	6				DAIDO INDONESIA MANUFACTURING	GUIDE  TIMING CHAIN	D	2013-08-02 08:15:00.000	2013-08-03 05:25:00.000	MS1N	24	2013-08-02 00:00:00.000	DS65	01	2013-08-02 00:00:00.000	807B	1	1NP	2013-08-02 11:00:00.000	2013-08-03 05:25:00.000	MS1N	24	0802																807B11NP	2013-07-31 09:45:00.000	2013-07-31 09:45:00.000	807B11NP	2013-07-31 09:45:00.000	2013-07-31 09:45:00.000				0		0		0		0		0		0	0			0		0	1	Sunter 1	                  								
1201318028	5918	1		807B	1	1N	2013080202			135910W01000		1	2013-07-31 00:00:00.000	3152	56	336	6				DAIDO INDONESIA MANUFACTURING	ARM  TIMING CHAIN   TENSION	D	2013-08-02 08:15:00.000	2013-08-03 05:25:00.000	MS1N	24	2013-08-02 00:00:00.000	DS65	01	2013-08-02 00:00:00.000	807B	1	1NP	2013-08-02 11:00:00.000	2013-08-03 05:25:00.000	MS1N	24	0802																807B11NP	2013-07-31 09:45:00.000	2013-07-31 09:45:00.000	807B11NP	2013-07-31 09:45:00.000	2013-07-31 09:45:00.000				0		0		0		0		0		0	0			0		0	1	Sunter 1	                  								
