5022|1|201307311200|00000026|00000810
4201335574	5022	1		807D	4	43	2013073102			894650K02000		1	2013-07-31 00:00:00.000	2388	50	0	0				DENSO INDONESIA CORPORATION (SUNTER)	SENSOR  OXYGEN	D	2013-07-31 11:00:00.000	2013-07-31 20:04:00.000	MK43	19	2013-07-31 00:00:00.000	RK08	01	2013-07-31 00:00:00.000	807D	4	43P	2013-07-31 14:40:00.000	2013-07-31 20:04:00.000	MK43	19	0731																50221	2013-07-31 07:00:00.000	2013-07-31 07:00:00.000	50221	2013-07-31 07:00:00.000	2013-07-31 07:00:00.000				0		0		0		0		1	2013-07-30 01:42:28.730	0	0			0		0	1	Karawang IMV	TP362		JK149100-	05500T	1				
4201335574	5022	1		807D	4	43	2013073102			894650K04000	P1E  - 102	1	2013-07-31 00:00:00.000	5172	50	0	0				DENSO INDONESIA CORPORATION (SUNTER)	SENSOR OXYGEN ( NEW )	D	2013-07-31 11:00:00.000	2013-07-31 20:04:00.000	MK43	19	2013-07-31 00:00:00.000	RK08	01	2013-07-31 00:00:00.000	807D	4	43P	2013-07-31 14:40:00.000	2013-07-31 20:04:00.000	MK43	19	0731																50221	2013-07-31 07:00:00.000	2013-07-31 07:00:00.000	50221	2013-07-31 07:00:00.000	2013-07-31 07:00:00.000	3			0		0		0		0		1	2013-07-30 01:42:28.730	0	0			0		0	1	Karawang IMV			JK149100-	07120T					
4201335574	5022	1		807D	4	43	2013073102			894650K06000	SPEG -  S6	1	2013-07-31 00:00:00.000	5173	50	0	0				DENSO INDONESIA CORPORATION (SUNTER)	SENSOR OXYGEN ( NEW )	D	2013-07-31 11:00:00.000	2013-07-31 20:04:00.000	MK43	19	2013-07-31 00:00:00.000	RK08	01	2013-07-31 00:00:00.000	807D	4	43P	2013-07-31 14:40:00.000	2013-07-31 20:04:00.000	MK43	19	0731																50221	2013-07-31 07:00:00.000	2013-07-31 07:00:00.000	50221	2013-07-31 07:00:00.000	2013-07-31 07:00:00.000	B			0		0		0		0		1	2013-07-30 01:42:28.730	0	0			0		0	1	Karawang IMV			JK149100-	06720T					
4201335574	5022	1		807D	4	43	2013073102			894650K07000	SPEG -  S5	1	2013-07-31 00:00:00.000	5174	50	0	0				DENSO INDONESIA CORPORATION (SUNTER)	SENSOR OXYGEN ( NEW )	D	2013-07-31 11:00:00.000	2013-07-31 20:04:00.000	MK43	19	2013-07-31 00:00:00.000	RK08	01	2013-07-31 00:00:00.000	807D	4	43P	2013-07-31 14:40:00.000	2013-07-31 20:04:00.000	MK43	19	0731																50221	2013-07-31 07:00:00.000	2013-07-31 07:00:00.000	50221	2013-07-31 07:00:00.000	2013-07-31 07:00:00.000	B			0		0		0		0		1	2013-07-30 01:42:28.730	0	0			0		0	1	Karawang IMV			JK149100-	06820T					
4201335574	5022	1		807D	4	43	2013073102			894650K08000	P1E  - 102	1	2013-07-31 00:00:00.000	5175	50	0	0				DENSO INDONESIA CORPORATION (SUNTER)	SENSOR OXYGEN ( NEW )	D	2013-07-31 11:00:00.000	2013-07-31 20:04:00.000	MK43	19	2013-07-31 00:00:00.000	RK08	01	2013-07-31 00:00:00.000	807D	4	43P	2013-07-31 14:40:00.000	2013-07-31 20:04:00.000	MK43	19	0731																50221	2013-07-31 07:00:00.000	2013-07-31 07:00:00.000	50221	2013-07-31 07:00:00.000	2013-07-31 07:00:00.000	3			0		0		0		0		1	2013-07-30 01:42:28.730	0	0			0		0	1	Karawang IMV			JK149100-	06920T					
4201335574	5022	1		807D	4	43	2013073102			894650K10000	SPEG -  S4	1	2013-07-31 00:00:00.000	3920	50	0	0				DENSO INDONESIA CORPORATION (SUNTER)	SENSOR  OXYGEN	D	2013-07-31 11:00:00.000	2013-07-31 20:04:00.000	MK43	19	2013-07-31 00:00:00.000	RK08	01	2013-07-31 00:00:00.000	807D	4	43P	2013-07-31 14:40:00.000	2013-07-31 20:04:00.000	MK43	19	0731																50221	2013-07-31 07:00:00.000	2013-07-31 07:00:00.000	50221	2013-07-31 07:00:00.000	2013-07-31 07:00:00.000	B			0		0		0		0		1	2013-07-30 01:42:28.730	0	0			0		0	1	Karawang IMV			JK149100-	18210T					
4201335574	5022	1		807D	4	43	2013073102			865100K01000	J4T  - S97	1	2013-07-31 00:00:00.000	2376	30	150	5				DENSO INDONESIA CORPORATION (SUNTER)	HORN ASSY  HIGH PITCHED	D	2013-07-31 11:00:00.000	2013-07-31 20:04:00.000	MK43	19	2013-07-31 00:00:00.000	RK08	01	2013-07-31 00:00:00.000	807D	4	43P	2013-07-31 14:40:00.000	2013-07-31 20:04:00.000	MK43	19	0731																50221	2013-07-31 07:00:00.000	2013-07-31 07:00:00.000	50221	2013-07-31 07:00:00.000	2013-07-31 07:00:00.000	K			0		0		0		0		1	2013-07-30 01:42:28.730	0	0			0		0	1	Karawang IMV	6055		JK272100-	66010T	1				
4201335574	5022	1		807D	4	43	2013073102			865100K03000	P1D  - 074	1	2013-07-31 00:00:00.000	2377	20	20	1				DENSO INDONESIA CORPORATION (SUNTER)	HORN ASSY  HIGH PITCHED	D	2013-07-31 11:00:00.000	2013-07-31 20:04:00.000	MK43	19	2013-07-31 00:00:00.000	RK08	01	2013-07-31 00:00:00.000	807D	4	43P	2013-07-31 14:40:00.000	2013-07-31 20:04:00.000	MK43	19	0731																50221	2013-07-31 07:00:00.000	2013-07-31 07:00:00.000	50221	2013-07-31 07:00:00.000	2013-07-31 07:00:00.000	3			0		0		0		0		1	2013-07-30 01:42:28.730	0	0			0		0	1	Karawang IMV	6055		JK272100-	66800T	1				
4201335574	5022	1		807D	4	43	2013073102			865100K07000	J4T  - S97	1	2013-07-31 00:00:00.000	535A	30	0	0				DENSO INDONESIA CORPORATION (SUNTER)	HORN ASSY  HIGH PITCHED	D	2013-07-31 11:00:00.000	2013-07-31 20:04:00.000	MK43	19	2013-07-31 00:00:00.000	RK08	01	2013-07-31 00:00:00.000	807D	4	43P	2013-07-31 14:40:00.000	2013-07-31 20:04:00.000	MK43	19	0731																50221	2013-07-31 07:00:00.000	2013-07-31 07:00:00.000	50221	2013-07-31 07:00:00.000	2013-07-31 07:00:00.000	K			0		0		0		0		1	2013-07-30 01:42:28.730	0	0			0		0	1	Karawang IMV									
4201335574	5022	1		807D	4	43	2013073102			865200K01000	J4T  - S97	1	2013-07-31 00:00:00.000	2378	30	150	5				DENSO INDONESIA CORPORATION (SUNTER)	HORN ASSY  LOW PITCHED	D	2013-07-31 11:00:00.000	2013-07-31 20:04:00.000	MK43	19	2013-07-31 00:00:00.000	RK08	01	2013-07-31 00:00:00.000	807D	4	43P	2013-07-31 14:40:00.000	2013-07-31 20:04:00.000	MK43	19	0731																50221	2013-07-31 07:00:00.000	2013-07-31 07:00:00.000	50221	2013-07-31 07:00:00.000	2013-07-31 07:00:00.000	K			0		0		0		0		1	2013-07-30 01:42:28.730	0	0			0		0	1	Karawang IMV	6055		JK272200-	66010T	1				
4201335574	5022	1		807D	4	43	2013073102			865200K05000	J4T  - S97	1	2013-07-31 00:00:00.000	536A	30	0	0				DENSO INDONESIA CORPORATION (SUNTER)	HORN ASSY  LOW PITCHED	D	2013-07-31 11:00:00.000	2013-07-31 20:04:00.000	MK43	19	2013-07-31 00:00:00.000	RK08	01	2013-07-31 00:00:00.000	807D	4	43P	2013-07-31 14:40:00.000	2013-07-31 20:04:00.000	MK43	19	0731																50221	2013-07-31 07:00:00.000	2013-07-31 07:00:00.000	50221	2013-07-31 07:00:00.000	2013-07-31 07:00:00.000	K			0		0		0		0		1	2013-07-30 01:42:28.730	0	0			0		0	1	Karawang IMV									
4201335574	5022	1		807D	4	43	2013073102			865600K01000	P1D  - 074	1	2013-07-31 00:00:00.000	5514	20	20	1				DENSO INDONESIA CORPORATION (SUNTER)	HORN ASSY  SECURITY	D	2013-07-31 11:00:00.000	2013-07-31 20:04:00.000	MK43	19	2013-07-31 00:00:00.000	RK08	01	2013-07-31 00:00:00.000	807D	4	43P	2013-07-31 14:40:00.000	2013-07-31 20:04:00.000	MK43	19	0731																50221	2013-07-31 07:00:00.000	2013-07-31 07:00:00.000	50221	2013-07-31 07:00:00.000	2013-07-31 07:00:00.000	3			0		0		0		0		1	2013-07-30 01:42:28.730	0	0			0		0	1	Karawang IMV			JK272100-	74800T					
4201335574	5022	1		807D	4	43	2013073102			894650K01000	P1E  - 109	1	2013-07-31 00:00:00.000	2385	50	100	2				DENSO INDONESIA CORPORATION (SUNTER)	SENSOR  OXYGEN	D	2013-07-31 11:00:00.000	2013-07-31 20:04:00.000	MK43	19	2013-07-31 00:00:00.000	RK08	01	2013-07-31 00:00:00.000	807D	4	43P	2013-07-31 14:40:00.000	2013-07-31 20:04:00.000	MK43	19	0731																50221	2013-07-31 07:00:00.000	2013-07-31 07:00:00.000	50221	2013-07-31 07:00:00.000	2013-07-31 07:00:00.000				0		0		0		0		1	2013-07-30 01:42:28.730	0	0			0		0	1	Karawang IMV	TP362		JK211100-	02920T	1				
4201336335	5022	1		807D	4	43	2013081401			865100K01000	J4T  - S97	1	2013-07-31 00:00:00.000	2376	30	120	4				DENSO INDONESIA CORPORATION (SUNTER)	HORN ASSY  HIGH PITCHED	D	2013-08-14 04:25:00.000	2013-08-14 11:39:00.000	MK43	09	2013-08-14 00:00:00.000	RK08	01	2013-08-14 00:00:00.000	807D	4	43P	2013-08-14 08:30:00.000	2013-08-14 11:39:00.000	MK43	09	0814																50221	2013-08-14 00:25:00.000	2013-08-14 00:25:00.000	50221	2013-08-14 00:25:00.000	2013-08-14 00:25:00.000	K			0		0		0		0		1	2013-07-30 01:42:28.730	0	0			0		0	1	Karawang IMV	6055		JK272100-	66010T	1				
4201336335	5022	1		807D	4	43	2013081401			894650K02000		1	2013-07-31 00:00:00.000	2388	50	0	0				DENSO INDONESIA CORPORATION (SUNTER)	SENSOR  OXYGEN	D	2013-08-14 04:25:00.000	2013-08-14 11:39:00.000	MK43	09	2013-08-14 00:00:00.000	RK08	01	2013-08-14 00:00:00.000	807D	4	43P	2013-08-14 08:30:00.000	2013-08-14 11:39:00.000	MK43	09	0814																50221	2013-08-14 00:25:00.000	2013-08-14 00:25:00.000	50221	2013-08-14 00:25:00.000	2013-08-14 00:25:00.000				0		0		0		0		1	2013-07-30 01:42:28.730	0	0			0		0	1	Karawang IMV	TP362		JK149100-	05500T	1				
4201336335	5022	1		807D	4	43	2013081401			894650K04000	P1E  - 102	1	2013-07-31 00:00:00.000	5172	50	0	0				DENSO INDONESIA CORPORATION (SUNTER)	SENSOR OXYGEN ( NEW )	D	2013-08-14 04:25:00.000	2013-08-14 11:39:00.000	MK43	09	2013-08-14 00:00:00.000	RK08	01	2013-08-14 00:00:00.000	807D	4	43P	2013-08-14 08:30:00.000	2013-08-14 11:39:00.000	MK43	09	0814																50221	2013-08-14 00:25:00.000	2013-08-14 00:25:00.000	50221	2013-08-14 00:25:00.000	2013-08-14 00:25:00.000	3			0		0		0		0		1	2013-07-30 01:42:28.730	0	0			0		0	1	Karawang IMV			JK149100-	07120T					
4201336335	5022	1		807D	4	43	2013081401			894650K06000	SPEG -  S6	1	2013-07-31 00:00:00.000	5173	50	0	0				DENSO INDONESIA CORPORATION (SUNTER)	SENSOR OXYGEN ( NEW )	D	2013-08-14 04:25:00.000	2013-08-14 11:39:00.000	MK43	09	2013-08-14 00:00:00.000	RK08	01	2013-08-14 00:00:00.000	807D	4	43P	2013-08-14 08:30:00.000	2013-08-14 11:39:00.000	MK43	09	0814																50221	2013-08-14 00:25:00.000	2013-08-14 00:25:00.000	50221	2013-08-14 00:25:00.000	2013-08-14 00:25:00.000	B			0		0		0		0		1	2013-07-30 01:42:28.730	0	0			0		0	1	Karawang IMV			JK149100-	06720T					
4201336335	5022	1		807D	4	43	2013081401			894650K07000	SPEG -  S5	1	2013-07-31 00:00:00.000	5174	50	0	0				DENSO INDONESIA CORPORATION (SUNTER)	SENSOR OXYGEN ( NEW )	D	2013-08-14 04:25:00.000	2013-08-14 11:39:00.000	MK43	09	2013-08-14 00:00:00.000	RK08	01	2013-08-14 00:00:00.000	807D	4	43P	2013-08-14 08:30:00.000	2013-08-14 11:39:00.000	MK43	09	0814																50221	2013-08-14 00:25:00.000	2013-08-14 00:25:00.000	50221	2013-08-14 00:25:00.000	2013-08-14 00:25:00.000	B			0		0		0		0		1	2013-07-30 01:42:28.730	0	0			0		0	1	Karawang IMV			JK149100-	06820T					
4201336335	5022	1		807D	4	43	2013081401			894650K08000	P1E  - 102	1	2013-07-31 00:00:00.000	5175	50	0	0				DENSO INDONESIA CORPORATION (SUNTER)	SENSOR OXYGEN ( NEW )	D	2013-08-14 04:25:00.000	2013-08-14 11:39:00.000	MK43	09	2013-08-14 00:00:00.000	RK08	01	2013-08-14 00:00:00.000	807D	4	43P	2013-08-14 08:30:00.000	2013-08-14 11:39:00.000	MK43	09	0814																50221	2013-08-14 00:25:00.000	2013-08-14 00:25:00.000	50221	2013-08-14 00:25:00.000	2013-08-14 00:25:00.000	3			0		0		0		0		1	2013-07-30 01:42:28.730	0	0			0		0	1	Karawang IMV			JK149100-	06920T					
4201336335	5022	1		807D	4	43	2013081401			894650K10000	SPEG -  S4	1	2013-07-31 00:00:00.000	3920	50	0	0				DENSO INDONESIA CORPORATION (SUNTER)	SENSOR  OXYGEN	D	2013-08-14 04:25:00.000	2013-08-14 11:39:00.000	MK43	09	2013-08-14 00:00:00.000	RK08	01	2013-08-14 00:00:00.000	807D	4	43P	2013-08-14 08:30:00.000	2013-08-14 11:39:00.000	MK43	09	0814																50221	2013-08-14 00:25:00.000	2013-08-14 00:25:00.000	50221	2013-08-14 00:25:00.000	2013-08-14 00:25:00.000	B			0		0		0		0		1	2013-07-30 01:42:28.730	0	0			0		0	1	Karawang IMV			JK149100-	18210T					
4201336335	5022	1		807D	4	43	2013081401			865100K03000	P1D  - 074	1	2013-07-31 00:00:00.000	2377	20	0	0				DENSO INDONESIA CORPORATION (SUNTER)	HORN ASSY  HIGH PITCHED	D	2013-08-14 04:25:00.000	2013-08-14 11:39:00.000	MK43	09	2013-08-14 00:00:00.000	RK08	01	2013-08-14 00:00:00.000	807D	4	43P	2013-08-14 08:30:00.000	2013-08-14 11:39:00.000	MK43	09	0814																50221	2013-08-14 00:25:00.000	2013-08-14 00:25:00.000	50221	2013-08-14 00:25:00.000	2013-08-14 00:25:00.000	3			0		0		0		0		1	2013-07-30 01:42:28.730	0	0			0		0	1	Karawang IMV	6055		JK272100-	66800T	1				
4201336335	5022	1		807D	4	43	2013081401			865100K07000	J4T  - S97	1	2013-07-31 00:00:00.000	535A	30	0	0				DENSO INDONESIA CORPORATION (SUNTER)	HORN ASSY  HIGH PITCHED	D	2013-08-14 04:25:00.000	2013-08-14 11:39:00.000	MK43	09	2013-08-14 00:00:00.000	RK08	01	2013-08-14 00:00:00.000	807D	4	43P	2013-08-14 08:30:00.000	2013-08-14 11:39:00.000	MK43	09	0814																50221	2013-08-14 00:25:00.000	2013-08-14 00:25:00.000	50221	2013-08-14 00:25:00.000	2013-08-14 00:25:00.000	K			0		0		0		0		1	2013-07-30 01:42:28.730	0	0			0		0	1	Karawang IMV									
4201336335	5022	1		807D	4	43	2013081401			865200K01000	J4T  - S97	1	2013-07-31 00:00:00.000	2378	30	150	5				DENSO INDONESIA CORPORATION (SUNTER)	HORN ASSY  LOW PITCHED	D	2013-08-14 04:25:00.000	2013-08-14 11:39:00.000	MK43	09	2013-08-14 00:00:00.000	RK08	01	2013-08-14 00:00:00.000	807D	4	43P	2013-08-14 08:30:00.000	2013-08-14 11:39:00.000	MK43	09	0814																50221	2013-08-14 00:25:00.000	2013-08-14 00:25:00.000	50221	2013-08-14 00:25:00.000	2013-08-14 00:25:00.000	K			0		0		0		0		1	2013-07-30 01:42:28.730	0	0			0		0	1	Karawang IMV	6055		JK272200-	66010T	1				
4201336335	5022	1		807D	4	43	2013081401			865200K05000	J4T  - S97	1	2013-07-31 00:00:00.000	536A	30	0	0				DENSO INDONESIA CORPORATION (SUNTER)	HORN ASSY  LOW PITCHED	D	2013-08-14 04:25:00.000	2013-08-14 11:39:00.000	MK43	09	2013-08-14 00:00:00.000	RK08	01	2013-08-14 00:00:00.000	807D	4	43P	2013-08-14 08:30:00.000	2013-08-14 11:39:00.000	MK43	09	0814																50221	2013-08-14 00:25:00.000	2013-08-14 00:25:00.000	50221	2013-08-14 00:25:00.000	2013-08-14 00:25:00.000	K			0		0		0		0		1	2013-07-30 01:42:28.730	0	0			0		0	1	Karawang IMV									
4201336335	5022	1		807D	4	43	2013081401			865600K01000	P1D  - 074	1	2013-07-31 00:00:00.000	5514	20	0	0				DENSO INDONESIA CORPORATION (SUNTER)	HORN ASSY  SECURITY	D	2013-08-14 04:25:00.000	2013-08-14 11:39:00.000	MK43	09	2013-08-14 00:00:00.000	RK08	01	2013-08-14 00:00:00.000	807D	4	43P	2013-08-14 08:30:00.000	2013-08-14 11:39:00.000	MK43	09	0814																50221	2013-08-14 00:25:00.000	2013-08-14 00:25:00.000	50221	2013-08-14 00:25:00.000	2013-08-14 00:25:00.000	3			0		0		0		0		1	2013-07-30 01:42:28.730	0	0			0		0	1	Karawang IMV			JK272100-	74800T					
4201336335	5022	1		807D	4	43	2013081401			894650K01000	P1E  - 109	1	2013-07-31 00:00:00.000	2385	50	100	2				DENSO INDONESIA CORPORATION (SUNTER)	SENSOR  OXYGEN	D	2013-08-14 04:25:00.000	2013-08-14 11:39:00.000	MK43	09	2013-08-14 00:00:00.000	RK08	01	2013-08-14 00:00:00.000	807D	4	43P	2013-08-14 08:30:00.000	2013-08-14 11:39:00.000	MK43	09	0814																50221	2013-08-14 00:25:00.000	2013-08-14 00:25:00.000	50221	2013-08-14 00:25:00.000	2013-08-14 00:25:00.000				0		0		0		0		1	2013-07-30 01:42:28.730	0	0			0		0	1	Karawang IMV	TP362		JK211100-	02920T	1				
