(page_layout
  (setup (textsize 1.5 1.5)(linewidth 0.15)(textlinewidth 0.15)
  (left_margin 10)(right_margin 10)(top_margin 10)(bottom_margin 10))
  (rect (name rect1:Rect) (start 0 0 ltcorner) (end 0 0) (repeat 2) (incrx 2) (incry 2))
  (line (name segm1:Line) (start 50 2 ltcorner) (end 50 0 ltcorner) (repeat 30) (incrx 50))
  (tbtext 1 (name text1:Text) (pos 25 1 ltcorner) (font (size 1.3 1.3)) (repeat 100) (incrx 50))
  (line (name segm2:Line) (start 50 2 lbcorner) (end 50 0 lbcorner) (repeat 30) (incrx 50))
  (tbtext 1 (name text2:Text) (pos 25 1 lbcorner) (font (size 1.3 1.3)) (repeat 100) (incrx 50))
  (line (name segm3:Line) (start 0 50 ltcorner) (end 2 50 ltcorner) (repeat 30) (incry 50))
  (tbtext A (name text3:Text) (pos 1 25 ltcorner) (font (size 1.3 1.3)) (justify center) (repeat 100) (incry 50))
  (line (name segm4:Line) (start 0 50 rtcorner) (end 2 50 rtcorner) (repeat 30) (incry 50))
  (tbtext A (name text4:Text) (pos 1 25 rtcorner) (font (size 1.3 1.3)) (justify center) (repeat 100) (incry 50))
  (tbtext "Date : %D" (name text5:Text) (pos 109.8002 6.900199999999984))
  (line (name segm5:Line) (start 110 5.5) (end 32.002 5.5))
  (line (name segm6:Line) (start 110 18.5) (end 110 2))
  (line (name segm7:Line) (start 110 8.5) (end 32.002 8.5))
  (tbtext "Size : %Z" (name text6:Text) (pos 109.8002 3.900199999999984))
  (tbtext "Author : %C0" (name text7:Text) (pos 64.8 6.9))
  (tbtext "Page : %S/%N" (name text8:Text) (pos 64.8 4))
  (line (name segm8:Line) (start 110.0002 11.50019999999998) (end 2.000200000000007 11.50019999999998))
  (tbtext "Title : %T" (name text9:Text) (pos 109 14.7) (font (size 2 2) bold italic))
  (tbtext "File : %F" (name text10:Text) (pos 109.8 10))
  (line (name segm9:Line) (start 110 18.5) (end 2 18.5))
  (line (name segm10:Line) (start 90.00020000000001 5.500199999999978) (end 90.00220000000002 2.007199999999983))
  (tbtext "Rev : %R" (name text11:Text) (pos 89.80020000000002 4.000199999999978))
  (line (name segm11:Line) (start 65 8.5) (end 65 2))
  (line (name segm12:Line) (start 32.00220000000002 11.50019999999998) (end 32.00220000000002 2.000199999999978))
)
