EESchema Schematic File Version 4
EELAYER 30 0
EELAYER END
$Descr A4 11693 8268
encoding utf-8
Sheet 1 1
Title "Schematics overview"
Date ""
Rev "1"
Comp "Shapeline B.V."
Comment1 ""
Comment2 ""
Comment3 ""
Comment4 ""
$EndDescr
$Comp
L MCU:STM8S003K3T6CTR U1
U 1 1 5F1893AA
P 5300 850
F 0 "U1" H 5625 991 39  0000 C CNN
F 1 "STM8S003K3T6CTR" H 6650 900 39  0001 L CNN
F 2 "MCU:LQFP32" H 6650 200 39  0001 L CIB
F 3 "${SHAPELINEKILIB}/Semiconductors/MCU/Datasheets/STM8S003.pdf" H 3900 650 60  0001 C CNN
F 4 "STM8S003K3T6CTR" H 5625 916 39  0000 C CNN "Name"
F 5 "STMicroelectronics" H 6650 500 39  0001 L CNN "Manufacturer"
F 6 "2.95V to 5.5V" H 6650 700 39  0001 L CNN "Voltage"
F 7 "-40°C to 85°C" H 6650 600 39  0001 L CNN "Temperature"
F 8 "16 MHz" H 6650 800 39  0001 L CNN "Frequency"
F 9 "Farnell" H 6650 400 39  0001 L CNN "Vendor"
F 10 "2770278" H 6650 300 39  0001 L CNN "Vendor Part Number"
	1    5300 850 
	1    0    0    -1  
$EndComp
$Comp
L MCU:STM8S003K3T6CTR U1
U 3 1 5F18A6B2
P 7450 4450
F 0 "U1" H 7800 4591 39  0000 C CNN
F 1 "STM8S003K3T6CTR" H 8800 4500 39  0001 L CNN
F 2 "MCU:LQFP32" H 8800 3800 39  0001 L CIB
F 3 "${SHAPELINEKILIB}/Semiconductors/MCU/Datasheets/STM8S003.pdf" H 6050 4250 60  0001 C CNN
F 4 "STM8S003K3T6CTR" H 7800 4516 39  0000 C CNN "Name"
F 5 "STMicroelectronics" H 8800 4100 39  0001 L CNN "Manufacturer"
F 6 "2.95V to 5.5V" H 8800 4300 39  0001 L CNN "Voltage"
F 7 "-40°C to 85°C" H 8800 4200 39  0001 L CNN "Temperature"
F 8 "16 MHz" H 8800 4400 39  0001 L CNN "Frequency"
F 9 "Farnell" H 8800 4000 39  0001 L CNN "Vendor"
F 10 "2770278" H 8800 3900 39  0001 L CNN "Vendor Part Number"
	3    7450 4450
	1    0    0    -1  
$EndComp
$Comp
L Diode:E6C0606RGBC3UDA D1
U 1 1 5F18B4FB
P 1050 6000
F 0 "D1" H 1622 5863 39  0000 L CNN
F 1 "E6C0606RGBC3UDA" H 1700 6050 39  0001 L CNN
F 2 "Diode:E6C0606RGBC3UDA" H 1700 4950 39  0001 L CIB
F 3 "${SHAPELINEKILIB}/Semiconductors/Diode/Datasheets/E6C0606RGBC3UDA.pdf" H 1050 6000 60  0001 C CNN
F 4 "LED" H 1700 5950 39  0001 L CNN "Type"
F 5 "Red-Green-Blue" H 1622 5788 39  0000 L CNN "Colour"
F 6 "620-520-465 nm " H 1700 5850 39  0001 L CNN "Wavelength"
F 7 "1.6-2.5-2.5 V" H 1700 5750 39  0001 L CNN "Forward voltage"
F 8 "40-150-30 mcd" H 1700 5650 39  0001 L CNN "Luminous intensity"
F 9 "120°" H 1700 5550 39  0001 L CNN "Angle"
F 10 "20 mA" H 1700 5450 39  0001 L CNN "Maximum current"
F 11 "EKINGLUX" H 1700 5250 39  0001 L CNN "Manufacturer"
F 12 "LCSC" H 1700 5150 39  0001 L CNN "Vendor"
F 13 "C375569" H 1700 5050 39  0001 L CNN "Vendor Part Number"
F 14 "-40°C to 90°C" H 1700 5350 39  0001 L CNN "Temperature"
	1    1050 6000
	1    0    0    -1  
$EndComp
Wire Wire Line
	1500 6350 1500 6400
Wire Wire Line
	1500 6400 1600 6400
Wire Wire Line
	1600 6400 1600 6450
Wire Wire Line
	1300 6350 1300 6450
Wire Wire Line
	1000 6450 1000 6400
Wire Wire Line
	1000 6400 1100 6400
Wire Wire Line
	1100 6400 1100 6350
$Comp
L PowerNets:5V-bar #PWR03
U 1 1 5F18E25E
P 1100 5900
F 0 "#PWR03" H 1425 5975 50  0001 C CNN
F 1 "5V-bar" H 1400 5900 39  0001 C CNN
F 2 "" H 1100 5900 50  0001 C CNN
F 3 "" H 1100 5900 50  0001 C CNN
F 4 "5V" H 1100 6017 39  0000 C CNN "Name"
	1    1100 5900
	1    0    0    -1  
$EndComp
Wire Wire Line
	1100 5900 1100 6000
Wire Wire Line
	1000 7150 1000 6750
Wire Wire Line
	1600 6750 1600 7150
Wire Wire Line
	1300 7150 1300 6750
Text Label 1000 7150 1    39   ~ 0
RED_POWER
Text Label 1300 7150 1    39   ~ 0
GREEN_POWER
Text Label 1600 7150 1    39   ~ 0
BLUE_POWER
$Comp
L Diode:E6C0606RGBC3UDA D2
U 1 1 5F195CAE
P 2700 6050
F 0 "D2" H 3272 5913 39  0000 L CNN
F 1 "E6C0606RGBC3UDA" H 3350 6100 39  0001 L CNN
F 2 "Diode:E6C0606RGBC3UDA" H 3350 5000 39  0001 L CIB
F 3 "${SHAPELINEKILIB}/Semiconductors/Diode/Datasheets/E6C0606RGBC3UDA.pdf" H 2700 6050 60  0001 C CNN
F 4 "LED" H 3350 6000 39  0001 L CNN "Type"
F 5 "Red-Green-Blue" H 3272 5838 39  0000 L CNN "Colour"
F 6 "620-520-465 nm " H 3350 5900 39  0001 L CNN "Wavelength"
F 7 "1.6-2.5-2.5 V" H 3350 5800 39  0001 L CNN "Forward voltage"
F 8 "40-150-30 mcd" H 3350 5700 39  0001 L CNN "Luminous intensity"
F 9 "120°" H 3350 5600 39  0001 L CNN "Angle"
F 10 "20 mA" H 3350 5500 39  0001 L CNN "Maximum current"
F 11 "EKINGLUX" H 3350 5300 39  0001 L CNN "Manufacturer"
F 12 "LCSC" H 3350 5200 39  0001 L CNN "Vendor"
F 13 "C375569" H 3350 5100 39  0001 L CNN "Vendor Part Number"
F 14 "-40°C to 90°C" H 3350 5400 39  0001 L CNN "Temperature"
	1    2700 6050
	1    0    0    -1  
$EndComp
Wire Wire Line
	3150 6400 3150 6450
Wire Wire Line
	3150 6450 3250 6450
Wire Wire Line
	3250 6450 3250 6500
Wire Wire Line
	2950 6400 2950 6500
Wire Wire Line
	2650 6500 2650 6450
Wire Wire Line
	2650 6450 2750 6450
Wire Wire Line
	2750 6450 2750 6400
$Comp
L PowerNets:5V-bar #PWR06
U 1 1 5F195CE0
P 2750 5950
F 0 "#PWR06" H 3075 6025 50  0001 C CNN
F 1 "5V-bar" H 3050 5950 39  0001 C CNN
F 2 "" H 2750 5950 50  0001 C CNN
F 3 "" H 2750 5950 50  0001 C CNN
F 4 "5V" H 2750 6067 39  0000 C CNN "Name"
	1    2750 5950
	1    0    0    -1  
$EndComp
Wire Wire Line
	2750 5950 2750 6050
Wire Wire Line
	2650 7200 2650 6800
Wire Wire Line
	3250 6800 3250 7200
Wire Wire Line
	2950 7200 2950 6800
Text Label 2650 7200 1    39   ~ 0
RED_POWER
Text Label 2950 7200 1    39   ~ 0
GREEN_POWER
Text Label 3250 7200 1    39   ~ 0
BLUE_POWER
$Comp
L Diode:E6C0606RGBC3UDA D3
U 1 1 5F199B4B
P 4300 6050
F 0 "D3" H 4872 5913 39  0000 L CNN
F 1 "E6C0606RGBC3UDA" H 4950 6100 39  0001 L CNN
F 2 "Diode:E6C0606RGBC3UDA" H 4950 5000 39  0001 L CIB
F 3 "${SHAPELINEKILIB}/Semiconductors/Diode/Datasheets/E6C0606RGBC3UDA.pdf" H 4300 6050 60  0001 C CNN
F 4 "LED" H 4950 6000 39  0001 L CNN "Type"
F 5 "Red-Green-Blue" H 4872 5838 39  0000 L CNN "Colour"
F 6 "620-520-465 nm " H 4950 5900 39  0001 L CNN "Wavelength"
F 7 "1.6-2.5-2.5 V" H 4950 5800 39  0001 L CNN "Forward voltage"
F 8 "40-150-30 mcd" H 4950 5700 39  0001 L CNN "Luminous intensity"
F 9 "120°" H 4950 5600 39  0001 L CNN "Angle"
F 10 "20 mA" H 4950 5500 39  0001 L CNN "Maximum current"
F 11 "EKINGLUX" H 4950 5300 39  0001 L CNN "Manufacturer"
F 12 "LCSC" H 4950 5200 39  0001 L CNN "Vendor"
F 13 "C375569" H 4950 5100 39  0001 L CNN "Vendor Part Number"
F 14 "-40°C to 90°C" H 4950 5400 39  0001 L CNN "Temperature"
	1    4300 6050
	1    0    0    -1  
$EndComp
Wire Wire Line
	4750 6400 4750 6450
Wire Wire Line
	4750 6450 4850 6450
Wire Wire Line
	4850 6450 4850 6500
Wire Wire Line
	4550 6400 4550 6500
Wire Wire Line
	4250 6500 4250 6450
Wire Wire Line
	4250 6450 4350 6450
Wire Wire Line
	4350 6450 4350 6400
$Comp
L PowerNets:5V-bar #PWR09
U 1 1 5F199B7D
P 4350 5950
F 0 "#PWR09" H 4675 6025 50  0001 C CNN
F 1 "5V-bar" H 4650 5950 39  0001 C CNN
F 2 "" H 4350 5950 50  0001 C CNN
F 3 "" H 4350 5950 50  0001 C CNN
F 4 "5V" H 4350 6067 39  0000 C CNN "Name"
	1    4350 5950
	1    0    0    -1  
$EndComp
Wire Wire Line
	4350 5950 4350 6050
Wire Wire Line
	4250 7200 4250 6800
Wire Wire Line
	4850 6800 4850 7200
Wire Wire Line
	4550 7200 4550 6800
Text Label 4250 7200 1    39   ~ 0
RED_POWER
Text Label 4550 7200 1    39   ~ 0
GREEN_POWER
Text Label 4850 7200 1    39   ~ 0
BLUE_POWER
$Comp
L Diode:E6C0606RGBC3UDA D4
U 1 1 5F199B95
P 5950 6100
F 0 "D4" H 6522 5963 39  0000 L CNN
F 1 "E6C0606RGBC3UDA" H 6600 6150 39  0001 L CNN
F 2 "Diode:E6C0606RGBC3UDA" H 6600 5050 39  0001 L CIB
F 3 "${SHAPELINEKILIB}/Semiconductors/Diode/Datasheets/E6C0606RGBC3UDA.pdf" H 5950 6100 60  0001 C CNN
F 4 "LED" H 6600 6050 39  0001 L CNN "Type"
F 5 "Red-Green-Blue" H 6522 5888 39  0000 L CNN "Colour"
F 6 "620-520-465 nm " H 6600 5950 39  0001 L CNN "Wavelength"
F 7 "1.6-2.5-2.5 V" H 6600 5850 39  0001 L CNN "Forward voltage"
F 8 "40-150-30 mcd" H 6600 5750 39  0001 L CNN "Luminous intensity"
F 9 "120°" H 6600 5650 39  0001 L CNN "Angle"
F 10 "20 mA" H 6600 5550 39  0001 L CNN "Maximum current"
F 11 "EKINGLUX" H 6600 5350 39  0001 L CNN "Manufacturer"
F 12 "LCSC" H 6600 5250 39  0001 L CNN "Vendor"
F 13 "C375569" H 6600 5150 39  0001 L CNN "Vendor Part Number"
F 14 "-40°C to 90°C" H 6600 5450 39  0001 L CNN "Temperature"
	1    5950 6100
	1    0    0    -1  
$EndComp
Wire Wire Line
	6400 6450 6400 6500
Wire Wire Line
	6400 6500 6500 6500
Wire Wire Line
	6500 6500 6500 6550
Wire Wire Line
	6200 6450 6200 6550
Wire Wire Line
	5900 6550 5900 6500
Wire Wire Line
	5900 6500 6000 6500
Wire Wire Line
	6000 6500 6000 6450
$Comp
L PowerNets:5V-bar #PWR011
U 1 1 5F199BC7
P 6000 6000
F 0 "#PWR011" H 6325 6075 50  0001 C CNN
F 1 "5V-bar" H 6300 6000 39  0001 C CNN
F 2 "" H 6000 6000 50  0001 C CNN
F 3 "" H 6000 6000 50  0001 C CNN
F 4 "5V" H 6000 6117 39  0000 C CNN "Name"
	1    6000 6000
	1    0    0    -1  
$EndComp
Wire Wire Line
	6000 6000 6000 6100
Wire Wire Line
	5900 7250 5900 6850
Wire Wire Line
	6500 6850 6500 7250
Wire Wire Line
	6200 7250 6200 6850
Text Label 5900 7250 1    39   ~ 0
RED_POWER
Text Label 6200 7250 1    39   ~ 0
GREEN_POWER
Text Label 6500 7250 1    39   ~ 0
BLUE_POWER
$Comp
L Connector:Pin_header_4x1_2.54mm_Horizontal P1
U 1 1 5F19B8EF
P 1100 2650
F 0 "P1" H 1378 2438 39  0000 L CNN
F 1 "Pin_header_4x1_2.54mm_Horizontal" H 1800 2800 39  0001 L CNN
F 2 "Connector:Pin_header_4x1_2.54mm_Horizontal" H 1800 2200 39  0001 L CIB
F 3 "" H 1150 2600 60  0001 C CNN
F 4 "Pin header" H 1378 2363 39  0000 L CNN "Name"
F 5 "Farnell" H 1800 2400 39  0001 L CNN "Vendor"
F 6 "2356178" H 1800 2300 39  0001 L CNN "Vendor Part Number"
F 7 "4" H 1800 2700 39  0001 L CNN "Positions"
F 8 "2.54mm" H 1800 2600 39  0001 L CNN "Pitch"
F 9 "Through hole" H 1800 2500 39  0001 L CNN "Termination"
	1    1100 2650
	1    0    0    -1  
$EndComp
$Comp
L PowerNets:5V-arrow #PWR01
U 1 1 5F19D9F1
P 1050 2700
F 0 "#PWR01" H 1375 2775 50  0001 C CNN
F 1 "5V-arrow" H 1350 2700 39  0001 C CNN
F 2 "" H 1050 2700 50  0001 C CNN
F 3 "" H 1050 2700 50  0001 C CNN
F 4 "5V" H 1059 2865 39  0000 C CNN "Name"
	1    1050 2700
	1    0    0    -1  
$EndComp
Wire Wire Line
	1100 2750 1050 2750
Wire Wire Line
	1050 2750 1050 2700
$Comp
L PowerNets:GND-bar #PWR02
U 1 1 5F19F0D8
P 1050 3100
F 0 "#PWR02" H 1050 2850 39  0001 C CNN
F 1 "GND-bar" H 1350 3075 39  0001 C CNN
F 2 "" H 1050 3100 50  0001 C CNN
F 3 "" H 1050 2850 50  0001 C CNN
F 4 "GND" H 1050 2950 39  0000 C CNN "Name"
	1    1050 3100
	1    0    0    -1  
$EndComp
Wire Wire Line
	1050 3100 1050 3050
Wire Wire Line
	1050 3050 1100 3050
$Comp
L PowerNets:GND-bar #PWR012
U 1 1 5F1A07C3
P 6000 1400
F 0 "#PWR012" H 6000 1150 39  0001 C CNN
F 1 "GND-bar" H 6300 1375 39  0001 C CNN
F 2 "" H 6000 1400 50  0001 C CNN
F 3 "" H 6000 1150 50  0001 C CNN
F 4 "GND" H 6000 1250 39  0000 C CNN "Name"
	1    6000 1400
	1    0    0    -1  
$EndComp
Wire Wire Line
	5950 1350 6000 1350
Wire Wire Line
	6000 1350 6000 1400
Text Label 650  2950 0    39   ~ 0
UART_DATA_IN
Text Label 650  2850 0    39   ~ 0
UART_RETURN
Wire Wire Line
	650  2850 1100 2850
Wire Wire Line
	1100 2950 650  2950
$Comp
L Transistor:DMG1012UW Q1
U 1 1 5F1A796C
P 7800 6300
F 0 "Q1" H 8103 6138 39  0000 L CNN
F 1 "DMG1012UW" H 8600 6350 39  0001 L CNN
F 2 "Transistor:SOT323" H 8600 5550 39  0001 L CIB
F 3 "${SHAPELINEKILIB}/Semiconductors/Transistor/Datasheets/DMG1012UW.pdf" H 7250 6250 60  0001 C CNN
F 4 "DMG1012UW" H 8103 6063 39  0000 L CNN "Name"
F 5 "1V" H 8600 6050 39  0001 L CNN "VGS (Threshold)"
F 6 "20V" H 8600 6150 39  0001 L CNN "Voltage"
F 7 "1A" H 8600 6250 39  0001 L CNN "Current"
F 8 "6A" H 8800 6250 39  0001 L CNN "Peak current"
F 9 "300mOhm" H 8600 5950 39  0001 L CNN "On resistance"
F 10 "-55°C to 150°C" H 8600 5850 39  0001 L CNN "Temperature"
F 11 "Farnell" H 8600 5750 39  0001 L CNN "Vendor"
F 12 "2061403" H 8600 5650 39  0001 L CNN "Vendor Part Number"
	1    7800 6300
	1    0    0    -1  
$EndComp
$Comp
L PowerNets:GND-bar #PWR013
U 1 1 5F1A8BFF
P 8000 6750
F 0 "#PWR013" H 8000 6500 39  0001 C CNN
F 1 "GND-bar" H 8300 6725 39  0001 C CNN
F 2 "" H 8000 6750 50  0001 C CNN
F 3 "" H 8000 6500 50  0001 C CNN
F 4 "GND" H 8000 6600 39  0000 C CNN "Name"
	1    8000 6750
	1    0    0    -1  
$EndComp
Wire Wire Line
	8000 6750 8000 6700
Wire Wire Line
	8000 5800 8000 6300
Text Label 8000 5800 3    39   ~ 0
RED_POWER
$Comp
L Transistor:DMG1012UW Q2
U 1 1 5F1ADB60
P 9150 6300
F 0 "Q2" H 9453 6138 39  0000 L CNN
F 1 "DMG1012UW" H 9950 6350 39  0001 L CNN
F 2 "Transistor:SOT323" H 9950 5550 39  0001 L CIB
F 3 "${SHAPELINEKILIB}/Semiconductors/Transistor/Datasheets/DMG1012UW.pdf" H 8600 6250 60  0001 C CNN
F 4 "DMG1012UW" H 9453 6063 39  0000 L CNN "Name"
F 5 "1V" H 9950 6050 39  0001 L CNN "VGS (Threshold)"
F 6 "20V" H 9950 6150 39  0001 L CNN "Voltage"
F 7 "1A" H 9950 6250 39  0001 L CNN "Current"
F 8 "6A" H 10150 6250 39  0001 L CNN "Peak current"
F 9 "300mOhm" H 9950 5950 39  0001 L CNN "On resistance"
F 10 "-55°C to 150°C" H 9950 5850 39  0001 L CNN "Temperature"
F 11 "Farnell" H 9950 5750 39  0001 L CNN "Vendor"
F 12 "2061403" H 9950 5650 39  0001 L CNN "Vendor Part Number"
	1    9150 6300
	1    0    0    -1  
$EndComp
$Comp
L PowerNets:GND-bar #PWR014
U 1 1 5F1ADB67
P 9350 6750
F 0 "#PWR014" H 9350 6500 39  0001 C CNN
F 1 "GND-bar" H 9650 6725 39  0001 C CNN
F 2 "" H 9350 6750 50  0001 C CNN
F 3 "" H 9350 6500 50  0001 C CNN
F 4 "GND" H 9350 6600 39  0000 C CNN "Name"
	1    9350 6750
	1    0    0    -1  
$EndComp
Wire Wire Line
	9350 6750 9350 6700
Wire Wire Line
	9350 5800 9350 6300
$Comp
L Transistor:DMG1012UW Q3
U 1 1 5F1AFFA7
P 10500 6300
F 0 "Q3" H 10803 6138 39  0000 L CNN
F 1 "DMG1012UW" H 11300 6350 39  0001 L CNN
F 2 "Transistor:SOT323" H 11300 5550 39  0001 L CIB
F 3 "${SHAPELINEKILIB}/Semiconductors/Transistor/Datasheets/DMG1012UW.pdf" H 9950 6250 60  0001 C CNN
F 4 "DMG1012UW" H 10803 6063 39  0000 L CNN "Name"
F 5 "1V" H 11300 6050 39  0001 L CNN "VGS (Threshold)"
F 6 "20V" H 11300 6150 39  0001 L CNN "Voltage"
F 7 "1A" H 11300 6250 39  0001 L CNN "Current"
F 8 "6A" H 11500 6250 39  0001 L CNN "Peak current"
F 9 "300mOhm" H 11300 5950 39  0001 L CNN "On resistance"
F 10 "-55°C to 150°C" H 11300 5850 39  0001 L CNN "Temperature"
F 11 "Farnell" H 11300 5750 39  0001 L CNN "Vendor"
F 12 "2061403" H 11300 5650 39  0001 L CNN "Vendor Part Number"
	1    10500 6300
	1    0    0    -1  
$EndComp
$Comp
L PowerNets:GND-bar #PWR017
U 1 1 5F1AFFAE
P 10700 6750
F 0 "#PWR017" H 10700 6500 39  0001 C CNN
F 1 "GND-bar" H 11000 6725 39  0001 C CNN
F 2 "" H 10700 6750 50  0001 C CNN
F 3 "" H 10700 6500 50  0001 C CNN
F 4 "GND" H 10700 6600 39  0000 C CNN "Name"
	1    10700 6750
	1    0    0    -1  
$EndComp
Wire Wire Line
	10700 6750 10700 6700
Wire Wire Line
	10700 5800 10700 6300
Text Label 9350 5800 3    39   ~ 0
GREEN_POWER
Text Label 10700 5800 3    39   ~ 0
BLUE_POWER
Text Label 7400 5900 3    39   ~ 0
RED_CONTROL
Text Label 8750 5900 3    39   ~ 0
GREEN_CONTROL
Text Label 10100 5900 3    39   ~ 0
BLUE_CONTROL
$Comp
L Connector:Pin_header_female_4x1_2.54mm_Horizontal P3
U 1 1 5F18E84D
P 10400 3050
F 0 "P3" H 10517 3191 39  0000 C CNN
F 1 "Pin_header_female_4x1_2.54mm_Horizontal" H 11100 3200 39  0001 L CNN
F 2 "Connector:Pin_header_female_4x1_2.54mm_Horizontal" H 11100 2600 39  0001 L CIB
F 3 "" H 10450 3000 60  0001 C CNN
F 4 "Pin header female" H 10700 3100 39  0000 C CNN "Name"
F 5 "Farnell" H 11100 2800 39  0001 L CNN "Vendor"
F 6 "2084274" H 11100 2700 39  0001 L CNN "Vendor Part Number"
F 7 "4" H 11100 3100 39  0001 L CNN "Positions"
F 8 "2.54mm" H 11100 3000 39  0001 L CNN "Pitch"
F 9 "Through hole" H 11100 2900 39  0001 L CNN "Termination"
	1    10400 3050
	-1   0    0    -1  
$EndComp
Wire Wire Line
	10400 3150 10450 3150
Wire Wire Line
	10450 3150 10450 3100
$Comp
L PowerNets:GND-bar #PWR016
U 1 1 5F191C70
P 10450 3500
F 0 "#PWR016" H 10450 3250 39  0001 C CNN
F 1 "GND-bar" H 10750 3475 39  0001 C CNN
F 2 "" H 10450 3500 50  0001 C CNN
F 3 "" H 10450 3250 50  0001 C CNN
F 4 "GND" H 10450 3350 39  0000 C CNN "Name"
	1    10450 3500
	-1   0    0    -1  
$EndComp
Wire Wire Line
	10450 3500 10450 3450
Wire Wire Line
	10450 3450 10400 3450
Text Label 10850 3350 2    39   ~ 0
UART_DATA_OUT
Text Label 10850 3250 2    39   ~ 0
UART_RETURN
Wire Wire Line
	10850 3250 10400 3250
Wire Wire Line
	10400 3350 10850 3350
$Comp
L PowerNets:5V-bar #PWR015
U 1 1 5F193423
P 10450 3100
F 0 "#PWR015" H 10775 3175 50  0001 C CNN
F 1 "5V-bar" H 10750 3100 39  0001 C CNN
F 2 "" H 10450 3100 50  0001 C CNN
F 3 "" H 10450 3100 50  0001 C CNN
F 4 "5V" H 10450 3217 39  0000 C CNN "Name"
	1    10450 3100
	1    0    0    -1  
$EndComp
$Comp
L Passive_component:Capacitor_ceramic_1uF_16V_20%_X5R_SMD0603 C1
U 1 1 5F19435B
P 3750 1000
F 0 "C1" H 3885 950 39  0000 L CNN
F 1 "Capacitor_ceramic_1uF_16V_20%_X5R_SMD0603" H 4125 1175 39  0001 L CNN
F 2 "Passive_component:Cap_0603[1608M]" H 4125 725 39  0001 L CIB
F 3 "" H 3925 1100 50  0001 C CNN
F 4 "1uF" H 3885 875 39  0000 L CNN "Capacitance"
F 5 "20%" H 4125 1025 39  0001 L CNN "Tolerance"
F 6 "16V" H 3885 800 39  0000 L CNN "Voltage"
F 7 "-55°C to 85°C" H 4125 950 39  0001 L CNN "Temperature"
F 8 "Farnell" H 4125 875 39  0001 L CNN "Vendor"
F 9 "2533943" H 4125 800 39  0001 L CNN "Vendor Part Number"
F 10 "X5R" H 4125 1100 39  0001 L CNN "Dielectric"
	1    3750 1000
	1    0    0    -1  
$EndComp
$Comp
L Passive_component:Capacitor_ceramic_100nF_6.3V_10%_X7R_SMD0603 C2
U 1 1 5F195138
P 4050 1000
F 0 "C2" H 4185 950 39  0000 L CNN
F 1 "Capacitor_ceramic_100nF_6.3V_10%_X7R_SMD0603" H 4375 1100 39  0001 L CNN
F 2 "Passive_component:Cap_0603[1608M]" H 4375 650 39  0001 L CIB
F 3 "" H 4125 950 50  0001 C CNN
F 4 "100nF" H 4185 875 39  0000 L CNN "Capacitance"
F 5 "10%" H 4375 950 39  0001 L CNN "Tolerance"
F 6 "6.3V" H 4185 800 39  0000 L CNN "Voltage"
F 7 "-55°C to 125°C" H 4375 875 39  0001 L CNN "Temperature"
F 8 "Farnell" H 4375 800 39  0001 L CNN "Vendor"
F 9 "2611927" H 4375 725 39  0001 L CNN "Vendor Part Number"
F 10 "X7R" H 4375 1025 39  0001 L CNN "Dielectric"
	1    4050 1000
	1    0    0    -1  
$EndComp
$Comp
L PowerNets:GND-bar #PWR08
U 1 1 5F19FD1C
P 3950 1400
F 0 "#PWR08" H 3950 1150 39  0001 C CNN
F 1 "GND-bar" H 4250 1375 39  0001 C CNN
F 2 "" H 3950 1400 50  0001 C CNN
F 3 "" H 3950 1150 50  0001 C CNN
F 4 "GND" H 3950 1250 39  0000 C CNN "Name"
	1    3950 1400
	1    0    0    -1  
$EndComp
Wire Wire Line
	3800 1000 3800 950 
Wire Wire Line
	3800 950  4100 950 
Wire Wire Line
	4100 950  4100 1000
Connection ~ 4100 950 
Wire Wire Line
	4100 950  4600 950 
Wire Wire Line
	4100 1250 4100 1300
Wire Wire Line
	4100 1300 3950 1300
Wire Wire Line
	3800 1300 3800 1250
Wire Wire Line
	3950 1300 3950 1400
Connection ~ 3950 1300
Wire Wire Line
	3950 1300 3800 1300
$Comp
L PowerNets:5V-bar #PWR07
U 1 1 5F1A718A
P 3800 850
F 0 "#PWR07" H 4125 925 50  0001 C CNN
F 1 "5V-bar" H 4100 850 39  0001 C CNN
F 2 "" H 3800 850 50  0001 C CNN
F 3 "" H 3800 850 50  0001 C CNN
F 4 "5V" H 3800 967 39  0000 C CNN "Name"
	1    3800 850 
	1    0    0    -1  
$EndComp
Wire Wire Line
	3800 950  3800 850 
Connection ~ 3800 950 
$Comp
L Passive_component:Resistor_10K_1%_100mW_50V_SMD0603 R11
U 1 1 5F1AA956
P 4800 1150
F 0 "R11" V 4634 1150 39  0000 C CNN
F 1 "Resistor_10K_1%_100mW_50V_SMD0603" H 4950 1175 39  0001 L CNN
F 2 "Passive_component:Res_0603" H 4950 725 39  0001 L CIB
F 3 "" V 4880 1150 50  0001 C CNN
F 4 "10K" V 4709 1150 39  0000 C CNN "Resistance"
F 5 "1%" H 4950 1100 39  0001 L CNN "Tolerance"
F 6 "100mW" H 4950 1025 39  0001 L CNN "Power"
F 7 "Farnell" H 4950 875 39  0001 L CNN "Vendor"
F 8 "2447230" H 4950 800 39  0001 L CNN "Vendor Part Number"
F 9 "-55°C to 155°C" H 4950 950 39  0001 L CNN "Temperature"
	1    4800 1150
	0    1    1    0   
$EndComp
Wire Wire Line
	5300 1150 5050 1150
Wire Wire Line
	4650 1150 4600 1150
Wire Wire Line
	4600 1150 4600 950 
Connection ~ 4600 950 
Wire Wire Line
	4600 950  5300 950 
$Comp
L Passive_component:Capacitor_ceramic_1uF_16V_20%_X5R_SMD0603 C3
U 1 1 5F1AEED0
P 5150 1450
F 0 "C3" H 5285 1400 39  0000 L CNN
F 1 "Capacitor_ceramic_1uF_16V_20%_X5R_SMD0603" H 5525 1625 39  0001 L CNN
F 2 "Passive_component:Cap_0603[1608M]" H 5525 1175 39  0001 L CIB
F 3 "" H 5325 1550 50  0001 C CNN
F 4 "1uF" H 5285 1325 39  0000 L CNN "Capacitance"
F 5 "20%" H 5525 1475 39  0001 L CNN "Tolerance"
F 6 "16V" H 5285 1250 39  0000 L CNN "Voltage"
F 7 "-55°C to 85°C" H 5525 1400 39  0001 L CNN "Temperature"
F 8 "Farnell" H 5525 1325 39  0001 L CNN "Vendor"
F 9 "2533943" H 5525 1250 39  0001 L CNN "Vendor Part Number"
F 10 "X5R" H 5525 1550 39  0001 L CNN "Dielectric"
	1    5150 1450
	1    0    0    -1  
$EndComp
$Comp
L PowerNets:GND-bar #PWR010
U 1 1 5F1AF7A7
P 5200 2050
F 0 "#PWR010" H 5200 1800 39  0001 C CNN
F 1 "GND-bar" H 5500 2025 39  0001 C CNN
F 2 "" H 5200 2050 50  0001 C CNN
F 3 "" H 5200 1800 50  0001 C CNN
F 4 "GND" H 5200 1900 39  0000 C CNN "Name"
	1    5200 2050
	1    0    0    -1  
$EndComp
Wire Wire Line
	5200 1700 5200 2000
Wire Wire Line
	5200 1450 5200 1350
Wire Wire Line
	5200 1350 5300 1350
Text Label 4150 1650 0    39   ~ 0
MCU_RESET
Connection ~ 5050 1150
Wire Wire Line
	5050 1150 4950 1150
Wire Wire Line
	4500 1650 4150 1650
$Comp
L LayerBased:Test_point_1mm TP1
U 1 1 5F1BFECE
P 4800 1400
F 0 "TP1" H 4928 1292 39  0000 L CNN
F 1 "Test_point_1mm" H 5000 1450 39  0001 L CNN
F 2 "LayerBased:Test_point_1mm" H 5000 1350 39  0001 L CIB
F 3 "" H 4800 1400 60  0001 C CNN
	1    4800 1400
	1    0    0    -1  
$EndComp
Wire Wire Line
	5050 1650 4850 1650
Wire Wire Line
	5050 1150 5050 1650
$Comp
L LayerBased:Test_point_1mm TP2
U 1 1 5F1C70B1
P 4800 1700
F 0 "TP2" H 4928 1592 39  0000 L CNN
F 1 "Test_point_1mm" H 5000 1750 39  0001 L CNN
F 2 "LayerBased:Test_point_1mm" H 5000 1650 39  0001 L CIB
F 3 "" H 4800 1700 60  0001 C CNN
	1    4800 1700
	1    0    0    -1  
$EndComp
Wire Wire Line
	5200 2000 4850 2000
Wire Wire Line
	4850 2000 4850 1900
Connection ~ 5200 2000
Wire Wire Line
	5200 2000 5200 2050
Wire Wire Line
	4850 1650 4850 1600
Connection ~ 4850 1650
Wire Wire Line
	4850 1650 4800 1650
Text Label 8700 5150 2    39   ~ 0
UART_DATA_IN
Text Label 8700 5050 2    39   ~ 0
UART_DATA_OUT
Wire Wire Line
	8150 5050 8700 5050
Wire Wire Line
	8700 5150 8150 5150
$Comp
L Connector:Pin_header_4x1_2.54mm_Horizontal P2
U 1 1 5F1D9DF7
P 2400 900
F 0 "P2" H 2678 688 39  0000 L CNN
F 1 "Pin_header_4x1_2.54mm_Horizontal" H 3100 1050 39  0001 L CNN
F 2 "Connector:Pin_header_4x1_2.54mm_Horizontal" H 3100 450 39  0001 L CIB
F 3 "" H 2450 850 60  0001 C CNN
F 4 "Pin header" H 2678 613 39  0000 L CNN "Name"
F 5 "Farnell" H 3100 650 39  0001 L CNN "Vendor"
F 6 "2356178" H 3100 550 39  0001 L CNN "Vendor Part Number"
F 7 "4" H 3100 950 39  0001 L CNN "Positions"
F 8 "2.54mm" H 3100 850 39  0001 L CNN "Pitch"
F 9 "Through hole" H 3100 750 39  0001 L CNN "Termination"
	1    2400 900 
	1    0    0    -1  
$EndComp
Wire Wire Line
	2400 1000 2350 1000
Wire Wire Line
	2350 1000 2350 950 
Text Label 1950 1100 0    39   ~ 0
MCU_PGM
Wire Wire Line
	1950 1100 2400 1100
Wire Wire Line
	2400 1200 1950 1200
$Comp
L PowerNets:5V-bar #PWR05
U 1 1 5F1DCDA8
P 2350 950
F 0 "#PWR05" H 2675 1025 50  0001 C CNN
F 1 "5V-bar" H 2650 950 39  0001 C CNN
F 2 "" H 2350 950 50  0001 C CNN
F 3 "" H 2350 950 50  0001 C CNN
F 4 "5V" H 2350 1067 39  0000 C CNN "Name"
	1    2350 950 
	1    0    0    -1  
$EndComp
$Comp
L PowerNets:GND-bar #PWR04
U 1 1 5F1DCEEF
P 1950 1200
F 0 "#PWR04" H 1950 950 39  0001 C CNN
F 1 "GND-bar" H 2250 1175 39  0001 C CNN
F 2 "" H 1950 1200 50  0001 C CNN
F 3 "" H 1950 950 50  0001 C CNN
F 4 "GND" H 1950 1050 39  0000 C CNN "Name"
	1    1950 1200
	0    1    1    0   
$EndComp
Wire Wire Line
	1950 1300 2400 1300
Text Label 1950 1300 0    39   ~ 0
MCU_RESET
Text Label 8700 4650 2    39   ~ 0
MCU_PGM
Wire Wire Line
	8150 4650 8700 4650
$Comp
L Switch:EC12E1240405 SW1
U 1 1 5F1DF986
P 9450 1200
F 0 "SW1" H 9778 1080 39  0000 L CNN
F 1 "EC12E1240405" H 9850 1350 39  0001 L CNN
F 2 "Switch:EC12E1240405" H 9850 950 39  0001 L CIB
F 3 "${SHAPELINEKILIB}/Mechanical/Switch/Datasheets/EC12E1240405.pdf" H 9500 1100 60  0001 C CNN
F 4 "EC12E1240405" H 9778 1005 39  0000 L CNN "Name"
F 5 "5V" H 9850 1250 39  0001 L CNN "Max voltage"
F 6 "Farnell" H 9850 1150 39  0001 L CNN "Vendor"
F 7 "2065051" H 9850 1050 39  0001 L CNN "Vendor Part Number"
	1    9450 1200
	1    0    0    -1  
$EndComp
$Comp
L PowerNets:GND-bar #PWR019
U 1 1 5F1E2A08
P 9600 1650
F 0 "#PWR019" H 9600 1400 39  0001 C CNN
F 1 "GND-bar" H 9900 1625 39  0001 C CNN
F 2 "" H 9600 1650 50  0001 C CNN
F 3 "" H 9600 1400 50  0001 C CNN
F 4 "GND" H 9600 1500 39  0000 C CNN "Name"
	1    9600 1650
	1    0    0    -1  
$EndComp
$Comp
L Passive_component:Resistor_10K_1%_100mW_50V_SMD0603 R15
U 1 1 5F1E2FF4
P 8850 1300
F 0 "R15" V 8684 1300 39  0000 C CNN
F 1 "Resistor_10K_1%_100mW_50V_SMD0603" H 9000 1325 39  0001 L CNN
F 2 "Passive_component:Res_0603" H 9000 875 39  0001 L CIB
F 3 "" V 8930 1300 50  0001 C CNN
F 4 "10K" V 8759 1300 39  0000 C CNN "Resistance"
F 5 "1%" H 9000 1250 39  0001 L CNN "Tolerance"
F 6 "100mW" H 9000 1175 39  0001 L CNN "Power"
F 7 "Farnell" H 9000 1025 39  0001 L CNN "Vendor"
F 8 "2447230" H 9000 950 39  0001 L CNN "Vendor Part Number"
F 9 "-55°C to 155°C" H 9000 1100 39  0001 L CNN "Temperature"
	1    8850 1300
	-1   0    0    1   
$EndComp
$Comp
L Passive_component:Resistor_10K_1%_100mW_50V_SMD0603 R16
U 1 1 5F1E4103
P 10350 1300
F 0 "R16" V 10184 1300 39  0000 C CNN
F 1 "Resistor_10K_1%_100mW_50V_SMD0603" H 10500 1325 39  0001 L CNN
F 2 "Passive_component:Res_0603" H 10500 875 39  0001 L CIB
F 3 "" V 10430 1300 50  0001 C CNN
F 4 "10K" V 10259 1300 39  0000 C CNN "Resistance"
F 5 "1%" H 10500 1250 39  0001 L CNN "Tolerance"
F 6 "100mW" H 10500 1175 39  0001 L CNN "Power"
F 7 "Farnell" H 10500 1025 39  0001 L CNN "Vendor"
F 8 "2447230" H 10500 950 39  0001 L CNN "Vendor Part Number"
F 9 "-55°C to 155°C" H 10500 1100 39  0001 L CNN "Temperature"
	1    10350 1300
	-1   0    0    1   
$EndComp
$Comp
L PowerNets:5V-bar #PWR018
U 1 1 5F1E4676
P 9600 950
F 0 "#PWR018" H 9925 1025 50  0001 C CNN
F 1 "5V-bar" H 9900 950 39  0001 C CNN
F 2 "" H 9600 950 50  0001 C CNN
F 3 "" H 9600 950 50  0001 C CNN
F 4 "5V" H 9600 1067 39  0000 C CNN "Name"
	1    9600 950 
	1    0    0    -1  
$EndComp
Wire Wire Line
	9600 950  9600 1000
Wire Wire Line
	9600 1000 8850 1000
Wire Wire Line
	8850 1000 8850 1150
Wire Wire Line
	8850 1450 8850 1600
Wire Wire Line
	8850 1600 9500 1600
Wire Wire Line
	9500 1600 9500 1500
Wire Wire Line
	9600 1500 9600 1650
Wire Wire Line
	9700 1500 9700 1600
Wire Wire Line
	9700 1600 10350 1600
Wire Wire Line
	10350 1600 10350 1450
Wire Wire Line
	10350 1150 10350 1000
Wire Wire Line
	10350 1000 9600 1000
Connection ~ 9600 1000
Text Label 8850 1600 0    39   ~ 0
ROTARY_A
Text Label 10350 1600 2    39   ~ 0
ROTARY_B
$Comp
L Passive_component:Resistor_150_1%_100mW_75V_SMD0603 R1
U 1 1 5F1FD6D7
P 1000 6600
F 0 "R1" H 1053 6638 39  0000 L CNN
F 1 "Resistor_150_1%_100mW_75V_SMD0603" H 1150 6625 39  0001 L CNN
F 2 "Passive_component:Res_0603" H 1150 6175 39  0001 L CIB
F 3 "" V 1080 6600 50  0001 C CNN
F 4 "150" H 1053 6563 39  0000 L CNN "Resistance"
F 5 "1%" H 1150 6550 39  0001 L CNN "Tolerance"
F 6 "100mW" H 1150 6475 39  0001 L CNN "Power"
F 7 "Farnell" H 1150 6325 39  0001 L CNN "Vendor"
F 8 "2447255" H 1150 6250 39  0001 L CNN "Vendor Part Number"
F 9 "-55°C to 155°C" H 1150 6400 39  0001 L CNN "Temperature"
F 10 "R" H 500 6675 39  0001 L CNN "Spice_Primitive"
F 11 "1 2 1k" H 500 6600 39  0001 L CNN "Spice_Model"
F 12 "Y" H 500 6525 39  0001 L CNN "Spice_Netlist_Enabled"
	1    1000 6600
	1    0    0    -1  
$EndComp
$Comp
L Passive_component:Resistor_150_1%_100mW_75V_SMD0603 R2
U 1 1 5F1FDFE8
P 1300 6600
F 0 "R2" H 1353 6638 39  0000 L CNN
F 1 "Resistor_150_1%_100mW_75V_SMD0603" H 1450 6625 39  0001 L CNN
F 2 "Passive_component:Res_0603" H 1450 6175 39  0001 L CIB
F 3 "" V 1380 6600 50  0001 C CNN
F 4 "150" H 1353 6563 39  0000 L CNN "Resistance"
F 5 "1%" H 1450 6550 39  0001 L CNN "Tolerance"
F 6 "100mW" H 1450 6475 39  0001 L CNN "Power"
F 7 "Farnell" H 1450 6325 39  0001 L CNN "Vendor"
F 8 "2447255" H 1450 6250 39  0001 L CNN "Vendor Part Number"
F 9 "-55°C to 155°C" H 1450 6400 39  0001 L CNN "Temperature"
F 10 "R" H 800 6675 39  0001 L CNN "Spice_Primitive"
F 11 "1 2 1k" H 800 6600 39  0001 L CNN "Spice_Model"
F 12 "Y" H 800 6525 39  0001 L CNN "Spice_Netlist_Enabled"
	1    1300 6600
	1    0    0    -1  
$EndComp
$Comp
L Passive_component:Resistor_150_1%_100mW_75V_SMD0603 R3
U 1 1 5F1FE645
P 1600 6600
F 0 "R3" H 1653 6638 39  0000 L CNN
F 1 "Resistor_150_1%_100mW_75V_SMD0603" H 1750 6625 39  0001 L CNN
F 2 "Passive_component:Res_0603" H 1750 6175 39  0001 L CIB
F 3 "" V 1680 6600 50  0001 C CNN
F 4 "150" H 1653 6563 39  0000 L CNN "Resistance"
F 5 "1%" H 1750 6550 39  0001 L CNN "Tolerance"
F 6 "100mW" H 1750 6475 39  0001 L CNN "Power"
F 7 "Farnell" H 1750 6325 39  0001 L CNN "Vendor"
F 8 "2447255" H 1750 6250 39  0001 L CNN "Vendor Part Number"
F 9 "-55°C to 155°C" H 1750 6400 39  0001 L CNN "Temperature"
F 10 "R" H 1100 6675 39  0001 L CNN "Spice_Primitive"
F 11 "1 2 1k" H 1100 6600 39  0001 L CNN "Spice_Model"
F 12 "Y" H 1100 6525 39  0001 L CNN "Spice_Netlist_Enabled"
	1    1600 6600
	1    0    0    -1  
$EndComp
$Comp
L Passive_component:Resistor_150_1%_100mW_75V_SMD0603 R4
U 1 1 5F20032D
P 2650 6650
F 0 "R4" H 2703 6688 39  0000 L CNN
F 1 "Resistor_150_1%_100mW_75V_SMD0603" H 2800 6675 39  0001 L CNN
F 2 "Passive_component:Res_0603" H 2800 6225 39  0001 L CIB
F 3 "" V 2730 6650 50  0001 C CNN
F 4 "150" H 2703 6613 39  0000 L CNN "Resistance"
F 5 "1%" H 2800 6600 39  0001 L CNN "Tolerance"
F 6 "100mW" H 2800 6525 39  0001 L CNN "Power"
F 7 "Farnell" H 2800 6375 39  0001 L CNN "Vendor"
F 8 "2447255" H 2800 6300 39  0001 L CNN "Vendor Part Number"
F 9 "-55°C to 155°C" H 2800 6450 39  0001 L CNN "Temperature"
F 10 "R" H 2150 6725 39  0001 L CNN "Spice_Primitive"
F 11 "1 2 1k" H 2150 6650 39  0001 L CNN "Spice_Model"
F 12 "Y" H 2150 6575 39  0001 L CNN "Spice_Netlist_Enabled"
	1    2650 6650
	1    0    0    -1  
$EndComp
$Comp
L Passive_component:Resistor_150_1%_100mW_75V_SMD0603 R5
U 1 1 5F20033C
P 2950 6650
F 0 "R5" H 3003 6688 39  0000 L CNN
F 1 "Resistor_150_1%_100mW_75V_SMD0603" H 3100 6675 39  0001 L CNN
F 2 "Passive_component:Res_0603" H 3100 6225 39  0001 L CIB
F 3 "" V 3030 6650 50  0001 C CNN
F 4 "150" H 3003 6613 39  0000 L CNN "Resistance"
F 5 "1%" H 3100 6600 39  0001 L CNN "Tolerance"
F 6 "100mW" H 3100 6525 39  0001 L CNN "Power"
F 7 "Farnell" H 3100 6375 39  0001 L CNN "Vendor"
F 8 "2447255" H 3100 6300 39  0001 L CNN "Vendor Part Number"
F 9 "-55°C to 155°C" H 3100 6450 39  0001 L CNN "Temperature"
F 10 "R" H 2450 6725 39  0001 L CNN "Spice_Primitive"
F 11 "1 2 1k" H 2450 6650 39  0001 L CNN "Spice_Model"
F 12 "Y" H 2450 6575 39  0001 L CNN "Spice_Netlist_Enabled"
	1    2950 6650
	1    0    0    -1  
$EndComp
$Comp
L Passive_component:Resistor_150_1%_100mW_75V_SMD0603 R6
U 1 1 5F20034B
P 3250 6650
F 0 "R6" H 3303 6688 39  0000 L CNN
F 1 "Resistor_150_1%_100mW_75V_SMD0603" H 3400 6675 39  0001 L CNN
F 2 "Passive_component:Res_0603" H 3400 6225 39  0001 L CIB
F 3 "" V 3330 6650 50  0001 C CNN
F 4 "150" H 3303 6613 39  0000 L CNN "Resistance"
F 5 "1%" H 3400 6600 39  0001 L CNN "Tolerance"
F 6 "100mW" H 3400 6525 39  0001 L CNN "Power"
F 7 "Farnell" H 3400 6375 39  0001 L CNN "Vendor"
F 8 "2447255" H 3400 6300 39  0001 L CNN "Vendor Part Number"
F 9 "-55°C to 155°C" H 3400 6450 39  0001 L CNN "Temperature"
F 10 "R" H 2750 6725 39  0001 L CNN "Spice_Primitive"
F 11 "1 2 1k" H 2750 6650 39  0001 L CNN "Spice_Model"
F 12 "Y" H 2750 6575 39  0001 L CNN "Spice_Netlist_Enabled"
	1    3250 6650
	1    0    0    -1  
$EndComp
$Comp
L Passive_component:Resistor_150_1%_100mW_75V_SMD0603 R7
U 1 1 5F204CFE
P 4250 6650
F 0 "R7" H 4303 6688 39  0000 L CNN
F 1 "Resistor_150_1%_100mW_75V_SMD0603" H 4400 6675 39  0001 L CNN
F 2 "Passive_component:Res_0603" H 4400 6225 39  0001 L CIB
F 3 "" V 4330 6650 50  0001 C CNN
F 4 "150" H 4303 6613 39  0000 L CNN "Resistance"
F 5 "1%" H 4400 6600 39  0001 L CNN "Tolerance"
F 6 "100mW" H 4400 6525 39  0001 L CNN "Power"
F 7 "Farnell" H 4400 6375 39  0001 L CNN "Vendor"
F 8 "2447255" H 4400 6300 39  0001 L CNN "Vendor Part Number"
F 9 "-55°C to 155°C" H 4400 6450 39  0001 L CNN "Temperature"
F 10 "R" H 3750 6725 39  0001 L CNN "Spice_Primitive"
F 11 "1 2 1k" H 3750 6650 39  0001 L CNN "Spice_Model"
F 12 "Y" H 3750 6575 39  0001 L CNN "Spice_Netlist_Enabled"
	1    4250 6650
	1    0    0    -1  
$EndComp
$Comp
L Passive_component:Resistor_150_1%_100mW_75V_SMD0603 R8
U 1 1 5F204D0D
P 4550 6650
F 0 "R8" H 4603 6688 39  0000 L CNN
F 1 "Resistor_150_1%_100mW_75V_SMD0603" H 4700 6675 39  0001 L CNN
F 2 "Passive_component:Res_0603" H 4700 6225 39  0001 L CIB
F 3 "" V 4630 6650 50  0001 C CNN
F 4 "150" H 4603 6613 39  0000 L CNN "Resistance"
F 5 "1%" H 4700 6600 39  0001 L CNN "Tolerance"
F 6 "100mW" H 4700 6525 39  0001 L CNN "Power"
F 7 "Farnell" H 4700 6375 39  0001 L CNN "Vendor"
F 8 "2447255" H 4700 6300 39  0001 L CNN "Vendor Part Number"
F 9 "-55°C to 155°C" H 4700 6450 39  0001 L CNN "Temperature"
F 10 "R" H 4050 6725 39  0001 L CNN "Spice_Primitive"
F 11 "1 2 1k" H 4050 6650 39  0001 L CNN "Spice_Model"
F 12 "Y" H 4050 6575 39  0001 L CNN "Spice_Netlist_Enabled"
	1    4550 6650
	1    0    0    -1  
$EndComp
$Comp
L Passive_component:Resistor_150_1%_100mW_75V_SMD0603 R10
U 1 1 5F204D1C
P 4850 6650
F 0 "R10" H 4903 6688 39  0000 L CNN
F 1 "Resistor_150_1%_100mW_75V_SMD0603" H 5000 6675 39  0001 L CNN
F 2 "Passive_component:Res_0603" H 5000 6225 39  0001 L CIB
F 3 "" V 4930 6650 50  0001 C CNN
F 4 "150" H 4903 6613 39  0000 L CNN "Resistance"
F 5 "1%" H 5000 6600 39  0001 L CNN "Tolerance"
F 6 "100mW" H 5000 6525 39  0001 L CNN "Power"
F 7 "Farnell" H 5000 6375 39  0001 L CNN "Vendor"
F 8 "2447255" H 5000 6300 39  0001 L CNN "Vendor Part Number"
F 9 "-55°C to 155°C" H 5000 6450 39  0001 L CNN "Temperature"
F 10 "R" H 4350 6725 39  0001 L CNN "Spice_Primitive"
F 11 "1 2 1k" H 4350 6650 39  0001 L CNN "Spice_Model"
F 12 "Y" H 4350 6575 39  0001 L CNN "Spice_Netlist_Enabled"
	1    4850 6650
	1    0    0    -1  
$EndComp
$Comp
L Passive_component:Resistor_150_1%_100mW_75V_SMD0603 R12
U 1 1 5F20924D
P 5900 6700
F 0 "R12" H 5953 6738 39  0000 L CNN
F 1 "Resistor_150_1%_100mW_75V_SMD0603" H 6050 6725 39  0001 L CNN
F 2 "Passive_component:Res_0603" H 6050 6275 39  0001 L CIB
F 3 "" V 5980 6700 50  0001 C CNN
F 4 "150" H 5953 6663 39  0000 L CNN "Resistance"
F 5 "1%" H 6050 6650 39  0001 L CNN "Tolerance"
F 6 "100mW" H 6050 6575 39  0001 L CNN "Power"
F 7 "Farnell" H 6050 6425 39  0001 L CNN "Vendor"
F 8 "2447255" H 6050 6350 39  0001 L CNN "Vendor Part Number"
F 9 "-55°C to 155°C" H 6050 6500 39  0001 L CNN "Temperature"
F 10 "R" H 5400 6775 39  0001 L CNN "Spice_Primitive"
F 11 "1 2 1k" H 5400 6700 39  0001 L CNN "Spice_Model"
F 12 "Y" H 5400 6625 39  0001 L CNN "Spice_Netlist_Enabled"
	1    5900 6700
	1    0    0    -1  
$EndComp
$Comp
L Passive_component:Resistor_150_1%_100mW_75V_SMD0603 R13
U 1 1 5F20925C
P 6200 6700
F 0 "R13" H 6253 6738 39  0000 L CNN
F 1 "Resistor_150_1%_100mW_75V_SMD0603" H 6350 6725 39  0001 L CNN
F 2 "Passive_component:Res_0603" H 6350 6275 39  0001 L CIB
F 3 "" V 6280 6700 50  0001 C CNN
F 4 "150" H 6253 6663 39  0000 L CNN "Resistance"
F 5 "1%" H 6350 6650 39  0001 L CNN "Tolerance"
F 6 "100mW" H 6350 6575 39  0001 L CNN "Power"
F 7 "Farnell" H 6350 6425 39  0001 L CNN "Vendor"
F 8 "2447255" H 6350 6350 39  0001 L CNN "Vendor Part Number"
F 9 "-55°C to 155°C" H 6350 6500 39  0001 L CNN "Temperature"
F 10 "R" H 5700 6775 39  0001 L CNN "Spice_Primitive"
F 11 "1 2 1k" H 5700 6700 39  0001 L CNN "Spice_Model"
F 12 "Y" H 5700 6625 39  0001 L CNN "Spice_Netlist_Enabled"
	1    6200 6700
	1    0    0    -1  
$EndComp
$Comp
L Passive_component:Resistor_150_1%_100mW_75V_SMD0603 R14
U 1 1 5F20926B
P 6500 6700
F 0 "R14" H 6553 6738 39  0000 L CNN
F 1 "Resistor_150_1%_100mW_75V_SMD0603" H 6650 6725 39  0001 L CNN
F 2 "Passive_component:Res_0603" H 6650 6275 39  0001 L CIB
F 3 "" V 6580 6700 50  0001 C CNN
F 4 "150" H 6553 6663 39  0000 L CNN "Resistance"
F 5 "1%" H 6650 6650 39  0001 L CNN "Tolerance"
F 6 "100mW" H 6650 6575 39  0001 L CNN "Power"
F 7 "Farnell" H 6650 6425 39  0001 L CNN "Vendor"
F 8 "2447255" H 6650 6350 39  0001 L CNN "Vendor Part Number"
F 9 "-55°C to 155°C" H 6650 6500 39  0001 L CNN "Temperature"
F 10 "R" H 6000 6775 39  0001 L CNN "Spice_Primitive"
F 11 "1 2 1k" H 6000 6700 39  0001 L CNN "Spice_Model"
F 12 "Y" H 6000 6625 39  0001 L CNN "Spice_Netlist_Enabled"
	1    6500 6700
	1    0    0    -1  
$EndComp
$Comp
L Passive_component:Resistor_150_1%_100mW_75V_SMD0603 R9
U 1 1 5F210B8A
P 4650 1650
F 0 "R9" V 4484 1650 39  0000 C CNN
F 1 "Resistor_150_1%_100mW_75V_SMD0603" H 4800 1675 39  0001 L CNN
F 2 "Passive_component:Res_0603" H 4800 1225 39  0001 L CIB
F 3 "" V 4730 1650 50  0001 C CNN
F 4 "150" V 4559 1650 39  0000 C CNN "Resistance"
F 5 "1%" H 4800 1600 39  0001 L CNN "Tolerance"
F 6 "100mW" H 4800 1525 39  0001 L CNN "Power"
F 7 "Farnell" H 4800 1375 39  0001 L CNN "Vendor"
F 8 "2447255" H 4800 1300 39  0001 L CNN "Vendor Part Number"
F 9 "-55°C to 155°C" H 4800 1450 39  0001 L CNN "Temperature"
F 10 "R" H 4150 1725 39  0001 L CNN "Spice_Primitive"
F 11 "1 2 1k" H 4150 1650 39  0001 L CNN "Spice_Model"
F 12 "Y" H 4150 1575 39  0001 L CNN "Spice_Netlist_Enabled"
	1    4650 1650
	0    1    1    0   
$EndComp
$Comp
L Display:Generic_Seven_segment_4bit_7mm_TH D5
U 1 1 5F1F2272
P 7400 2300
F 0 "D5" H 8278 1950 39  0000 L CNN
F 1 "Generic_Seven_segment_4bit_7mm_TH" H 8350 2450 39  0001 L CNN
F 2 "Display:Seven_segment_4bit_7mm_12pin_TH" H 8350 1250 39  0001 L CIB
F 3 "" H 7000 2300 60  0001 C CNN
F 4 "Seven segment" H 8350 2350 39  0001 L CNN "Type"
F 5 "-" H 8350 2250 39  0001 L CNN "Colour"
F 6 "-" H 8350 2050 39  0001 L CNN "Forward voltage"
F 7 "-" H 8350 1950 39  0001 L CNN "Luminous intensity"
F 8 "-" H 8350 1750 39  0001 L CNN "Maximum current"
F 9 "-" H 8350 1550 39  0001 L CNN "Manufacturer"
F 10 "-" H 8350 1450 39  0001 L CNN "Vendor"
F 11 "-" H 8350 1350 39  0001 L CNN "Vendor Part Number"
F 12 "-" H 8350 1650 39  0001 L CNN "Temperature"
	1    7400 2300
	1    0    0    -1  
$EndComp
$Comp
L Passive_component:Resistor_100R_1%_100mW_75V_SMD0603 R18
U 1 1 5F1FC3BE
P 7000 3350
F 0 "R18" H 7053 3388 39  0000 L CNN
F 1 "Resistor_100R_1%_100mW_75V_SMD0603" H 7150 3375 39  0001 L CNN
F 2 "Passive_component:Res_0603" H 7150 2925 39  0001 L CIB
F 3 "" V 7080 3350 50  0001 C CNN
F 4 "100R" H 7053 3313 39  0000 L CNN "Resistance"
F 5 "1%" H 7150 3300 39  0001 L CNN "Tolerance"
F 6 "100mW" H 7150 3225 39  0001 L CNN "Power"
F 7 "Farnell" H 7150 3075 39  0001 L CNN "Vendor"
F 8 "2861449" H 7150 3000 39  0001 L CNN "Vendor Part Number"
F 9 "-55°C to 155°C" H 7150 3150 39  0001 L CNN "Temperature"
	1    7000 3350
	1    0    0    -1  
$EndComp
$Comp
L Passive_component:Resistor_100R_1%_100mW_75V_SMD0603 R20
U 1 1 5F1FD571
P 7300 3350
F 0 "R20" H 7353 3388 39  0000 L CNN
F 1 "Resistor_100R_1%_100mW_75V_SMD0603" H 7450 3375 39  0001 L CNN
F 2 "Passive_component:Res_0603" H 7450 2925 39  0001 L CIB
F 3 "" V 7380 3350 50  0001 C CNN
F 4 "100R" H 7353 3313 39  0000 L CNN "Resistance"
F 5 "1%" H 7450 3300 39  0001 L CNN "Tolerance"
F 6 "100mW" H 7450 3225 39  0001 L CNN "Power"
F 7 "Farnell" H 7450 3075 39  0001 L CNN "Vendor"
F 8 "2861449" H 7450 3000 39  0001 L CNN "Vendor Part Number"
F 9 "-55°C to 155°C" H 7450 3150 39  0001 L CNN "Temperature"
	1    7300 3350
	1    0    0    -1  
$EndComp
$Comp
L Passive_component:Resistor_100R_1%_100mW_75V_SMD0603 R22
U 1 1 5F1FDB25
P 7600 3350
F 0 "R22" H 7653 3388 39  0000 L CNN
F 1 "Resistor_100R_1%_100mW_75V_SMD0603" H 7750 3375 39  0001 L CNN
F 2 "Passive_component:Res_0603" H 7750 2925 39  0001 L CIB
F 3 "" V 7680 3350 50  0001 C CNN
F 4 "100R" H 7653 3313 39  0000 L CNN "Resistance"
F 5 "1%" H 7750 3300 39  0001 L CNN "Tolerance"
F 6 "100mW" H 7750 3225 39  0001 L CNN "Power"
F 7 "Farnell" H 7750 3075 39  0001 L CNN "Vendor"
F 8 "2861449" H 7750 3000 39  0001 L CNN "Vendor Part Number"
F 9 "-55°C to 155°C" H 7750 3150 39  0001 L CNN "Temperature"
	1    7600 3350
	1    0    0    -1  
$EndComp
$Comp
L Passive_component:Resistor_100R_1%_100mW_75V_SMD0603 R25
U 1 1 5F1FEFF5
P 7900 3350
F 0 "R25" H 7953 3388 39  0000 L CNN
F 1 "Resistor_100R_1%_100mW_75V_SMD0603" H 8050 3375 39  0001 L CNN
F 2 "Passive_component:Res_0603" H 8050 2925 39  0001 L CIB
F 3 "" V 7980 3350 50  0001 C CNN
F 4 "100R" H 7953 3313 39  0000 L CNN "Resistance"
F 5 "1%" H 8050 3300 39  0001 L CNN "Tolerance"
F 6 "100mW" H 8050 3225 39  0001 L CNN "Power"
F 7 "Farnell" H 8050 3075 39  0001 L CNN "Vendor"
F 8 "2861449" H 8050 3000 39  0001 L CNN "Vendor Part Number"
F 9 "-55°C to 155°C" H 8050 3150 39  0001 L CNN "Temperature"
	1    7900 3350
	1    0    0    -1  
$EndComp
$Comp
L Passive_component:Resistor_100R_1%_100mW_75V_SMD0603 R27
U 1 1 5F1FF001
P 8200 3350
F 0 "R27" H 8253 3388 39  0000 L CNN
F 1 "Resistor_100R_1%_100mW_75V_SMD0603" H 8350 3375 39  0001 L CNN
F 2 "Passive_component:Res_0603" H 8350 2925 39  0001 L CIB
F 3 "" V 8280 3350 50  0001 C CNN
F 4 "100R" H 8253 3313 39  0000 L CNN "Resistance"
F 5 "1%" H 8350 3300 39  0001 L CNN "Tolerance"
F 6 "100mW" H 8350 3225 39  0001 L CNN "Power"
F 7 "Farnell" H 8350 3075 39  0001 L CNN "Vendor"
F 8 "2861449" H 8350 3000 39  0001 L CNN "Vendor Part Number"
F 9 "-55°C to 155°C" H 8350 3150 39  0001 L CNN "Temperature"
	1    8200 3350
	1    0    0    -1  
$EndComp
$Comp
L Passive_component:Resistor_100R_1%_100mW_75V_SMD0603 R29
U 1 1 5F1FF00D
P 8500 3350
F 0 "R29" H 8553 3388 39  0000 L CNN
F 1 "Resistor_100R_1%_100mW_75V_SMD0603" H 8650 3375 39  0001 L CNN
F 2 "Passive_component:Res_0603" H 8650 2925 39  0001 L CIB
F 3 "" V 8580 3350 50  0001 C CNN
F 4 "100R" H 8553 3313 39  0000 L CNN "Resistance"
F 5 "1%" H 8650 3300 39  0001 L CNN "Tolerance"
F 6 "100mW" H 8650 3225 39  0001 L CNN "Power"
F 7 "Farnell" H 8650 3075 39  0001 L CNN "Vendor"
F 8 "2861449" H 8650 3000 39  0001 L CNN "Vendor Part Number"
F 9 "-55°C to 155°C" H 8650 3150 39  0001 L CNN "Temperature"
	1    8500 3350
	1    0    0    -1  
$EndComp
$Comp
L Passive_component:Resistor_100R_1%_100mW_75V_SMD0603 R17
U 1 1 5F2045C2
P 7000 1950
F 0 "R17" H 7053 1988 39  0000 L CNN
F 1 "Resistor_100R_1%_100mW_75V_SMD0603" H 7150 1975 39  0001 L CNN
F 2 "Passive_component:Res_0603" H 7150 1525 39  0001 L CIB
F 3 "" V 7080 1950 50  0001 C CNN
F 4 "100R" H 7053 1913 39  0000 L CNN "Resistance"
F 5 "1%" H 7150 1900 39  0001 L CNN "Tolerance"
F 6 "100mW" H 7150 1825 39  0001 L CNN "Power"
F 7 "Farnell" H 7150 1675 39  0001 L CNN "Vendor"
F 8 "2861449" H 7150 1600 39  0001 L CNN "Vendor Part Number"
F 9 "-55°C to 155°C" H 7150 1750 39  0001 L CNN "Temperature"
	1    7000 1950
	1    0    0    -1  
$EndComp
$Comp
L Passive_component:Resistor_100R_1%_100mW_75V_SMD0603 R19
U 1 1 5F2045CE
P 7300 1950
F 0 "R19" H 7353 1988 39  0000 L CNN
F 1 "Resistor_100R_1%_100mW_75V_SMD0603" H 7450 1975 39  0001 L CNN
F 2 "Passive_component:Res_0603" H 7450 1525 39  0001 L CIB
F 3 "" V 7380 1950 50  0001 C CNN
F 4 "100R" H 7353 1913 39  0000 L CNN "Resistance"
F 5 "1%" H 7450 1900 39  0001 L CNN "Tolerance"
F 6 "100mW" H 7450 1825 39  0001 L CNN "Power"
F 7 "Farnell" H 7450 1675 39  0001 L CNN "Vendor"
F 8 "2861449" H 7450 1600 39  0001 L CNN "Vendor Part Number"
F 9 "-55°C to 155°C" H 7450 1750 39  0001 L CNN "Temperature"
	1    7300 1950
	1    0    0    -1  
$EndComp
$Comp
L Passive_component:Resistor_100R_1%_100mW_75V_SMD0603 R21
U 1 1 5F2045DA
P 7600 1950
F 0 "R21" H 7653 1988 39  0000 L CNN
F 1 "Resistor_100R_1%_100mW_75V_SMD0603" H 7750 1975 39  0001 L CNN
F 2 "Passive_component:Res_0603" H 7750 1525 39  0001 L CIB
F 3 "" V 7680 1950 50  0001 C CNN
F 4 "100R" H 7653 1913 39  0000 L CNN "Resistance"
F 5 "1%" H 7750 1900 39  0001 L CNN "Tolerance"
F 6 "100mW" H 7750 1825 39  0001 L CNN "Power"
F 7 "Farnell" H 7750 1675 39  0001 L CNN "Vendor"
F 8 "2861449" H 7750 1600 39  0001 L CNN "Vendor Part Number"
F 9 "-55°C to 155°C" H 7750 1750 39  0001 L CNN "Temperature"
	1    7600 1950
	1    0    0    -1  
$EndComp
$Comp
L Passive_component:Resistor_100R_1%_100mW_75V_SMD0603 R24
U 1 1 5F2045E6
P 7900 1950
F 0 "R24" H 7953 1988 39  0000 L CNN
F 1 "Resistor_100R_1%_100mW_75V_SMD0603" H 8050 1975 39  0001 L CNN
F 2 "Passive_component:Res_0603" H 8050 1525 39  0001 L CIB
F 3 "" V 7980 1950 50  0001 C CNN
F 4 "100R" H 7953 1913 39  0000 L CNN "Resistance"
F 5 "1%" H 8050 1900 39  0001 L CNN "Tolerance"
F 6 "100mW" H 8050 1825 39  0001 L CNN "Power"
F 7 "Farnell" H 8050 1675 39  0001 L CNN "Vendor"
F 8 "2861449" H 8050 1600 39  0001 L CNN "Vendor Part Number"
F 9 "-55°C to 155°C" H 8050 1750 39  0001 L CNN "Temperature"
	1    7900 1950
	1    0    0    -1  
$EndComp
$Comp
L Passive_component:Resistor_100R_1%_100mW_75V_SMD0603 R26
U 1 1 5F2045F2
P 8200 1950
F 0 "R26" H 8253 1988 39  0000 L CNN
F 1 "Resistor_100R_1%_100mW_75V_SMD0603" H 8350 1975 39  0001 L CNN
F 2 "Passive_component:Res_0603" H 8350 1525 39  0001 L CIB
F 3 "" V 8280 1950 50  0001 C CNN
F 4 "100R" H 8253 1913 39  0000 L CNN "Resistance"
F 5 "1%" H 8350 1900 39  0001 L CNN "Tolerance"
F 6 "100mW" H 8350 1825 39  0001 L CNN "Power"
F 7 "Farnell" H 8350 1675 39  0001 L CNN "Vendor"
F 8 "2861449" H 8350 1600 39  0001 L CNN "Vendor Part Number"
F 9 "-55°C to 155°C" H 8350 1750 39  0001 L CNN "Temperature"
	1    8200 1950
	1    0    0    -1  
$EndComp
$Comp
L Passive_component:Resistor_100R_1%_100mW_75V_SMD0603 R28
U 1 1 5F2045FE
P 8500 1950
F 0 "R28" H 8553 1988 39  0000 L CNN
F 1 "Resistor_100R_1%_100mW_75V_SMD0603" H 8650 1975 39  0001 L CNN
F 2 "Passive_component:Res_0603" H 8650 1525 39  0001 L CIB
F 3 "" V 8580 1950 50  0001 C CNN
F 4 "100R" H 8553 1913 39  0000 L CNN "Resistance"
F 5 "1%" H 8650 1900 39  0001 L CNN "Tolerance"
F 6 "100mW" H 8650 1825 39  0001 L CNN "Power"
F 7 "Farnell" H 8650 1675 39  0001 L CNN "Vendor"
F 8 "2861449" H 8650 1600 39  0001 L CNN "Vendor Part Number"
F 9 "-55°C to 155°C" H 8650 1750 39  0001 L CNN "Temperature"
	1    8500 1950
	1    0    0    -1  
$EndComp
Text Label 7000 3950 1    39   ~ 0
DISP_E
Text Label 7300 3950 1    39   ~ 0
DISP_D
Text Label 7600 3950 1    39   ~ 0
DISP_DP
Text Label 7900 3950 1    39   ~ 0
DISP_C
Text Label 8200 3950 1    39   ~ 0
DISP_G
Text Label 8500 3950 1    39   ~ 0
DISP_4
Text Label 8500 1400 3    39   ~ 0
DISP_B
Text Label 8200 1400 3    39   ~ 0
DISP_3
Text Label 7900 1400 3    39   ~ 0
DISP_2
Text Label 7600 1400 3    39   ~ 0
DISP_F
Text Label 7300 1400 3    39   ~ 0
DISP_A
Text Label 7000 1400 3    39   ~ 0
DISP_1
Wire Wire Line
	7550 3000 7550 3050
Wire Wire Line
	7550 3050 7000 3050
Wire Wire Line
	7000 3050 7000 3200
Wire Wire Line
	7300 3200 7300 3100
Wire Wire Line
	7300 3100 7650 3100
Wire Wire Line
	7650 3100 7650 3000
Wire Wire Line
	7600 3200 7600 3150
Wire Wire Line
	7600 3150 7750 3150
Wire Wire Line
	7750 3150 7750 3000
Wire Wire Line
	7850 3000 7850 3100
Wire Wire Line
	7850 3100 7900 3100
Wire Wire Line
	7900 3100 7900 3200
Wire Wire Line
	7950 3000 7950 3100
Wire Wire Line
	7950 3100 8200 3100
Wire Wire Line
	8200 3100 8200 3200
Wire Wire Line
	8050 3000 8050 3050
Wire Wire Line
	8050 3050 8500 3050
Wire Wire Line
	8500 3050 8500 3200
Wire Wire Line
	7000 3950 7000 3500
Wire Wire Line
	7300 3500 7300 3950
Wire Wire Line
	8500 3950 8500 3500
Wire Wire Line
	7600 3500 7600 3950
Wire Wire Line
	8200 3950 8200 3500
Wire Wire Line
	7900 3500 7900 3950
Wire Wire Line
	8050 2300 8050 2250
Wire Wire Line
	8050 2250 8500 2250
Wire Wire Line
	8500 2250 8500 2100
Wire Wire Line
	7000 2100 7000 2250
Wire Wire Line
	7000 2250 7550 2250
Wire Wire Line
	7550 2250 7550 2300
Wire Wire Line
	7950 2300 7950 2200
Wire Wire Line
	7950 2200 8200 2200
Wire Wire Line
	8200 2200 8200 2100
Wire Wire Line
	7300 2100 7300 2200
Wire Wire Line
	7300 2200 7650 2200
Wire Wire Line
	7650 2200 7650 2300
Wire Wire Line
	7850 2200 7900 2200
Wire Wire Line
	7900 2200 7900 2100
Wire Wire Line
	7600 2100 7600 2150
Wire Wire Line
	7600 2150 7750 2150
Wire Wire Line
	7750 2150 7750 2300
Wire Wire Line
	7850 2200 7850 2300
Wire Wire Line
	8500 1800 8500 1400
Wire Wire Line
	7000 1400 7000 1800
Wire Wire Line
	8200 1800 8200 1400
Wire Wire Line
	7300 1400 7300 1800
Wire Wire Line
	7900 1800 7900 1400
Wire Wire Line
	7600 1400 7600 1800
$Comp
L Passive_component:Resistor_150_1%_100mW_75V_SMD0603 R23
U 1 1 5F295E27
P 7600 6550
F 0 "R23" V 7434 6550 39  0000 C CNN
F 1 "Resistor_150_1%_100mW_75V_SMD0603" H 7750 6575 39  0001 L CNN
F 2 "Passive_component:Res_0603" H 7750 6125 39  0001 L CIB
F 3 "" V 7680 6550 50  0001 C CNN
F 4 "150" V 7509 6550 39  0000 C CNN "Resistance"
F 5 "1%" H 7750 6500 39  0001 L CNN "Tolerance"
F 6 "100mW" H 7750 6425 39  0001 L CNN "Power"
F 7 "Farnell" H 7750 6275 39  0001 L CNN "Vendor"
F 8 "2447255" H 7750 6200 39  0001 L CNN "Vendor Part Number"
F 9 "-55°C to 155°C" H 7750 6350 39  0001 L CNN "Temperature"
F 10 "R" H 7100 6625 39  0001 L CNN "Spice_Primitive"
F 11 "1 2 1k" H 7100 6550 39  0001 L CNN "Spice_Model"
F 12 "Y" H 7100 6475 39  0001 L CNN "Spice_Netlist_Enabled"
	1    7600 6550
	0    1    1    0   
$EndComp
$Comp
L Passive_component:Resistor_150_1%_100mW_75V_SMD0603 R30
U 1 1 5F2967FD
P 8950 6550
F 0 "R30" V 8784 6550 39  0000 C CNN
F 1 "Resistor_150_1%_100mW_75V_SMD0603" H 9100 6575 39  0001 L CNN
F 2 "Passive_component:Res_0603" H 9100 6125 39  0001 L CIB
F 3 "" V 9030 6550 50  0001 C CNN
F 4 "150" V 8859 6550 39  0000 C CNN "Resistance"
F 5 "1%" H 9100 6500 39  0001 L CNN "Tolerance"
F 6 "100mW" H 9100 6425 39  0001 L CNN "Power"
F 7 "Farnell" H 9100 6275 39  0001 L CNN "Vendor"
F 8 "2447255" H 9100 6200 39  0001 L CNN "Vendor Part Number"
F 9 "-55°C to 155°C" H 9100 6350 39  0001 L CNN "Temperature"
F 10 "R" H 8450 6625 39  0001 L CNN "Spice_Primitive"
F 11 "1 2 1k" H 8450 6550 39  0001 L CNN "Spice_Model"
F 12 "Y" H 8450 6475 39  0001 L CNN "Spice_Netlist_Enabled"
	1    8950 6550
	0    1    1    0   
$EndComp
$Comp
L Passive_component:Resistor_150_1%_100mW_75V_SMD0603 R31
U 1 1 5F296FAE
P 10300 6550
F 0 "R31" V 10134 6550 39  0000 C CNN
F 1 "Resistor_150_1%_100mW_75V_SMD0603" H 10450 6575 39  0001 L CNN
F 2 "Passive_component:Res_0603" H 10450 6125 39  0001 L CIB
F 3 "" V 10380 6550 50  0001 C CNN
F 4 "150" V 10209 6550 39  0000 C CNN "Resistance"
F 5 "1%" H 10450 6500 39  0001 L CNN "Tolerance"
F 6 "100mW" H 10450 6425 39  0001 L CNN "Power"
F 7 "Farnell" H 10450 6275 39  0001 L CNN "Vendor"
F 8 "2447255" H 10450 6200 39  0001 L CNN "Vendor Part Number"
F 9 "-55°C to 155°C" H 10450 6350 39  0001 L CNN "Temperature"
F 10 "R" H 9800 6625 39  0001 L CNN "Spice_Primitive"
F 11 "1 2 1k" H 9800 6550 39  0001 L CNN "Spice_Model"
F 12 "Y" H 9800 6475 39  0001 L CNN "Spice_Netlist_Enabled"
	1    10300 6550
	0    1    1    0   
$EndComp
Wire Wire Line
	7400 5900 7400 6550
Wire Wire Line
	7400 6550 7450 6550
Wire Wire Line
	8750 5900 8750 6550
Wire Wire Line
	8750 6550 8800 6550
Wire Wire Line
	10100 5900 10100 6550
Wire Wire Line
	10100 6550 10150 6550
Wire Wire Line
	10450 6550 10500 6550
Wire Wire Line
	7750 6550 7800 6550
Wire Wire Line
	9100 6550 9150 6550
Text Label 4850 4100 2    39   ~ 0
RED_CONTROL
Text Label 4850 4200 2    39   ~ 0
GREEN_CONTROL
Wire Wire Line
	4150 4100 4850 4100
Wire Wire Line
	4150 4200 4850 4200
Wire Wire Line
	4150 4300 4850 4300
Text Label 4850 4300 2    39   ~ 0
BLUE_CONTROL
Text Label 2650 4400 0    39   ~ 0
DISP_G
Text Label 8700 4750 2    39   ~ 0
DISP_C
Text Label 8700 4950 2    39   ~ 0
DISP_DP
Text Label 8700 4850 2    39   ~ 0
DISP_D
Text Label 6800 5150 0    39   ~ 0
DISP_E
Text Label 8700 5250 2    39   ~ 0
DISP_1
Text Label 2650 4200 0    39   ~ 0
DISP_A
Text Label 2650 4300 0    39   ~ 0
DISP_F
Text Label 2650 4750 0    39   ~ 0
DISP_2
Text Label 4800 4800 2    39   ~ 0
DISP_3
Text Label 4800 4600 2    39   ~ 0
DISP_B
Wire Wire Line
	4150 4600 4800 4600
$Comp
L MCU:STM8S003K3T6CTR U1
U 2 1 5F189F0B
P 3300 4000
F 0 "U1" H 3725 4141 39  0000 C CNN
F 1 "STM8S003K3T6CTR" H 4650 4050 39  0001 L CNN
F 2 "MCU:LQFP32" H 4650 3350 39  0001 L CIB
F 3 "${SHAPELINEKILIB}/Semiconductors/MCU/Datasheets/STM8S003.pdf" H 1900 3800 60  0001 C CNN
F 4 "STM8S003K3T6CTR" H 3725 4066 39  0000 C CNN "Name"
F 5 "STMicroelectronics" H 4650 3650 39  0001 L CNN "Manufacturer"
F 6 "2.95V to 5.5V" H 4650 3850 39  0001 L CNN "Voltage"
F 7 "-40°C to 85°C" H 4650 3750 39  0001 L CNN "Temperature"
F 8 "16 MHz" H 4650 3950 39  0001 L CNN "Frequency"
F 9 "Farnell" H 4650 3550 39  0001 L CNN "Vendor"
F 10 "2770278" H 4650 3450 39  0001 L CNN "Vendor Part Number"
	2    3300 4000
	1    0    0    -1  
$EndComp
Text Label 4800 4700 2    39   ~ 0
DISP_4
Wire Wire Line
	4150 4700 4800 4700
Wire Wire Line
	4150 4800 4800 4800
Wire Wire Line
	2650 4750 3300 4750
Wire Wire Line
	2650 4400 3300 4400
Wire Wire Line
	2650 4300 3300 4300
Wire Wire Line
	2650 4200 3300 4200
Wire Wire Line
	8150 5250 8700 5250
Wire Wire Line
	8150 4950 8700 4950
Wire Wire Line
	8150 4850 8700 4850
Wire Wire Line
	8150 4750 8700 4750
Wire Wire Line
	6800 5250 7450 5250
Wire Wire Line
	6800 5150 7450 5150
Wire Wire Line
	8150 4550 8700 4550
Text Label 6800 5250 0    39   ~ 0
ROTARY_B
Text Label 8700 4550 2    39   ~ 0
ROTARY_A
NoConn ~ 7450 4650
NoConn ~ 7450 4750
NoConn ~ 7450 4850
NoConn ~ 7450 4950
NoConn ~ 7450 5050
NoConn ~ 4150 4400
NoConn ~ 4150 4500
NoConn ~ 3300 4600
$EndSCHEMATC
