{
	"graph": [{
		"_comment": "for nepal",
		"tags": ["kathmandu", "nepal", "ktm", "raxaul"]
	}, {
		"_comment": "for travel",
		"tags": ["transport", "travel", "fair", "flight", "tour", "trip", "airline"]
	},{
		"_comment": "reservation",
		"tags": ["booking", "ticket"]
	}, {
		"_comment": "for phone",
		"tags": ["mobile", "phone"]
	},{
		"_comment": "for india",
		"tags": ["india", "delhi", "banglore", "mumbai"]
	},{
		"_comment": "electronics computer phone memory",
		"tags": ["RAM", "memory", "GB", "TB", "cache", "MB"]
	}, {
		"_comment": "electronics sound",
		"tags": ["head", "ear", "phone"]
	}, {
		"_comment": "graphics computing",
		"tags": ["graphic", "graphics", "gpu", "processor", "nvidia", "amd", "intel"]
	}, {
		"_comment": "computing processors",
		"tags": ["intel", "amd", "core", "i3", "i5", "i7", "i9", "ryzen"]
	}, {
		"_comment": "gaming",
		"tags": ["gaming", "game", "playstation", "ps", "xbox", "pc", "windows"]
	}, {
		"_comment": "automobiles oil",
		"tags": ["lube", "oil", "lubricant", "spray"]
	}, {
		"_comment": "automobiles bike accessories",
		"tags": ["pad", "guard", "protect", "safe", "accessories"]
	}, {
		"_comment": "bike types",
		"tags": ["offroad", "dirt"]
	}, {
		"_comment": "auto mobile names",
		"tags": ["mahindra", "bolero", "tata", "hexa", "scorpio", "storme", "thar"]
	}, {
		"_comment": "auto mobile jargons",
		"tags": ["wheel", "drive", "4WD", "AWD", "UV", 
			"utility", " vehicle", "SUV", "car", "jeep"
		]
	},{
		"_comment": "musical instrument guitar",
		"tags": ["capo", "wire", "cable", "string", "pick", "guitar", "acoustic"]
	}, {
		"_comment": "action cameras",
		"tags": ["sports", "action", "go", "pro", "sjcam", "camera"]
	}, {
		"_comment": "close places 1",
		"tags": ["salleri", "solukhumbu", "taksindu", "dudhkunda", "numbur", "phaplung"]
	}, {
		"_comment": "close places 2",
		"tags": ["sindhuli", "khurkot", "gadhi"]
	}, {
		"_comment": "close place 3",
		"tags": ["hetauda", "birgunj", "raxaul"]
	}, {
		"_comment": "close place 3",
		"tags": ["kalinchowk", "kuri", "dolakha", "bhimsen", "bhimeshowr", "jiri", "gaurishankar"]
	}, {
		"_comment": "close place 3",
		"tags": ["dolpa", "dunai", "karnali"]
	}, {
		"_comment": "for music",
		"tags": ["music", "musical", "musician", "guitar", "piano", "drum"]
	}, {
		"_comment": "financing",
		"tags": ["finance", "installment", "financing", "downpayment"]
	}, {
		"_comment": "bike things",
		"tags": ["motorcycle", "motorbike"]
	}]
}