{
  "npmScope": "register-demo",
  "affected": {
    "defaultBase": "master"
  },
  "implicitDependencies": {
    "angular.json": "*",
    "package.json": {
      "dependencies": "*",
      "devDependencies": "*"
    },
    "tsconfig.base.json": "*",
    "tslint.json": "*",
    "nx.json": "*"
  },
  "tasksRunnerOptions": {
    "default": {
      "runner": "@nrwl/workspace/tasks-runners/default",
      "options": {
        "cacheableOperations": ["build", "lint", "test", "e2e"]
      }
    }
  },
  "projects": {
    "register-demo": {
      "tags": []
    },
    "register-demo-e2e": {
      "tags": [],
      "implicitDependencies": ["register-demo"]
    },
    "common-services": {
      "tags": []
    }
  }
}
